

{
  "type": "FeatureCollection",
  "features": [
    {
      "type": "Feature",
      "geometry": {
        "type": "Point",
        "coordinates": [
          0.1167386203461,
          52.204710187573
        ]
      },
      "properties": {
        "class": "cma-feature",
        "src": "\/annotate\/markers\/block-g.png",
        "top": "-20px",
        "left": "-20px"
      }
    },
    {
      "type": "Feature",
      "geometry": {
        "type": "Point",
        "coordinates": [
          0.11697465473941,
          52.203776516069
        ]
      },
      "properties": {
        "class": "cma-feature",
        "src": "\/annotate\/markers\/circle-b.png",
        "top": "-20px",
        "left": "-20px"
      }
    },
    {
      "type": "Feature",
      "geometry": {
        "type": "Point",
        "coordinates": [
          0.11806899601748,
          52.204157877222
        ]
      },
      "properties": {
        "class": "cma-feature",
        "src": "\/annotate\/markers\/circle-r.png",
        "top": "-20px",
        "left": "-20px"
      }
    },
    {
      "type": "Feature",
      "geometry": {
        "type": "Polygon",
        "coordinates": [
          [
            0.11557990605166,
            52.201882810017
          ],
          [
            0.11905604893497,
            52.202645551397
          ],
          [
            0.11942082936099,
            52.201619792713
          ],
          [
            0.11731797749331,
            52.201369924832
          ],
          [
            0.11600905949405,
            52.200738673401
          ],
          [
            0.11712485844424,
            52.200607161557
          ],
          [
            0.11568719441226,
            52.199870688042
          ],
          [
            0.11351996952823,
            52.201251565872
          ]
        ]
      },
      "properties": {
        "color": "#c00",
        "stroke-linecap": "round",
        "stroke-linejoin": "round",
        "class": "cma-feature",
        "fill-opacity": 0.5
      }
    },
    {
      "type": "Feature",
      "geometry": {
        "type": "LineString",
        "coordinates": [
          [
            0.12197429234317,
            52.204184095757
          ],
          [
            0.12345487171939,
            52.203145239046
          ],
          [
            0.12536460453799,
            52.203447693506
          ],
          [
            0.12633019978335,
            52.201948551215
          ],
          [
            0.12409860188296,
            52.200962245809
          ],
          [
            0.12577230030826,
            52.199121083815
          ]
        ]
      },
      "properties": {
        "stroke-color": "black",
        "stroke-width": "3px",
        "stroke-linecap": "round",
        "stroke-linejoin": "round",
        "class": "cma-feature",
        "stroke-dasharray": "- "
      }
    },
    {
      "type": "Feature",
      "geometry": {
        "type": "Point",
        "coordinates": [
          0.1227896838837,
          52.202382547457
        ]
      },
      "properties": {
        "class": "cma-feature"
      }
    },
    {
      "type": "Feature",
      "geometry": {
        "type": "Point",
        "coordinates": [
          0.11471623474887,
          52.204450471061
        ]
      },
      "properties": {
        "class": "cma-feature",
        "src": "\/annotate\/markers\/meetingpoint.png",
        "top": "-20px",
        "left": "-20px",
        "img-width": "50px"
      }
    },
    {
      "type": "Feature",
      "geometry": {
        "type": "Point",
        "coordinates": [
          0.1206653743439,
          52.205762188298
        ]
      },
      "properties": {
        "class": "cma-feature"
      }
    },
    {
      "type": "Feature",
      "geometry": {
        "type": "Point",
        "coordinates": [
          0.11306935841372,
          52.2032767965
        ]
      },
      "properties": {
        "class": "cma-feature",
        "src": "\/annotate\/markers\/smiley.png",
        "top": "-20px",
        "left": "-20px",
        "content": "A happy icon!",
        "font-size": "20px",
        "text-align": "center"
      }
    },
    {
      "type": "Feature",
      "geometry": {
        "type": "Point",
        "coordinates": [
          0.11557990605166,
          52.201133198809
        ]
      },
      "properties": {
        "class": "cma-feature"
      }
    }
  ],
  "signature": "UCamGeoJSON MapAnnotator",
  "z": 16,
  "pos": {
    "type": "Point",
    "coordinates": [
      0.11952275330356,
      52.202359533457
    ]
  },
  "id": "YNKQ-N89P-ZMXP"
}

