id,cancelled,lecturer_crsids,start_at,duration_minutes,title,vle_urls,sequence_id,sequence_index,location_id,series_id
11e64fa2-fe9d-4204-8e2a-a3cf48feb5e9,,"abc12,sprq2",2018-11-28T14:38:00Z,1,"Title 1
",https://www.vle.cam.ac.uk/replace-with-real-api/courses/70241,https://somesystem.invalid/sequences/ABC987 ,1,room-1,testing
d90d14b9-4af2-47aa-a3b0-ed8b65491801,,,2018-11-28T18:00:00Z,7,Title 2,https://www.vle.cam.ac.uk/replace-with-real-api/courses/70241,https://somesystem.invalid/sequences/ABC987 ,1,room-1,testing
e0296186-574d-4734-a491-3c2e1444999b,,,2018-11-28T14:05:00Z,1,"Title 3
",https://www.vle.cam.ac.uk/replace-with-real-api/courses/70241,https://somesystem.invalid/sequences/ABC987 ,1,room-1,testing
04a2e477-be3b-493e-b1bf-7164b6b48c91,,,2018-11-28T14:55:00Z,104,"Title 1
",https://www.vle.cam.ac.uk/replace-with-real-api/courses/70241,https://somesystem.invalid/sequences/ABC987 ,1,room-2,testing
3134ab7a-f2a6-406b-92d7-b4ca46401252,,,2018-11-28T14:43:00Z,98,Title 3,https://www.vle.cam.ac.uk/replace-with-real-api/courses/70241,https://somesystem.invalid/sequences/ABC987 ,1,room-2,testing