{
  "type": "message",
  "attachments": [
    {
      "contentType": "application/vnd.microsoft.card.adaptive",
      "contentUrl": null,
      "content": {
        "type": "AdaptiveCard",
        "$schema": "http://adaptivecards.io/schemas/adaptive-card.json",
        "version": "1.2",
        "body": [
          {
            "type": "Container",
            "items": [
              {
                "type": "ColumnSet",
                "columns": [
                  {
                    "type": "Column",
                    "items": [
                      {
                        "type": "Image",
                        "url": "https://avatars.githubusercontent.com/u/2810941?s=200&v=4",
                        "height": "30px"
                      }
                    ],
                    "width": "auto"
                  },
                  {
                    "type": "Column",
                    "items": [
                      {
                        "type": "TextBlock",
                        "text": "[ALERT] Cloud Run Revision - Request Count",
                        "fontType": "Default",
                        "style": "heading"
                      },
                      {
                        "type": "TextBlock",
                        "text": "Request Count for test-project Cloud Run Revision labels {project_id=test-project, service_name=webapp, revision_name=webapp-gmlv5, location=europe-west2, configuration_name=webapp} with metric labels {response_code=200, response_code_class=2xx} is below the threshold of 10.000 with a value of 0.020.",
                        "wrap": true
                      }
                    ],
                    "width": "stretch"
                  }
                ]
              }
            ]
          },
          {
            "type": "Container",
            "items": [
              {
                "type": "TextBlock",
                "text": "Summary",
                "wrap": true,
                "style": "heading"
              }
            ]
          },
          {
            "type": "FactSet",
            "facts": [
              {
                "title": "Start time",
                "value": "25 Aug 2023 at 09:49AM UTC"
              },
              {
                "title": "Project",
                "value": "[test-project](https://console.cloud.google.com/?project=test-project)"
              },
              {
                "title": "Policy",
                "value": "Roy test"
              },
              {
                "title": "Condition",
                "value": "Cloud Run Revision - Request Count"
              },
              {
                "title": "Metric",
                "value": "Request Count"
              }
            ]
          },
          {
            "type": "ActionSet",
            "actions": [
              {
                "type": "Action.OpenUrl",
                "title": "View Incident",
                "url": "https://console.cloud.google.com/monitoring/alerting/incidents/0.n1fal6hvthce?project=test-project",
                "iconUrl": "https://avatars.githubusercontent.com/u/2810941?s=200&v=4"
              }
            ]
          }
        ]
      }
    }
  ]
}
