{
  "incident": {
    "condition": {
      "conditionThreshold": {
        "aggregations": [
          {
            "alignmentPeriod": "300s",
            "perSeriesAligner": "ALIGN_RATE"
          }
        ],
        "comparison": "COMPARISON_LT",
        "duration": "0s",
        "filter": "resource.type = \"cloud_run_revision\" AND metric.type = \"run.googleapis.com/request_count\"",
        "thresholdValue": 10,
        "trigger": {
          "count": 1
        }
      },
      "displayName": "Cloud Run Revision - Request Count",
      "name": "projects/test-project/alertPolicies/12461867137530951931/conditions/12461867137530949804"
    },
    "condition_name": "Cloud Run Revision - Request Count",
    "ended_at": null,
    "incident_id": "0.n1fal6hvthce",
    "metadata": {
      "system_labels": {},
      "user_labels": {}
    },
    "metric": {
      "displayName": "Request Count",
      "labels": {
        "response_code": "200",
        "response_code_class": "2xx"
      },
      "type": "run.googleapis.com/request_count"
    },
    "observed_value": "0.020",
    "policy_name": "Roy test",
    "resource": {
      "labels": {
        "configuration_name": "webapp",
        "location": "europe-west2",
        "project_id": "test-project",
        "revision_name": "webapp-gmlv5",
        "service_name": "webapp"
      },
      "type": "cloud_run_revision"
    },
    "resource_id": "",
    "resource_name": "test-project Cloud Run Revision labels {project_id=test-project, service_name=webapp, revision_name=webapp-gmlv5, location=europe-west2, configuration_name=webapp}",
    "resource_type_display_name": "Cloud Run Revision",
    "scoping_project_id": "test-project",
    "scoping_project_number": 527305638652,
    "started_at": 1692956948,
    "state": "open",
    "summary": "Request Count for test-project Cloud Run Revision labels {project_id=test-project, service_name=webapp, revision_name=webapp-gmlv5, location=europe-west2, configuration_name=webapp} with metric labels {response_code=200, response_code_class=2xx} is below the threshold of 10.000 with a value of 0.020.",
    "threshold_value": "10",
    "url": "https://console.cloud.google.com/monitoring/alerting/incidents/0.n1fal6hvthce?project=test-project"
  },
  "version": "1.2"
}
