{
  "type": "message",
  "attachments": [
    {
      "contentType": "application/vnd.microsoft.card.adaptive",
      "contentUrl": null,
      "content": {
        "type": "AdaptiveCard",
        "$schema": "http://adaptivecards.io/schemas/adaptive-card.json",
        "version": "1.2",
        "body": [
          {
            "type": "Container",
            "items": [
              {
                "type": "ColumnSet",
                "columns": [
                  {
                    "type": "Column",
                    "items": [
                      {
                        "type": "Image",
                        "url": "https://avatars.githubusercontent.com/u/2810941?s=200&v=4",
                        "height": "30px"
                      }
                    ],
                    "width": "auto"
                  },
                  {
                    "type": "Column",
                    "items": [
                      {
                        "type": "TextBlock",
                        "text": "[Cluster Notification] UpgradeAvailableEvent",
                        "fontType": "Default",
                        "style": "heading"
                      },
                      {
                        "type": "TextBlock",
                        "text": "New node version \"1.17.15-gke.800\" is available for upgrade in the REGULAR channel.",
                        "wrap": true
                      }
                    ],
                    "width": "stretch"
                  }
                ]
              }
            ]
          },
          {
            "type": "Container",
            "items": [
              {
                "type": "TextBlock",
                "text": "Summary",
                "wrap": true,
                "style": "heading"
              }
            ]
          },
          {
            "type": "FactSet",
            "facts": [
              {
                "title": "Project Name",
                "value": "[Name - development](https://console.cloud.google.com/?project=123456789012)"
              },
              {
                "title": "Project Number",
                "value": "[123456789012](https://console.cloud.google.com/?project=123456789012)"
              },
              {
                "title": "Project ID",
                "value": "[blah-devel-72a2b0bc](https://console.cloud.google.com/?project=123456789012)"
              },
              {
                "title": "Cluster location",
                "value": "europe-west2"
              },
              {
                "title": "Cluster name",
                "value": "[cluster](https://console.cloud.google.com/kubernetes/clusters/details/europe-west2/cluster/details?project=123456789012)"
              },
              {
                "title": "Resource Type",
                "value": "MASTER"
              },
              {
                "title": "Available Version",
                "value": "1.17.15-gke.800"
              },
              {
                "title": "Release Channel",
                "value": "RAPID"
              }
            ]
          },
          {
            "type": "ActionSet",
            "actions": []
          }
        ]
      }
    }
  ]
}
