{"files": [{"id": "f3",
            "mimeType": "application/vnd.google-apps.folder",
            "permissions": [{"emailAddress": "mk2155@gdev.apps.cam.ac.uk",
                             "id": "p2",
                             "role": "owner",
                             "type": "user"}],
            "shared": false},
           {"id": "f5",
            "mimeType": "application/vnd.google-apps.folder",
            "permissions": [{"allowFileDiscovery": false,
                             "domain": "gdev.apps.cam.ac.uk",
                             "id": "p1",
                             "role": "reader",
                             "type": "domain"},
                            {"emailAddress": "mk2155@gdev.apps.cam.ac.uk",
                             "id": "p2",
                             "role": "owner",
                             "type": "user"}],
            "shared": true}]
}
