{"users": [{"id": "1",
            "isAdmin": false,
            "lastLoginTime": "1970-01-01T00:00:00.000Z",
            "name": {"familyName": "Frog", "givenName": "Amy"},
            "orgUnitPath": "/",
            "primaryEmail": "af123@gdev.apps.cam.ac.uk",
            "customSchemas": {"UCam": {"mydrive-shared-action": "recover",
                                       "mydrive-shared-result": "permissions-removed",
                                       "mydrive-shared-filecount": 2,
                                       "mydrive-shared-doc": "test-shared-document-name.yaml"
            }},
            "suspended": true},
           {"id": "2",
            "isAdmin": false,
            "lastLoginTime": "1970-01-01T00:00:00.000Z",
            "name": {"familyName": "Toad", "givenName": "Barry"},
            "orgUnitPath": "/",
            "primaryEmail": "bt234@gdev.apps.cam.ac.uk",
            "customSchemas": {"UCam": {"mydrive-shared-action": "scan-files",
                                       "mydrive-shared-result": "",
                                       "mydrive-shared-filecount": 0,
                                       "mydrive-shared-doc": ""
            }},
            "suspended": true},
           {"id": "3",
            "isAdmin": false,
            "lastLoginTime": "2022-10-20T12:40:25.000Z",
            "name": {"familyName": "Newt", "givenName": "Carrie"},
            "orgUnitPath": "/",
            "primaryEmail": "cn345@gdev.apps.cam.ac.uk",
            "customSchemas": {"UCam": {"mydrive-shared-action": "scan-files",
                                       "mydrive-shared-result": "",
                                       "mydrive-shared-filecount": 0,
                                       "mydrive-shared-doc": ""
            }},
            "suspended": true},
           {"id": "4",
            "isAdmin": false,
            "lastLoginTime": "1970-01-01T00:00:00.000Z",
            "name": {"familyName": "Salamander", "givenName": "Dave"},
            "orgUnitPath": "/",
            "primaryEmail": "ds456@gdev.apps.cam.ac.uk",
            "customSchemas": {"UCam": {"mydrive-shared-action": "recover",
                                       "mydrive-shared-result": "permissions-none",
                                       "mydrive-shared-filecount": 0,
                                       "mydrive-shared-doc": ""

            }},
            "suspended": true},
           {"id": "5",
            "isAdmin": false,
            "lastLoginTime": "1970-01-01T00:00:00.000Z",
            "name": {"familyName": "Axolotl", "givenName": "Edie"},
            "orgUnitPath": "/",
            "primaryEmail": "not-a-crsid@gdev.apps.cam.ac.uk",
            "customSchemas": {"UCam": {"mydrive-shared-action": "scan-files"}},
            "suspended": true},
           {"id": "6",
            "isAdmin": false,
            "lastLoginTime": "1970-01-01T00:00:00.000Z",
            "name": {"familyName": "Caecilian", "givenName": "Frederick"},
            "orgUnitPath": "/",
            "primaryEmail": "fc567@gdev.apps.cam.ac.uk",
            "customSchemas": {"UCam": {"mydrive-shared-action": "recover"}},
            "suspended": true}]
}
