[
  {
    "booking": {
      "BatchId": -1,
      "BookedBy": {
      },
      "Description": "Unused Description",
      "EndTime": "2021-05-20T15:00:00Z",
      "ExpectedAttendees": 10,
      "OptimeIndex": 1013,
      "Room": {
        "Id": "B002-00-0001"
      },
      "RoomId": 3,
      "BuildingId": 2,
      "StartTime": "2021-05-20T14:00:00Z",
      "Status": "Approved",
      "Title": "Booking missing BookedBy.Id",
      "Type": "Teaching"
    }
  }
]
