[
    {
        "n": "Building One",
        "code": "B001",
        "cn": "Main Site"
    },{
        "n": "Building Two",
        "code": "B002",
        "cn": "Main Site"
    },{
        "n": "Secondary Building",
        "code": "B201",
        "cn": "Second Site"
    },{
        "Description": "Unused Building",
        "code": "U001",
        "cn": "Unusued Site"
    }
]
