[
  {
    "OptimeIndex": 1,
    "Id": "1001",
    "Description": "Department A"
  },{
    "OptimeIndex": 2,
    "Id": "1002",
    "Description": "Department B"
  },{
    "OptimeIndex": 3,
    "Id": "1003",
    "Description": "Unused Department X"
  }
]
