{
    "optionalFeatures": {
        "asyncronousSoftwareUpdate": true,
        "attemptToFetchMajorUpgrade": true,
        "enforceMinorUpdates": true
    },
    "osVersionRequirements": [
        {
            "aboutUpdateURL_disabled": "https://support.apple.com/en-us/HT211896#macos1121",
            "aboutUpdateURLs": [
                {
                    "_language": "en",
                    "aboutUpdateURL": "https://support.apple.com/en-us/HT211896#macos1121"
                }
            ],
            "majorUpgradeAppPath": "/Applications/Install macOS Big Sur.app",
            "requiredInstallationDate": "2021-09-01T00:00:00Z",
            "requiredMinimumOSVersion": "11.5.2",
            "targetedOSVersions": [
                "11.0",
                "11.0.1",
                "11.1",
                "11.2",
                "11.2.1",
                "11.2.2",
                "11.2.3",
                "11.3",
                "11.3.1",
                "11.4",
                "11.5",
                "11.5.1"
            ]
        }
    ],
    "userExperience": {
        "allowedDeferrals": 1000000,
        "allowedDeferralsUntilForcedSecondaryQuitButton": 14,
        "approachingRefreshCycle": 6000,
        "approachingWindowTime": 72,
        "elapsedRefreshCycle": 300,
        "imminentRefreshCycle": 600,
        "imminentWindowTime": 24,
        "initialRefreshCycle": 18000,
        "maxRandomDelayInSeconds": 1200,
        "noTimers": false,
        "nudgeRefreshCycle": 60,
        "randomDelay": false
    },
    "userInterface": {
        "fallbackLanguage": "en",
        "forceFallbackLanguage": false,
        "forceScreenShotIcon": false,
        "iconDarkPath": "/usr/local/uis/branding/nudge/logoDark.png",
        "iconLightPath": "/usr/local/uis/branding/nudge/logoLight.png",
        "screenShotDarkPath": "/usr/local/uis/branding/nudge/screenShotDark.png",
        "screenShotLightPath": "/usr/local/uis/branding/nudge/screenShotLight.png",
        "simpleMode": false,
        "singleQuitButton": false,
        "updateElements": [
            {
                "_language": "en",
                "actionButtonText": "Update Device",
                "informationButtonText": "More Info",
                "mainContentHeader": "Your device will restart during this update",
                "mainContentNote": "Important Notes",
                "mainContentSubHeader": "Updates can take around 30 minutes to complete",
                "mainContentText": "An up to date device ensures that your computer is as secure as possible.\n\nTo begin the update, simply click on the Update Device button and follow the provided steps.\n\nPlease contact UIS Service Desk (service-desk@uis.cam.ac.uk) if you have any questions.",
                "mainHeader": "Your device requires a security update",
                "primaryQuitButtonText": "Later",
                "secondaryQuitButtonText": "I understand",
                "subHeader": "A friendly reminder from your local IT team"
            }
        ]
    }
}