{
  "optionalFeatures": {
    "acceptableCameraUsage": true,
    "asynchronousSoftwareUpdate": false,
    "attemptToBlockApplicationLaunches": false,
    "attemptToFetchMajorUpgrade": true,
    "enforceMinorUpdates": true
  },
  "osVersionRequirements": [
	{
      "aboutUpdateURL": "https://help.uis.cam.ac.uk/service/desktop-services/umd/getting-started-macos/keep-your-macos-software-updated-university",
      "majorUpgradeAppPath": "/System/Library/CoreServices/Software Update.app",
      "requiredInstallationDate": "2023-06-27T00:00:00Z",
      "requiredMinimumOSVersion": "12.6.5",
      "targetedOSVersionsRule": "12"
	}
  ],
  "userExperience": {
    "allowGracePeriods": false,
    "allowLaterDeferralButton": false,
    "allowUserQuitDeferrals": true,
    "allowedDeferrals": 5,
    "approachingWindowTime": 72,
    "imminentWindowTime": 24,
    "nudgeRefreshCycle": 60,
    "randomDelay": false
  },
  "userInterface": {
    "fallbackLanguage": "en",
    "showDeferralCount": true,
    "simpleMode": false,
    "singleQuitButton": false,
    "iconLightPath": "/Library/Application Support/UMDSupport/Nudge/UoC_logo.png",
    "iconDarkPath": "/Library/Application Support/UMDSupport/Nudge/UoC_logoDark.png",
    "screenShotLightPath": "/Library/Application Support/UMDSupport/Nudge/lightOS12Update1.png",
    "screenShotDarkPath": "/Library/Application Support/UMDSupport/Nudge/lightOS12Update1.png",
    "updateElements": [
      {
        "_language": "en",
        "actionButtonText": "Update Device",
        "customDeferralButtonText": "Custom",
        "customDeferralDropdownText": "Defer",
        "informationButtonText": "Information",
        "mainContentHeader": "Your device will restart during this update",
        "mainContentNote": "To keep your device protected it is necessary to keep it up-to-date",
        "mainContentSubHeader": "Updates can take up to 30 minutes to complete\n\nUpgrades can take up to 60 minutes to complete",
        "mainContentText": "To update macOS Monterey click Update Device and from the box that appears click on More Info… (as in the image below) then click Install Now.\n\nTo upgrade to macOS Ventura click on Update Device and then choose Upgrade Now.\n\nIf you are unable to perform this update now click Defer and choose the appropriate option. The Defer option will no longer be available once the deadline for installing this update has passed (01/07/2023)",
        "mainHeader": "Your device requires a security update",
        "oneDayDeferralButtonText": "One Day",
        "oneHourDeferralButtonText": "One Hour",
        "primaryQuitButtonText": "Later",
        "secondaryQuitButtonText": "I understand",
        "subHeader": "Please read and follow the instructions below"
	}
	]
  }
}
