%!PS-Adobe-3.0 EPSF-3.0
%%Creator: (MATLAB, The Mathworks, Inc. Version 9.10.0.1602886 \(R2021a\). Operating System: Windows 10)
%%Title: (C:/Users/christian.schwall/OneDrive - University Of Cambridge/SigV_paper_publish/EV3/Figure/MSB-20-9832_Figure_EV3.eps)
%%CreationDate: 2021-04-15T18:24:29
%%Pages: (atend)
%%BoundingBox:    21     6   498   156
%%LanguageLevel: 2
%%EndComments
%%BeginProlog
%%BeginResource: procset (Apache XML Graphics Std ProcSet) 1.2 0
%%Version: 1.2 0
%%Copyright: (Copyright 2001-2003,2010 The Apache Software Foundation. License terms: http://www.apache.org/licenses/LICENSE-2.0)
/bd{bind def}bind def
/ld{load def}bd
/GR/grestore ld
/GS/gsave ld
/RM/rmoveto ld
/C/curveto ld
/t/show ld
/L/lineto ld
/ML/setmiterlimit ld
/CT/concat ld
/f/fill ld
/N/newpath ld
/S/stroke ld
/CC/setcmykcolor ld
/A/ashow ld
/cp/closepath ld
/RC/setrgbcolor ld
/LJ/setlinejoin ld
/GC/setgray ld
/LW/setlinewidth ld
/M/moveto ld
/re {4 2 roll M
1 index 0 rlineto
0 exch rlineto
neg 0 rlineto
cp } bd
/_ctm matrix def
/_tm matrix def
/BT { _ctm currentmatrix pop matrix _tm copy pop 0 0 moveto } bd
/ET { _ctm setmatrix } bd
/iTm { _ctm setmatrix _tm concat } bd
/Tm { _tm astore pop iTm 0 0 moveto } bd
/ux 0.0 def
/uy 0.0 def
/F {
  /Tp exch def
  /Tf exch def
  Tf findfont Tp scalefont setfont
  /cf Tf def  /cs Tp def
} bd
/ULS {currentpoint /uy exch def /ux exch def} bd
/ULE {
  /Tcx currentpoint pop def
  gsave
  newpath
  cf findfont cs scalefont dup
  /FontMatrix get 0 get /Ts exch def /FontInfo get dup
  /UnderlinePosition get Ts mul /To exch def
  /UnderlineThickness get Ts mul /Tt exch def
  ux uy To add moveto  Tcx uy To add lineto
  Tt setlinewidth stroke
  grestore
} bd
/OLE {
  /Tcx currentpoint pop def
  gsave
  newpath
  cf findfont cs scalefont dup
  /FontMatrix get 0 get /Ts exch def /FontInfo get dup
  /UnderlinePosition get Ts mul /To exch def
  /UnderlineThickness get Ts mul /Tt exch def
  ux uy To add cs add moveto Tcx uy To add cs add lineto
  Tt setlinewidth stroke
  grestore
} bd
/SOE {
  /Tcx currentpoint pop def
  gsave
  newpath
  cf findfont cs scalefont dup
  /FontMatrix get 0 get /Ts exch def /FontInfo get dup
  /UnderlinePosition get Ts mul /To exch def
  /UnderlineThickness get Ts mul /Tt exch def
  ux uy To add cs 10 mul 26 idiv add moveto Tcx uy To add cs 10 mul 26 idiv add lineto
  Tt setlinewidth stroke
  grestore
} bd
/QT {
/Y22 exch store
/X22 exch store
/Y21 exch store
/X21 exch store
currentpoint
/Y21 load 2 mul add 3 div exch
/X21 load 2 mul add 3 div exch
/X21 load 2 mul /X22 load add 3 div
/Y21 load 2 mul /Y22 load add 3 div
/X22 load /Y22 load curveto
} bd
/SSPD {
dup length /d exch dict def
{
/v exch def
/k exch def
currentpagedevice k known {
/cpdv currentpagedevice k get def
v cpdv ne {
/upd false def
/nullv v type /nulltype eq def
/nullcpdv cpdv type /nulltype eq def
nullv nullcpdv or
{
/upd true def
} {
/sametype v type cpdv type eq def
sametype {
v type /arraytype eq {
/vlen v length def
/cpdvlen cpdv length def
vlen cpdvlen eq {
0 1 vlen 1 sub {
/i exch def
/obj v i get def
/cpdobj cpdv i get def
obj cpdobj ne {
/upd true def
exit
} if
} for
} {
/upd true def
} ifelse
} {
v type /dicttype eq {
v {
/dv exch def
/dk exch def
/cpddv cpdv dk get def
dv cpddv ne {
/upd true def
exit
} if
} forall
} {
/upd true def
} ifelse
} ifelse
} if
} ifelse
upd true eq {
d k v put
} if
} if
} if
} forall
d length 0 gt {
d setpagedevice
} if
} bd
/RE { % /NewFontName [NewEncodingArray] /FontName RE -
  findfont dup length dict begin
  {
    1 index /FID ne
    {def} {pop pop} ifelse
  } forall
  /Encoding exch def
  /FontName 1 index def
  currentdict definefont pop
  end
} bind def
%%EndResource
%%BeginResource: procset (Apache XML Graphics EPS ProcSet) 1.0 0
%%Version: 1.0 0
%%Copyright: (Copyright 2002-2003 The Apache Software Foundation. License terms: http://www.apache.org/licenses/LICENSE-2.0)
/BeginEPSF { %def
/b4_Inc_state save def         % Save state for cleanup
/dict_count countdictstack def % Count objects on dict stack
/op_count count 1 sub def      % Count objects on operand stack
userdict begin                 % Push userdict on dict stack
/showpage { } def              % Redefine showpage, { } = null proc
0 setgray 0 setlinecap         % Prepare graphics state
1 setlinewidth 0 setlinejoin
10 setmiterlimit [ ] 0 setdash newpath
/languagelevel where           % If level not equal to 1 then
{pop languagelevel             % set strokeadjust and
1 ne                           % overprint to their defaults.
{false setstrokeadjust false setoverprint
} if
} if
} bd
/EndEPSF { %def
count op_count sub {pop} repeat            % Clean up stacks
countdictstack dict_count sub {end} repeat
b4_Inc_state restore
} bd
%%EndResource
%FOPBeginFontDict
%%IncludeResource: font Courier-Oblique
%%IncludeResource: font Courier-BoldOblique
%%IncludeResource: font Courier-Bold
%%IncludeResource: font ZapfDingbats
%%IncludeResource: font Symbol
%%IncludeResource: font Helvetica
%%IncludeResource: font Helvetica-Oblique
%%IncludeResource: font Helvetica-Bold
%%IncludeResource: font Helvetica-BoldOblique
%%IncludeResource: font Times-Roman
%%IncludeResource: font Times-Italic
%%IncludeResource: font Times-Bold
%%IncludeResource: font Times-BoldItalic
%%IncludeResource: font Courier
%FOPEndFontDict
%%BeginResource: encoding WinAnsiEncoding
/WinAnsiEncoding [
/.notdef /.notdef /.notdef /.notdef /.notdef
/.notdef /.notdef /.notdef /.notdef /.notdef
/.notdef /.notdef /.notdef /.notdef /.notdef
/.notdef /.notdef /.notdef /.notdef /.notdef
/.notdef /.notdef /.notdef /.notdef /.notdef
/.notdef /.notdef /.notdef /.notdef /.notdef
/.notdef /.notdef /space /exclam /quotedbl
/numbersign /dollar /percent /ampersand /quotesingle
/parenleft /parenright /asterisk /plus /comma
/hyphen /period /slash /zero /one
/two /three /four /five /six
/seven /eight /nine /colon /semicolon
/less /equal /greater /question /at
/A /B /C /D /E
/F /G /H /I /J
/K /L /M /N /O
/P /Q /R /S /T
/U /V /W /X /Y
/Z /bracketleft /backslash /bracketright /asciicircum
/underscore /quoteleft /a /b /c
/d /e /f /g /h
/i /j /k /l /m
/n /o /p /q /r
/s /t /u /v /w
/x /y /z /braceleft /bar
/braceright /asciitilde /bullet /Euro /bullet
/quotesinglbase /florin /quotedblbase /ellipsis /dagger
/daggerdbl /circumflex /perthousand /Scaron /guilsinglleft
/OE /bullet /Zcaron /bullet /bullet
/quoteleft /quoteright /quotedblleft /quotedblright /bullet
/endash /emdash /asciitilde /trademark /scaron
/guilsinglright /oe /bullet /zcaron /Ydieresis
/space /exclamdown /cent /sterling /currency
/yen /brokenbar /section /dieresis /copyright
/ordfeminine /guillemotleft /logicalnot /sfthyphen /registered
/macron /degree /plusminus /twosuperior /threesuperior
/acute /mu /paragraph /middot /cedilla
/onesuperior /ordmasculine /guillemotright /onequarter /onehalf
/threequarters /questiondown /Agrave /Aacute /Acircumflex
/Atilde /Adieresis /Aring /AE /Ccedilla
/Egrave /Eacute /Ecircumflex /Edieresis /Igrave
/Iacute /Icircumflex /Idieresis /Eth /Ntilde
/Ograve /Oacute /Ocircumflex /Otilde /Odieresis
/multiply /Oslash /Ugrave /Uacute /Ucircumflex
/Udieresis /Yacute /Thorn /germandbls /agrave
/aacute /acircumflex /atilde /adieresis /aring
/ae /ccedilla /egrave /eacute /ecircumflex
/edieresis /igrave /iacute /icircumflex /idieresis
/eth /ntilde /ograve /oacute /ocircumflex
/otilde /odieresis /divide /oslash /ugrave
/uacute /ucircumflex /udieresis /yacute /thorn
/ydieresis
] def
%%EndResource
%FOPBeginFontReencode
/Courier-Oblique findfont
dup length dict begin
  {1 index /FID ne {def} {pop pop} ifelse} forall
  /Encoding WinAnsiEncoding def
  currentdict
end
/Courier-Oblique exch definefont pop
/Courier-BoldOblique findfont
dup length dict begin
  {1 index /FID ne {def} {pop pop} ifelse} forall
  /Encoding WinAnsiEncoding def
  currentdict
end
/Courier-BoldOblique exch definefont pop
/Courier-Bold findfont
dup length dict begin
  {1 index /FID ne {def} {pop pop} ifelse} forall
  /Encoding WinAnsiEncoding def
  currentdict
end
/Courier-Bold exch definefont pop
/Helvetica findfont
dup length dict begin
  {1 index /FID ne {def} {pop pop} ifelse} forall
  /Encoding WinAnsiEncoding def
  currentdict
end
/Helvetica exch definefont pop
/Helvetica-Oblique findfont
dup length dict begin
  {1 index /FID ne {def} {pop pop} ifelse} forall
  /Encoding WinAnsiEncoding def
  currentdict
end
/Helvetica-Oblique exch definefont pop
/Helvetica-Bold findfont
dup length dict begin
  {1 index /FID ne {def} {pop pop} ifelse} forall
  /Encoding WinAnsiEncoding def
  currentdict
end
/Helvetica-Bold exch definefont pop
/Helvetica-BoldOblique findfont
dup length dict begin
  {1 index /FID ne {def} {pop pop} ifelse} forall
  /Encoding WinAnsiEncoding def
  currentdict
end
/Helvetica-BoldOblique exch definefont pop
/Times-Roman findfont
dup length dict begin
  {1 index /FID ne {def} {pop pop} ifelse} forall
  /Encoding WinAnsiEncoding def
  currentdict
end
/Times-Roman exch definefont pop
/Times-Italic findfont
dup length dict begin
  {1 index /FID ne {def} {pop pop} ifelse} forall
  /Encoding WinAnsiEncoding def
  currentdict
end
/Times-Italic exch definefont pop
/Times-Bold findfont
dup length dict begin
  {1 index /FID ne {def} {pop pop} ifelse} forall
  /Encoding WinAnsiEncoding def
  currentdict
end
/Times-Bold exch definefont pop
/Times-BoldItalic findfont
dup length dict begin
  {1 index /FID ne {def} {pop pop} ifelse} forall
  /Encoding WinAnsiEncoding def
  currentdict
end
/Times-BoldItalic exch definefont pop
/Courier findfont
dup length dict begin
  {1 index /FID ne {def} {pop pop} ifelse} forall
  /Encoding WinAnsiEncoding def
  currentdict
end
/Courier exch definefont pop
%FOPEndFontReencode
%%EndProlog
%%Page: 1 1
%%PageBoundingBox: 0 0 510 156
%%BeginPageSetup
[1 0 0 -1 0 156] CT
%%EndPageSetup
GS
[0.75035 0 0 0.74955 0 0.0945] CT
1 GC
N
0 0 680 208 re
f
GR
GS
[0.75035 0 0 0.74955 0 0.0945] CT
1 GC
N
0 0 680 208 re
f
GR
GS
[0.75035 0 0 0.74955 0 0.0945] CT
1 GC
N
273 177 M
444 177 L
444 5 L
273 5 L
cp
f
GR
GS
[0.75035 0 0 0.74955 0 0.0945] CT
2 setlinecap
1 LJ
0.667 LW
N
273 177 M
444 177 L
S
GR
GS
[0.75035 0 0 0.74955 0 0.0945] CT
2 setlinecap
1 LJ
0.667 LW
N
273 177 M
273 175.28 L
S
GR
GS
[0.75035 0 0 0.74955 0 0.0945] CT
2 setlinecap
1 LJ
0.667 LW
N
358.5 177 M
358.5 175.28 L
S
GR
GS
[0.75035 0 0 0.74955 0 0.0945] CT
2 setlinecap
1 LJ
0.667 LW
N
444 177 M
444 175.28 L
S
GR
GS
[0.75035 0 0 0.74955 0 0.0945] CT
2 setlinecap
1 LJ
0.667 LW
N
273 177 M
273 5 L
S
GR
GS
[0.75035 0 0 0.74955 0 0.0945] CT
2 setlinecap
1 LJ
0.667 LW
N
273 177 M
274.72 177 L
S
GR
GS
[0.75035 0 0 0.74955 0 0.0945] CT
2 setlinecap
1 LJ
0.667 LW
N
273 142.6 M
274.72 142.6 L
S
GR
GS
[0.75035 0 0 0.74955 0 0.0945] CT
2 setlinecap
1 LJ
0.667 LW
N
273 108.2 M
274.72 108.2 L
S
GR
GS
[0.75035 0 0 0.74955 0 0.0945] CT
2 setlinecap
1 LJ
0.667 LW
N
273 73.8 M
274.72 73.8 L
S
GR
GS
[0.75035 0 0 0.74955 0 0.0945] CT
2 setlinecap
1 LJ
0.667 LW
N
273 39.4 M
274.72 39.4 L
S
GR
GS
[0.75035 0 0 0.74955 0 0.0945] CT
2 setlinecap
1 LJ
0.667 LW
N
273 5 M
274.72 5 L
S
GR
GS
[0.75035 0 0 0.74955 0 0.0945] CT
1 GC
N
492 177 M
663 177 L
663 5 L
492 5 L
cp
f
GR
GS
[0.75035 0 0 0.74955 0 0.0945] CT
2 setlinecap
1 LJ
0.667 LW
N
492 177 M
663 177 L
S
GR
GS
[0.75035 0 0 0.74955 0 0.0945] CT
2 setlinecap
1 LJ
0.667 LW
N
492 177 M
492 175.28 L
S
GR
GS
[0.75035 0 0 0.74955 0 0.0945] CT
2 setlinecap
1 LJ
0.667 LW
N
577.5 177 M
577.5 175.28 L
S
GR
GS
[0.75035 0 0 0.74955 0 0.0945] CT
2 setlinecap
1 LJ
0.667 LW
N
663 177 M
663 175.28 L
S
GR
GS
[0.75035 0 0 0.74955 0 0.0945] CT
2 setlinecap
1 LJ
0.667 LW
N
492 177 M
492 5 L
S
GR
GS
[0.75035 0 0 0.74955 0 0.0945] CT
2 setlinecap
1 LJ
0.667 LW
N
492 177 M
493.72 177 L
S
GR
GS
[0.75035 0 0 0.74955 0 0.0945] CT
2 setlinecap
1 LJ
0.667 LW
N
492 142.6 M
493.72 142.6 L
S
GR
GS
[0.75035 0 0 0.74955 0 0.0945] CT
2 setlinecap
1 LJ
0.667 LW
N
492 108.2 M
493.72 108.2 L
S
GR
GS
[0.75035 0 0 0.74955 0 0.0945] CT
2 setlinecap
1 LJ
0.667 LW
N
492 73.8 M
493.72 73.8 L
S
GR
GS
[0.75035 0 0 0.74955 0 0.0945] CT
2 setlinecap
1 LJ
0.667 LW
N
492 39.4 M
493.72 39.4 L
S
GR
GS
[0.75035 0 0 0.74955 0 0.0945] CT
2 setlinecap
1 LJ
0.667 LW
N
492 5 M
493.72 5 L
S
GR
GS
[0.75035 0 0 0.74955 0 0.0945] CT
1 GC
N
71 163 M
226 163 L
226 5 L
71 5 L
cp
f
GR
GS
[0.75035 0 0 0.74955 0 0.0945] CT
2 setlinecap
1 LJ
2.667 LW
N
71 163 M
226 163 L
S
GR
GS
[0.75035 0 0 0.74955 0 0.0945] CT
2 setlinecap
1 LJ
2.667 LW
N
71 5 M
226 5 L
S
GR
GS
[0.75035 0 0 0.74955 0 0.0945] CT
2 setlinecap
1 LJ
2.667 LW
N
94.846 163 M
94.846 161.42 L
S
GR
GS
[0.75035 0 0 0.74955 0 0.0945] CT
2 setlinecap
1 LJ
2.667 LW
N
130.615 163 M
130.615 161.42 L
S
GR
GS
[0.75035 0 0 0.74955 0 0.0945] CT
2 setlinecap
1 LJ
2.667 LW
N
166.385 163 M
166.385 161.42 L
S
GR
GS
[0.75035 0 0 0.74955 0 0.0945] CT
2 setlinecap
1 LJ
2.667 LW
N
202.154 163 M
202.154 161.42 L
S
GR
GS
[0.75035 0 0 0.74955 0 0.0945] CT
2 setlinecap
1 LJ
2.667 LW
N
94.846 5 M
94.846 6.58 L
S
GR
GS
[0.75035 0 0 0.74955 0 0.0945] CT
2 setlinecap
1 LJ
2.667 LW
N
130.615 5 M
130.615 6.58 L
S
GR
GS
[0.75035 0 0 0.74955 0 0.0945] CT
2 setlinecap
1 LJ
2.667 LW
N
166.385 5 M
166.385 6.58 L
S
GR
GS
[0.75035 0 0 0.74955 0 0.0945] CT
2 setlinecap
1 LJ
2.667 LW
N
202.154 5 M
202.154 6.58 L
S
GR
GS
[0.64982 -0.37477 0.37517 0.64913 71.16756 123.46972] CT
/Helvetica-Bold 8 F
GS
[1 0 0 1 0 0] CT
-43 8 moveto 
1 -1 scale
(WT+0\265g/ml) t 
GR
GR
GS
[0.64982 -0.37477 0.37517 0.64913 98.00691 123.46972] CT
/Helvetica-Bold 8 F
GS
[1 0 0 1 0 0] CT
-43 8 moveto 
1 -1 scale
(WT+1\265g/ml) t 
GR
GR
GS
[0.64982 -0.37477 0.37517 0.64913 124.84626 123.46972] CT
/Helvetica-Bold 8 F
GS
[1 0 0 1 0 0] CT
-48 8 moveto 
1 -1 scale
(oatA+1\265g/ml) t 
GR
GR
GS
[0.64982 -0.37477 0.37517 0.64913 151.6856 123.46972] CT
/Helvetica-Bold 8 F
GS
[1 0 0 1 0 0] CT
-53 8 moveto 
1 -1 scale
(oatA+20\265g/ml) t 
GR
GR
GS
[0.75035 0 0 0.74955 0 0.0945] CT
2 setlinecap
1 LJ
2.667 LW
N
71 163 M
71 5 L
S
GR
GS
[0.75035 0 0 0.74955 0 0.0945] CT
2 setlinecap
1 LJ
2.667 LW
N
226 163 M
226 5 L
S
GR
GS
[0.75035 0 0 0.74955 0 0.0945] CT
2 setlinecap
1 LJ
2.667 LW
N
71 163 M
72.58 163 L
S
GR
GS
[0.75035 0 0 0.74955 0 0.0945] CT
2 setlinecap
1 LJ
2.667 LW
N
71 131.4 M
72.58 131.4 L
S
GR
GS
[0.75035 0 0 0.74955 0 0.0945] CT
2 setlinecap
1 LJ
2.667 LW
N
71 99.8 M
72.58 99.8 L
S
GR
GS
[0.75035 0 0 0.74955 0 0.0945] CT
2 setlinecap
1 LJ
2.667 LW
N
71 68.2 M
72.58 68.2 L
S
GR
GS
[0.75035 0 0 0.74955 0 0.0945] CT
2 setlinecap
1 LJ
2.667 LW
N
71 36.6 M
72.58 36.6 L
S
GR
GS
[0.75035 0 0 0.74955 0 0.0945] CT
2 setlinecap
1 LJ
2.667 LW
N
71 5 M
72.58 5 L
S
GR
GS
[0.75035 0 0 0.74955 0 0.0945] CT
2 setlinecap
1 LJ
2.667 LW
N
226 163 M
224.42 163 L
S
GR
GS
[0.75035 0 0 0.74955 0 0.0945] CT
2 setlinecap
1 LJ
2.667 LW
N
226 131.4 M
224.42 131.4 L
S
GR
GS
[0.75035 0 0 0.74955 0 0.0945] CT
2 setlinecap
1 LJ
2.667 LW
N
226 99.8 M
224.42 99.8 L
S
GR
GS
[0.75035 0 0 0.74955 0 0.0945] CT
2 setlinecap
1 LJ
2.667 LW
N
226 68.2 M
224.42 68.2 L
S
GR
GS
[0.75035 0 0 0.74955 0 0.0945] CT
2 setlinecap
1 LJ
2.667 LW
N
226 36.6 M
224.42 36.6 L
S
GR
GS
[0.75035 0 0 0.74955 0 0.0945] CT
2 setlinecap
1 LJ
2.667 LW
N
226 5 M
224.42 5 L
S
GR
GS
[0.75035 0 0 0.74955 51.67392 122.27044] CT
/Helvetica-Bold 10.667 F
GS
[1 0 0 1 0 0] CT
-6 3.5 moveto 
1 -1 scale
(0) t 
GR
GR
GS
[0.75035 0 0 0.74955 51.67392 98.5848] CT
/Helvetica-Bold 10.667 F
GS
[1 0 0 1 0 0] CT
-18 3.5 moveto 
1 -1 scale
(200) t 
GR
GR
GS
[0.75035 0 0 0.74955 51.67392 74.89916] CT
/Helvetica-Bold 10.667 F
GS
[1 0 0 1 0 0] CT
-18 3.5 moveto 
1 -1 scale
(400) t 
GR
GR
GS
[0.75035 0 0 0.74955 51.67392 51.21351] CT
/Helvetica-Bold 10.667 F
GS
[1 0 0 1 0 0] CT
-18 3.5 moveto 
1 -1 scale
(600) t 
GR
GR
GS
[0.75035 0 0 0.74955 51.67392 27.52787] CT
/Helvetica-Bold 10.667 F
GS
[1 0 0 1 0 0] CT
-18 3.5 moveto 
1 -1 scale
(800) t 
GR
GR
GS
[0.75035 0 0 0.74955 51.67392 3.84223] CT
/Helvetica-Bold 10.667 F
GS
[1 0 0 1 0 0] CT
-24 3.5 moveto 
1 -1 scale
(1000) t 
GR
GR
GS
[0 -0.74955 0.75035 0 27.76285 95.2868] CT
/Helvetica-Bold 11.733 F
GS
[1 0 0 1 0 0] CT
0 0 moveto 
1 -1 scale
(P) t 
GR
GR
GS
[0 -0.74955 0.75035 0 31.51459 89.29043] CT
/Helvetica-BoldOblique 9.387 F
GS
[1 0 0 1 0 0] CT
0 0 moveto 
1 -1 scale
(sigV) t 
GR
GR
GS
[0 -0.74955 0.75035 0 27.76285 74.29952] CT
/Helvetica-Bold 11.733 F
GS
[1 0 0 1 0 0] CT
0 0 moveto 
1 -1 scale
( - YFP \(au\)) t 
GR
GR
GS
[0.75035 0 0 0.74955 0 0.0945] CT
[10 6] 0 setdash
2 LJ
0.667 LW
N
82.923 157.901 M
82.923 155.96 L
S
GR
GS
[0.75035 0 0 0.74955 0 0.0945] CT
[10 6] 0 setdash
2 LJ
0.667 LW
N
94.846 157.146 M
94.846 154.799 L
S
GR
GS
[0.75035 0 0 0.74955 0 0.0945] CT
[10 6] 0 setdash
2 LJ
0.667 LW
N
106.769 157.459 M
106.769 155.191 L
S
GR
GS
[0.75035 0 0 0.74955 0 0.0945] CT
[10 6] 0 setdash
2 LJ
0.667 LW
N
118.692 99.629 M
118.692 16.669 L
S
GR
GS
[0.75035 0 0 0.74955 0 0.0945] CT
[10 6] 0 setdash
2 LJ
0.667 LW
N
130.615 117.368 M
130.615 58.549 L
S
GR
GS
[0.75035 0 0 0.74955 0 0.0945] CT
[10 6] 0 setdash
2 LJ
0.667 LW
N
142.538 129.569 M
142.538 88.12 L
S
GR
GS
[0.75035 0 0 0.74955 0 0.0945] CT
[10 6] 0 setdash
2 LJ
0.667 LW
N
154.462 156.799 M
154.462 154.107 L
S
GR
GS
[0.75035 0 0 0.74955 0 0.0945] CT
[10 6] 0 setdash
2 LJ
0.667 LW
N
166.385 153.557 M
166.385 149.494 L
S
GR
GS
[0.75035 0 0 0.74955 0 0.0945] CT
[10 6] 0 setdash
2 LJ
0.667 LW
N
178.308 155.824 M
178.308 152.775 L
S
GR
GS
[0.75035 0 0 0.74955 0 0.0945] CT
[10 6] 0 setdash
2 LJ
0.667 LW
N
190.231 121.347 M
190.231 71.75 L
S
GR
GS
[0.75035 0 0 0.74955 0 0.0945] CT
[10 6] 0 setdash
2 LJ
0.667 LW
N
202.154 108.054 M
202.154 47.308 L
S
GR
GS
[0.75035 0 0 0.74955 0 0.0945] CT
[10 6] 0 setdash
2 LJ
0.667 LW
N
214.077 137.036 M
214.077 110.956 L
S
GR
GS
[0.75035 0 0 0.74955 0 0.0945] CT
[10 6] 0 setdash
2 LJ
0.667 LW
N
82.923 160.814 M
82.923 159.207 L
S
GR
GS
[0.75035 0 0 0.74955 0 0.0945] CT
[10 6] 0 setdash
2 LJ
0.667 LW
N
94.846 160.569 M
94.846 158.714 L
S
GR
GS
[0.75035 0 0 0.74955 0 0.0945] CT
[10 6] 0 setdash
2 LJ
0.667 LW
N
106.769 161.083 M
106.769 158.974 L
S
GR
GS
[0.75035 0 0 0.74955 0 0.0945] CT
[10 6] 0 setdash
2 LJ
0.667 LW
N
118.692 161.662 M
118.692 155.388 L
S
GR
GS
[0.75035 0 0 0.74955 0 0.0945] CT
[10 6] 0 setdash
2 LJ
0.667 LW
N
130.615 160.428 M
130.615 156.6 L
S
GR
GS
[0.75035 0 0 0.74955 0 0.0945] CT
[10 6] 0 setdash
2 LJ
0.667 LW
N
142.538 160.857 M
142.538 157.306 L
S
GR
GS
[0.75035 0 0 0.74955 0 0.0945] CT
[10 6] 0 setdash
2 LJ
0.667 LW
N
154.462 160.684 M
154.462 158.603 L
S
GR
GS
[0.75035 0 0 0.74955 0 0.0945] CT
[10 6] 0 setdash
2 LJ
0.667 LW
N
166.385 159.045 M
166.385 156.274 L
S
GR
GS
[0.75035 0 0 0.74955 0 0.0945] CT
[10 6] 0 setdash
2 LJ
0.667 LW
N
178.308 160.47 M
178.308 157.875 L
S
GR
GS
[0.75035 0 0 0.74955 0 0.0945] CT
[10 6] 0 setdash
2 LJ
0.667 LW
N
190.231 162.453 M
190.231 154.592 L
S
GR
GS
[0.75035 0 0 0.74955 0 0.0945] CT
[10 6] 0 setdash
2 LJ
0.667 LW
N
202.154 159.56 M
202.154 149.202 L
S
GR
GS
[0.75035 0 0 0.74955 0 0.0945] CT
[10 6] 0 setdash
2 LJ
0.667 LW
N
214.077 160.116 M
214.077 154.435 L
S
GR
GS
[0.75035 0 0 0.74955 0 0.0945] CT
1 LJ
0.667 LW
N
81.433 155.96 M
84.413 155.96 L
S
GR
GS
[0.75035 0 0 0.74955 0 0.0945] CT
1 LJ
0.667 LW
N
93.356 154.799 M
96.337 154.799 L
S
GR
GS
[0.75035 0 0 0.74955 0 0.0945] CT
1 LJ
0.667 LW
N
105.279 155.191 M
108.26 155.191 L
S
GR
GS
[0.75035 0 0 0.74955 0 0.0945] CT
1 LJ
0.667 LW
N
117.202 16.669 M
120.183 16.669 L
S
GR
GS
[0.75035 0 0 0.74955 0 0.0945] CT
1 LJ
0.667 LW
N
129.125 58.549 M
132.106 58.549 L
S
GR
GS
[0.75035 0 0 0.74955 0 0.0945] CT
1 LJ
0.667 LW
N
141.048 88.12 M
144.029 88.12 L
S
GR
GS
[0.75035 0 0 0.74955 0 0.0945] CT
1 LJ
0.667 LW
N
152.971 154.107 M
155.952 154.107 L
S
GR
GS
[0.75035 0 0 0.74955 0 0.0945] CT
1 LJ
0.667 LW
N
164.894 149.494 M
167.875 149.494 L
S
GR
GS
[0.75035 0 0 0.74955 0 0.0945] CT
1 LJ
0.667 LW
N
176.817 152.775 M
179.798 152.775 L
S
GR
GS
[0.75035 0 0 0.74955 0 0.0945] CT
1 LJ
0.667 LW
N
188.74 71.75 M
191.721 71.75 L
S
GR
GS
[0.75035 0 0 0.74955 0 0.0945] CT
1 LJ
0.667 LW
N
200.663 47.308 M
203.644 47.308 L
S
GR
GS
[0.75035 0 0 0.74955 0 0.0945] CT
1 LJ
0.667 LW
N
212.587 110.956 M
215.567 110.956 L
S
GR
GS
[0.75035 0 0 0.74955 0 0.0945] CT
1 LJ
0.667 LW
N
81.433 160.814 M
84.413 160.814 L
S
GR
GS
[0.75035 0 0 0.74955 0 0.0945] CT
1 LJ
0.667 LW
N
93.356 160.569 M
96.337 160.569 L
S
GR
GS
[0.75035 0 0 0.74955 0 0.0945] CT
1 LJ
0.667 LW
N
105.279 161.083 M
108.26 161.083 L
S
GR
GS
[0.75035 0 0 0.74955 0 0.0945] CT
1 LJ
0.667 LW
N
117.202 161.662 M
120.183 161.662 L
S
GR
GS
[0.75035 0 0 0.74955 0 0.0945] CT
1 LJ
0.667 LW
N
129.125 160.428 M
132.106 160.428 L
S
GR
GS
[0.75035 0 0 0.74955 0 0.0945] CT
1 LJ
0.667 LW
N
141.048 160.857 M
144.029 160.857 L
S
GR
GS
[0.75035 0 0 0.74955 0 0.0945] CT
1 LJ
0.667 LW
N
152.971 160.684 M
155.952 160.684 L
S
GR
GS
[0.75035 0 0 0.74955 0 0.0945] CT
1 LJ
0.667 LW
N
164.894 159.045 M
167.875 159.045 L
S
GR
GS
[0.75035 0 0 0.74955 0 0.0945] CT
1 LJ
0.667 LW
N
176.817 160.47 M
179.798 160.47 L
S
GR
GS
[0.75035 0 0 0.74955 0 0.0945] CT
1 LJ
0.667 LW
N
188.74 162.453 M
191.721 162.453 L
S
GR
GS
[0.75035 0 0 0.74955 0 0.0945] CT
1 LJ
0.667 LW
N
200.663 159.56 M
203.644 159.56 L
S
GR
GS
[0.75035 0 0 0.74955 0 0.0945] CT
1 LJ
0.667 LW
N
212.587 160.116 M
215.567 160.116 L
S
GR
GS
[0.75035 0 0 0.74955 0 0.0945] CT
0 0 1 RC
1 LJ
0.667 LW
N
79.942 159.207 M
79.942 157.901 L
85.904 157.901 L
85.904 159.207 L
79.942 159.207 L
S
GR
GS
[0.75035 0 0 0.74955 0 0.0945] CT
0 0 1 RC
1 LJ
0.667 LW
N
91.865 158.714 M
91.865 157.146 L
97.827 157.146 L
97.827 158.714 L
91.865 158.714 L
S
GR
GS
[0.75035 0 0 0.74955 0 0.0945] CT
0 0 1 RC
1 LJ
0.667 LW
N
103.788 158.974 M
103.788 157.459 L
109.75 157.459 L
109.75 158.974 L
103.788 158.974 L
S
GR
GS
[0.75035 0 0 0.74955 0 0.0945] CT
0 0 1 RC
1 LJ
0.667 LW
N
115.712 155.388 M
115.712 99.629 L
121.673 99.629 L
121.673 155.388 L
115.712 155.388 L
S
GR
GS
[0.75035 0 0 0.74955 0 0.0945] CT
0 0 1 RC
1 LJ
0.667 LW
N
127.635 156.6 M
127.635 117.368 L
133.596 117.368 L
133.596 156.6 L
127.635 156.6 L
S
GR
GS
[0.75035 0 0 0.74955 0 0.0945] CT
0 0 1 RC
1 LJ
0.667 LW
N
139.558 157.306 M
139.558 129.569 L
145.519 129.569 L
145.519 157.306 L
139.558 157.306 L
S
GR
GS
[0.75035 0 0 0.74955 0 0.0945] CT
0 0 1 RC
1 LJ
0.667 LW
N
151.481 158.603 M
151.481 156.799 L
157.442 156.799 L
157.442 158.603 L
151.481 158.603 L
S
GR
GS
[0.75035 0 0 0.74955 0 0.0945] CT
0 0 1 RC
1 LJ
0.667 LW
N
163.404 156.274 M
163.404 153.557 L
169.365 153.557 L
169.365 156.274 L
163.404 156.274 L
S
GR
GS
[0.75035 0 0 0.74955 0 0.0945] CT
0 0 1 RC
1 LJ
0.667 LW
N
175.327 157.875 M
175.327 155.824 L
181.288 155.824 L
181.288 157.875 L
175.327 157.875 L
S
GR
GS
[0.75035 0 0 0.74955 0 0.0945] CT
0 0 1 RC
1 LJ
0.667 LW
N
187.25 154.592 M
187.25 121.347 L
193.212 121.347 L
193.212 154.592 L
187.25 154.592 L
S
GR
GS
[0.75035 0 0 0.74955 0 0.0945] CT
0 0 1 RC
1 LJ
0.667 LW
N
199.173 149.202 M
199.173 108.054 L
205.135 108.054 L
205.135 149.202 L
199.173 149.202 L
S
GR
GS
[0.75035 0 0 0.74955 0 0.0945] CT
0 0 1 RC
1 LJ
0.667 LW
N
211.096 154.435 M
211.096 137.036 L
217.058 137.036 L
217.058 154.435 L
211.096 154.435 L
S
GR
GS
[0.75035 0 0 0.74955 0 0.0945] CT
1 0 0 RC
1 LJ
0.667 LW
N
79.942 158.512 M
85.904 158.512 L
S
GR
GS
[0.75035 0 0 0.74955 0 0.0945] CT
1 0 0 RC
1 LJ
0.667 LW
N
91.865 157.975 M
97.827 157.975 L
S
GR
GS
[0.75035 0 0 0.74955 0 0.0945] CT
1 0 0 RC
1 LJ
0.667 LW
N
103.788 158.238 M
109.75 158.238 L
S
GR
GS
[0.75035 0 0 0.74955 0 0.0945] CT
1 0 0 RC
1 LJ
0.667 LW
N
115.712 134.774 M
121.673 134.774 L
S
GR
GS
[0.75035 0 0 0.74955 0 0.0945] CT
1 0 0 RC
1 LJ
0.667 LW
N
127.635 141.486 M
133.596 141.486 L
S
GR
GS
[0.75035 0 0 0.74955 0 0.0945] CT
1 0 0 RC
1 LJ
0.667 LW
N
139.558 148.853 M
145.519 148.853 L
S
GR
GS
[0.75035 0 0 0.74955 0 0.0945] CT
1 0 0 RC
1 LJ
0.667 LW
N
151.481 157.758 M
157.442 157.758 L
S
GR
GS
[0.75035 0 0 0.74955 0 0.0945] CT
1 0 0 RC
1 LJ
0.667 LW
N
163.404 155.105 M
169.365 155.105 L
S
GR
GS
[0.75035 0 0 0.74955 0 0.0945] CT
1 0 0 RC
1 LJ
0.667 LW
N
175.327 156.94 M
181.288 156.94 L
S
GR
GS
[0.75035 0 0 0.74955 0 0.0945] CT
1 0 0 RC
1 LJ
0.667 LW
N
187.25 146.431 M
193.212 146.431 L
S
GR
GS
[0.75035 0 0 0.74955 0 0.0945] CT
1 0 0 RC
1 LJ
0.667 LW
N
199.173 137.927 M
205.135 137.927 L
S
GR
GS
[0.75035 0 0 0.74955 0 0.0945] CT
1 0 0 RC
1 LJ
0.667 LW
N
211.096 149.658 M
217.058 149.658 L
S
GR
%%Trailer
%%Pages: 1
%%EOF
