%!PS-Adobe-3.0 EPSF-3.0
%%Creator: (MATLAB, The Mathworks, Inc. Version 9.10.0.1602886 \(R2021a\). Operating System: Windows 10)
%%Title: (C:/Users/christian.schwall/OneDrive - University Of Cambridge/SigV_paper_publish/Figure3/Figure/MSB-20-9832_Figure3_part2.eps)
%%CreationDate: 2021-04-15T18:23:38
%%Pages: (atend)
%%BoundingBox:    17     0   498   156
%%LanguageLevel: 2
%%EndComments
%%BeginProlog
%%BeginResource: procset (Apache XML Graphics Std ProcSet) 1.2 0
%%Version: 1.2 0
%%Copyright: (Copyright 2001-2003,2010 The Apache Software Foundation. License terms: http://www.apache.org/licenses/LICENSE-2.0)
/bd{bind def}bind def
/ld{load def}bd
/GR/grestore ld
/GS/gsave ld
/RM/rmoveto ld
/C/curveto ld
/t/show ld
/L/lineto ld
/ML/setmiterlimit ld
/CT/concat ld
/f/fill ld
/N/newpath ld
/S/stroke ld
/CC/setcmykcolor ld
/A/ashow ld
/cp/closepath ld
/RC/setrgbcolor ld
/LJ/setlinejoin ld
/GC/setgray ld
/LW/setlinewidth ld
/M/moveto ld
/re {4 2 roll M
1 index 0 rlineto
0 exch rlineto
neg 0 rlineto
cp } bd
/_ctm matrix def
/_tm matrix def
/BT { _ctm currentmatrix pop matrix _tm copy pop 0 0 moveto } bd
/ET { _ctm setmatrix } bd
/iTm { _ctm setmatrix _tm concat } bd
/Tm { _tm astore pop iTm 0 0 moveto } bd
/ux 0.0 def
/uy 0.0 def
/F {
  /Tp exch def
  /Tf exch def
  Tf findfont Tp scalefont setfont
  /cf Tf def  /cs Tp def
} bd
/ULS {currentpoint /uy exch def /ux exch def} bd
/ULE {
  /Tcx currentpoint pop def
  gsave
  newpath
  cf findfont cs scalefont dup
  /FontMatrix get 0 get /Ts exch def /FontInfo get dup
  /UnderlinePosition get Ts mul /To exch def
  /UnderlineThickness get Ts mul /Tt exch def
  ux uy To add moveto  Tcx uy To add lineto
  Tt setlinewidth stroke
  grestore
} bd
/OLE {
  /Tcx currentpoint pop def
  gsave
  newpath
  cf findfont cs scalefont dup
  /FontMatrix get 0 get /Ts exch def /FontInfo get dup
  /UnderlinePosition get Ts mul /To exch def
  /UnderlineThickness get Ts mul /Tt exch def
  ux uy To add cs add moveto Tcx uy To add cs add lineto
  Tt setlinewidth stroke
  grestore
} bd
/SOE {
  /Tcx currentpoint pop def
  gsave
  newpath
  cf findfont cs scalefont dup
  /FontMatrix get 0 get /Ts exch def /FontInfo get dup
  /UnderlinePosition get Ts mul /To exch def
  /UnderlineThickness get Ts mul /Tt exch def
  ux uy To add cs 10 mul 26 idiv add moveto Tcx uy To add cs 10 mul 26 idiv add lineto
  Tt setlinewidth stroke
  grestore
} bd
/QT {
/Y22 exch store
/X22 exch store
/Y21 exch store
/X21 exch store
currentpoint
/Y21 load 2 mul add 3 div exch
/X21 load 2 mul add 3 div exch
/X21 load 2 mul /X22 load add 3 div
/Y21 load 2 mul /Y22 load add 3 div
/X22 load /Y22 load curveto
} bd
/SSPD {
dup length /d exch dict def
{
/v exch def
/k exch def
currentpagedevice k known {
/cpdv currentpagedevice k get def
v cpdv ne {
/upd false def
/nullv v type /nulltype eq def
/nullcpdv cpdv type /nulltype eq def
nullv nullcpdv or
{
/upd true def
} {
/sametype v type cpdv type eq def
sametype {
v type /arraytype eq {
/vlen v length def
/cpdvlen cpdv length def
vlen cpdvlen eq {
0 1 vlen 1 sub {
/i exch def
/obj v i get def
/cpdobj cpdv i get def
obj cpdobj ne {
/upd true def
exit
} if
} for
} {
/upd true def
} ifelse
} {
v type /dicttype eq {
v {
/dv exch def
/dk exch def
/cpddv cpdv dk get def
dv cpddv ne {
/upd true def
exit
} if
} forall
} {
/upd true def
} ifelse
} ifelse
} if
} ifelse
upd true eq {
d k v put
} if
} if
} if
} forall
d length 0 gt {
d setpagedevice
} if
} bd
/RE { % /NewFontName [NewEncodingArray] /FontName RE -
  findfont dup length dict begin
  {
    1 index /FID ne
    {def} {pop pop} ifelse
  } forall
  /Encoding exch def
  /FontName 1 index def
  currentdict definefont pop
  end
} bind def
%%EndResource
%%BeginResource: procset (Apache XML Graphics EPS ProcSet) 1.0 0
%%Version: 1.0 0
%%Copyright: (Copyright 2002-2003 The Apache Software Foundation. License terms: http://www.apache.org/licenses/LICENSE-2.0)
/BeginEPSF { %def
/b4_Inc_state save def         % Save state for cleanup
/dict_count countdictstack def % Count objects on dict stack
/op_count count 1 sub def      % Count objects on operand stack
userdict begin                 % Push userdict on dict stack
/showpage { } def              % Redefine showpage, { } = null proc
0 setgray 0 setlinecap         % Prepare graphics state
1 setlinewidth 0 setlinejoin
10 setmiterlimit [ ] 0 setdash newpath
/languagelevel where           % If level not equal to 1 then
{pop languagelevel             % set strokeadjust and
1 ne                           % overprint to their defaults.
{false setstrokeadjust false setoverprint
} if
} if
} bd
/EndEPSF { %def
count op_count sub {pop} repeat            % Clean up stacks
countdictstack dict_count sub {end} repeat
b4_Inc_state restore
} bd
%%EndResource
%FOPBeginFontDict
%%IncludeResource: font Courier-Oblique
%%IncludeResource: font Courier-BoldOblique
%%IncludeResource: font Courier-Bold
%%IncludeResource: font ZapfDingbats
%%IncludeResource: font Symbol
%%IncludeResource: font Helvetica
%%IncludeResource: font Helvetica-Oblique
%%IncludeResource: font Helvetica-Bold
%%IncludeResource: font Helvetica-BoldOblique
%%IncludeResource: font Times-Roman
%%IncludeResource: font Times-Italic
%%IncludeResource: font Times-Bold
%%IncludeResource: font Times-BoldItalic
%%IncludeResource: font Courier
%FOPEndFontDict
%%BeginResource: encoding WinAnsiEncoding
/WinAnsiEncoding [
/.notdef /.notdef /.notdef /.notdef /.notdef
/.notdef /.notdef /.notdef /.notdef /.notdef
/.notdef /.notdef /.notdef /.notdef /.notdef
/.notdef /.notdef /.notdef /.notdef /.notdef
/.notdef /.notdef /.notdef /.notdef /.notdef
/.notdef /.notdef /.notdef /.notdef /.notdef
/.notdef /.notdef /space /exclam /quotedbl
/numbersign /dollar /percent /ampersand /quotesingle
/parenleft /parenright /asterisk /plus /comma
/hyphen /period /slash /zero /one
/two /three /four /five /six
/seven /eight /nine /colon /semicolon
/less /equal /greater /question /at
/A /B /C /D /E
/F /G /H /I /J
/K /L /M /N /O
/P /Q /R /S /T
/U /V /W /X /Y
/Z /bracketleft /backslash /bracketright /asciicircum
/underscore /quoteleft /a /b /c
/d /e /f /g /h
/i /j /k /l /m
/n /o /p /q /r
/s /t /u /v /w
/x /y /z /braceleft /bar
/braceright /asciitilde /bullet /Euro /bullet
/quotesinglbase /florin /quotedblbase /ellipsis /dagger
/daggerdbl /circumflex /perthousand /Scaron /guilsinglleft
/OE /bullet /Zcaron /bullet /bullet
/quoteleft /quoteright /quotedblleft /quotedblright /bullet
/endash /emdash /asciitilde /trademark /scaron
/guilsinglright /oe /bullet /zcaron /Ydieresis
/space /exclamdown /cent /sterling /currency
/yen /brokenbar /section /dieresis /copyright
/ordfeminine /guillemotleft /logicalnot /sfthyphen /registered
/macron /degree /plusminus /twosuperior /threesuperior
/acute /mu /paragraph /middot /cedilla
/onesuperior /ordmasculine /guillemotright /onequarter /onehalf
/threequarters /questiondown /Agrave /Aacute /Acircumflex
/Atilde /Adieresis /Aring /AE /Ccedilla
/Egrave /Eacute /Ecircumflex /Edieresis /Igrave
/Iacute /Icircumflex /Idieresis /Eth /Ntilde
/Ograve /Oacute /Ocircumflex /Otilde /Odieresis
/multiply /Oslash /Ugrave /Uacute /Ucircumflex
/Udieresis /Yacute /Thorn /germandbls /agrave
/aacute /acircumflex /atilde /adieresis /aring
/ae /ccedilla /egrave /eacute /ecircumflex
/edieresis /igrave /iacute /icircumflex /idieresis
/eth /ntilde /ograve /oacute /ocircumflex
/otilde /odieresis /divide /oslash /ugrave
/uacute /ucircumflex /udieresis /yacute /thorn
/ydieresis
] def
%%EndResource
%FOPBeginFontReencode
/Courier-Oblique findfont
dup length dict begin
  {1 index /FID ne {def} {pop pop} ifelse} forall
  /Encoding WinAnsiEncoding def
  currentdict
end
/Courier-Oblique exch definefont pop
/Courier-BoldOblique findfont
dup length dict begin
  {1 index /FID ne {def} {pop pop} ifelse} forall
  /Encoding WinAnsiEncoding def
  currentdict
end
/Courier-BoldOblique exch definefont pop
/Courier-Bold findfont
dup length dict begin
  {1 index /FID ne {def} {pop pop} ifelse} forall
  /Encoding WinAnsiEncoding def
  currentdict
end
/Courier-Bold exch definefont pop
/Helvetica findfont
dup length dict begin
  {1 index /FID ne {def} {pop pop} ifelse} forall
  /Encoding WinAnsiEncoding def
  currentdict
end
/Helvetica exch definefont pop
/Helvetica-Oblique findfont
dup length dict begin
  {1 index /FID ne {def} {pop pop} ifelse} forall
  /Encoding WinAnsiEncoding def
  currentdict
end
/Helvetica-Oblique exch definefont pop
/Helvetica-Bold findfont
dup length dict begin
  {1 index /FID ne {def} {pop pop} ifelse} forall
  /Encoding WinAnsiEncoding def
  currentdict
end
/Helvetica-Bold exch definefont pop
/Helvetica-BoldOblique findfont
dup length dict begin
  {1 index /FID ne {def} {pop pop} ifelse} forall
  /Encoding WinAnsiEncoding def
  currentdict
end
/Helvetica-BoldOblique exch definefont pop
/Times-Roman findfont
dup length dict begin
  {1 index /FID ne {def} {pop pop} ifelse} forall
  /Encoding WinAnsiEncoding def
  currentdict
end
/Times-Roman exch definefont pop
/Times-Italic findfont
dup length dict begin
  {1 index /FID ne {def} {pop pop} ifelse} forall
  /Encoding WinAnsiEncoding def
  currentdict
end
/Times-Italic exch definefont pop
/Times-Bold findfont
dup length dict begin
  {1 index /FID ne {def} {pop pop} ifelse} forall
  /Encoding WinAnsiEncoding def
  currentdict
end
/Times-Bold exch definefont pop
/Times-BoldItalic findfont
dup length dict begin
  {1 index /FID ne {def} {pop pop} ifelse} forall
  /Encoding WinAnsiEncoding def
  currentdict
end
/Times-BoldItalic exch definefont pop
/Courier findfont
dup length dict begin
  {1 index /FID ne {def} {pop pop} ifelse} forall
  /Encoding WinAnsiEncoding def
  currentdict
end
/Courier exch definefont pop
%FOPEndFontReencode
%%EndProlog
%%Page: 1 1
%%PageBoundingBox: 0 0 510 156
%%BeginPageSetup
[1 0 0 -1 0 156] CT
%%EndPageSetup
GS
[0.75035 0 0 0.74955 0 0.0945] CT
1 GC
N
0 0 680 208 re
f
GR
GS
[0.75035 0 0 0.74955 0 0.0945] CT
1 GC
N
0 0 680 208 re
f
GR
GS
[0.75035 0 0 0.74955 0 0.0945] CT
1 GC
N
492 177 M
663 177 L
663 5 L
492 5 L
cp
f
GR
GS
[0.75035 0 0 0.74955 0 0.0945] CT
0.149 GC
2 setlinecap
1 LJ
0.667 LW
N
492 177 M
663 177 L
S
GR
GS
[0.75035 0 0 0.74955 0 0.0945] CT
0.149 GC
2 setlinecap
1 LJ
0.667 LW
N
492 177 M
492 175.28 L
S
GR
GS
[0.75035 0 0 0.74955 0 0.0945] CT
0.149 GC
2 setlinecap
1 LJ
0.667 LW
N
577.5 177 M
577.5 175.28 L
S
GR
GS
[0.75035 0 0 0.74955 0 0.0945] CT
0.149 GC
2 setlinecap
1 LJ
0.667 LW
N
663 177 M
663 175.28 L
S
GR
GS
[0.75035 0 0 0.74955 0 0.0945] CT
0.149 GC
2 setlinecap
1 LJ
0.667 LW
N
492 177 M
492 5 L
S
GR
GS
[0.75035 0 0 0.74955 0 0.0945] CT
0.149 GC
2 setlinecap
1 LJ
0.667 LW
N
492 177 M
493.72 177 L
S
GR
GS
[0.75035 0 0 0.74955 0 0.0945] CT
0.149 GC
2 setlinecap
1 LJ
0.667 LW
N
492 142.6 M
493.72 142.6 L
S
GR
GS
[0.75035 0 0 0.74955 0 0.0945] CT
0.149 GC
2 setlinecap
1 LJ
0.667 LW
N
492 108.2 M
493.72 108.2 L
S
GR
GS
[0.75035 0 0 0.74955 0 0.0945] CT
0.149 GC
2 setlinecap
1 LJ
0.667 LW
N
492 73.8 M
493.72 73.8 L
S
GR
GS
[0.75035 0 0 0.74955 0 0.0945] CT
0.149 GC
2 setlinecap
1 LJ
0.667 LW
N
492 39.4 M
493.72 39.4 L
S
GR
GS
[0.75035 0 0 0.74955 0 0.0945] CT
0.149 GC
2 setlinecap
1 LJ
0.667 LW
N
492 5 M
493.72 5 L
S
GR
GS
[0.75035 0 0 0.74955 0 0.0945] CT
1 GC
N
54 177 M
226 177 L
226 5 L
54 5 L
cp
f
GR
GS
[0.75035 0 0 0.74955 0 0.0945] CT
1 LJ
0.667 LW
N
54 168.81 M
226 168.81 L
S
GR
GS
[0.75035 0 0 0.74955 0 0.0945] CT
1 0 0 RC
N
77.271 168.81 M
77.271 75.428 L
61.082 75.428 L
61.082 168.81 L
cp
137.976 168.81 M
137.976 168.274 L
121.788 168.274 L
121.788 168.81 L
cp
158.212 168.81 M
158.212 75.868 L
142.024 75.868 L
142.024 168.81 L
cp
178.447 168.81 M
178.447 73.194 L
162.259 73.194 L
162.259 168.81 L
cp
198.682 168.81 M
198.682 66.084 L
182.494 66.084 L
182.494 168.81 L
cp
218.918 168.81 M
218.918 71.567 L
202.729 71.567 L
202.729 168.81 L
cp
f
GR
GS
[0.75035 0 0 0.74955 0 0.0945] CT
10.0 ML
0.667 LW
N
61.082 168.81 M
61.082 75.428 L
77.271 75.428 L
77.271 168.81 L
cp
S
GR
GS
[0.75035 0 0 0.74955 0 0.0945] CT
10.0 ML
0.667 LW
N
81.318 168.81 M
81.318 168.81 L
97.506 168.81 L
97.506 168.81 L
cp
S
GR
GS
[0.75035 0 0 0.74955 0 0.0945] CT
10.0 ML
0.667 LW
N
101.553 168.81 M
101.553 168.81 L
117.741 168.81 L
117.741 168.81 L
cp
S
GR
GS
[0.75035 0 0 0.74955 0 0.0945] CT
10.0 ML
0.667 LW
N
121.788 168.81 M
121.788 168.274 L
137.976 168.274 L
137.976 168.81 L
cp
S
GR
GS
[0.75035 0 0 0.74955 0 0.0945] CT
10.0 ML
0.667 LW
N
142.024 168.81 M
142.024 75.868 L
158.212 75.868 L
158.212 168.81 L
cp
S
GR
GS
[0.75035 0 0 0.74955 0 0.0945] CT
10.0 ML
0.667 LW
N
162.259 168.81 M
162.259 73.194 L
178.447 73.194 L
178.447 168.81 L
cp
S
GR
GS
[0.75035 0 0 0.74955 0 0.0945] CT
10.0 ML
0.667 LW
N
182.494 168.81 M
182.494 66.084 L
198.682 66.084 L
198.682 168.81 L
cp
S
GR
GS
[0.75035 0 0 0.74955 0 0.0945] CT
10.0 ML
0.667 LW
N
202.729 168.81 M
202.729 71.567 L
218.918 71.567 L
218.918 168.81 L
cp
S
GR
GS
[0.75035 0 0 0.74955 0 0.0945] CT
1 LJ
0.667 LW
N
69.176 75.428 M
69.176 83.728 L
S
GR
GS
[0.75035 0 0 0.74955 0 0.0945] CT
1 LJ
0.667 LW
N
89.412 168.81 M
89.412 168.81 L
S
GR
GS
[0.75035 0 0 0.74955 0 0.0945] CT
1 LJ
0.667 LW
N
109.647 168.81 M
109.647 168.81 L
S
GR
GS
[0.75035 0 0 0.74955 0 0.0945] CT
1 LJ
0.667 LW
N
129.882 168.274 M
129.882 169.345 L
S
GR
GS
[0.75035 0 0 0.74955 0 0.0945] CT
1 LJ
0.667 LW
N
150.118 75.868 M
150.118 87.797 L
S
GR
GS
[0.75035 0 0 0.74955 0 0.0945] CT
1 LJ
0.667 LW
N
170.353 73.194 M
170.353 97.37 L
S
GR
GS
[0.75035 0 0 0.74955 0 0.0945] CT
1 LJ
0.667 LW
N
190.588 66.084 M
190.588 75.128 L
S
GR
GS
[0.75035 0 0 0.74955 0 0.0945] CT
1 LJ
0.667 LW
N
210.824 71.567 M
210.824 82.354 L
S
GR
GS
[0.75035 0 0 0.74955 0 0.0945] CT
1 LJ
0.667 LW
N
69.176 75.428 M
69.176 67.129 L
S
GR
GS
[0.75035 0 0 0.74955 0 0.0945] CT
1 LJ
0.667 LW
N
89.412 168.81 M
89.412 168.81 L
S
GR
GS
[0.75035 0 0 0.74955 0 0.0945] CT
1 LJ
0.667 LW
N
109.647 168.81 M
109.647 168.81 L
S
GR
GS
[0.75035 0 0 0.74955 0 0.0945] CT
1 LJ
0.667 LW
N
129.882 168.274 M
129.882 167.204 L
S
GR
GS
[0.75035 0 0 0.74955 0 0.0945] CT
1 LJ
0.667 LW
N
150.118 75.868 M
150.118 63.939 L
S
GR
GS
[0.75035 0 0 0.74955 0 0.0945] CT
1 LJ
0.667 LW
N
170.353 73.194 M
170.353 49.018 L
S
GR
GS
[0.75035 0 0 0.74955 0 0.0945] CT
1 LJ
0.667 LW
N
190.588 66.084 M
190.588 57.039 L
S
GR
GS
[0.75035 0 0 0.74955 0 0.0945] CT
1 LJ
0.667 LW
N
210.824 71.567 M
210.824 60.779 L
S
GR
GS
[0.75035 0 0 0.74955 51.90638 56.63154] CT
N
1.333 0 M
1.333 0.736 0.736 1.333 0 1.333 C
-0.736 1.333 -1.333 0.736 -1.333 0 C
-1.333 -0.736 -0.736 -1.333 0 -1.333 C
0.736 -1.333 1.333 -0.736 1.333 0 C
cp
f
GR
GS
[0.75035 0 0 0.74955 67.08988 126.62495] CT
N
/f-1057828618{1.333 0 M
1.333 0.736 0.736 1.333 0 1.333 C
-0.736 1.333 -1.333 0.736 -1.333 0 C
-1.333 -0.736 -0.736 -1.333 0 -1.333 C
0.736 -1.333 1.333 -0.736 1.333 0 C
cp}def
f-1057828618
f
GR
GS
[0.75035 0 0 0.74955 82.27338 126.62495] CT
N
f-1057828618
f
GR
GS
[0.75035 0 0 0.74955 97.45688 126.22386] CT
N
f-1057828618
f
GR
GS
[0.75035 0 0 0.74955 112.64038 56.96095] CT
N
f-1057828618
f
GR
GS
[0.75035 0 0 0.74955 127.82388 54.95682] CT
N
f-1057828618
f
GR
GS
[0.75035 0 0 0.74955 143.00738 49.6274] CT
N
f-1057828618
f
GR
GS
[0.75035 0 0 0.74955 158.19088 53.73713] CT
N
f-1057828618
f
GR
GS
[0.75035 0 0 0.74955 51.90638 62.85214] CT
N
-4 0 M
4 0 L
f
GR
GS
[0.75035 0 0 0.74955 51.90638 62.85214] CT
10.0 ML
0.667 LW
N
-4 0 M
4 0 L
S
GR
GS
[0.75035 0 0 0.74955 67.08988 126.62495] CT
N
/f-401390582{-4 0 M
4 0 L}def
f-401390582
f
GR
GS
[0.75035 0 0 0.74955 67.08988 126.62495] CT
10.0 ML
0.667 LW
N
-4 0 M
4 0 L
S
GR
GS
[0.75035 0 0 0.74955 82.27338 126.62495] CT
N
f-401390582
f
GR
GS
[0.75035 0 0 0.74955 82.27338 126.62495] CT
10.0 ML
0.667 LW
N
-4 0 M
4 0 L
S
GR
GS
[0.75035 0 0 0.74955 97.45688 127.02604] CT
N
f-401390582
f
GR
GS
[0.75035 0 0 0.74955 97.45688 127.02604] CT
10.0 ML
0.667 LW
N
-4 0 M
4 0 L
S
GR
GS
[0.75035 0 0 0.74955 112.64038 65.90247] CT
N
f-401390582
f
GR
GS
[0.75035 0 0 0.74955 112.64038 65.90247] CT
10.0 ML
0.667 LW
N
-4 0 M
4 0 L
S
GR
GS
[0.75035 0 0 0.74955 127.82388 73.07786] CT
N
f-401390582
f
GR
GS
[0.75035 0 0 0.74955 127.82388 73.07786] CT
10.0 ML
0.667 LW
N
-4 0 M
4 0 L
S
GR
GS
[0.75035 0 0 0.74955 143.00738 56.40661] CT
N
f-401390582
f
GR
GS
[0.75035 0 0 0.74955 143.00738 56.40661] CT
10.0 ML
0.667 LW
N
-4 0 M
4 0 L
S
GR
GS
[0.75035 0 0 0.74955 158.19088 61.82295] CT
N
f-401390582
f
GR
GS
[0.75035 0 0 0.74955 158.19088 61.82295] CT
10.0 ML
0.667 LW
N
-4 0 M
4 0 L
S
GR
GS
[0.75035 0 0 0.74955 51.90638 50.41093] CT
N
f-401390582
f
GR
GS
[0.75035 0 0 0.74955 51.90638 50.41093] CT
10.0 ML
0.667 LW
N
-4 0 M
4 0 L
S
GR
GS
[0.75035 0 0 0.74955 67.08988 126.62495] CT
N
f-401390582
f
GR
GS
[0.75035 0 0 0.74955 67.08988 126.62495] CT
10.0 ML
0.667 LW
N
-4 0 M
4 0 L
S
GR
GS
[0.75035 0 0 0.74955 82.27338 126.62495] CT
N
f-401390582
f
GR
GS
[0.75035 0 0 0.74955 82.27338 126.62495] CT
10.0 ML
0.667 LW
N
-4 0 M
4 0 L
S
GR
GS
[0.75035 0 0 0.74955 97.45688 125.42169] CT
N
f-401390582
f
GR
GS
[0.75035 0 0 0.74955 97.45688 125.42169] CT
10.0 ML
0.667 LW
N
-4 0 M
4 0 L
S
GR
GS
[0.75035 0 0 0.74955 112.64038 48.01944] CT
N
f-401390582
f
GR
GS
[0.75035 0 0 0.74955 112.64038 48.01944] CT
10.0 ML
0.667 LW
N
-4 0 M
4 0 L
S
GR
GS
[0.75035 0 0 0.74955 127.82388 36.83577] CT
N
f-401390582
f
GR
GS
[0.75035 0 0 0.74955 127.82388 36.83577] CT
10.0 ML
0.667 LW
N
-4 0 M
4 0 L
S
GR
GS
[0.75035 0 0 0.74955 143.00738 42.84818] CT
N
f-401390582
f
GR
GS
[0.75035 0 0 0.74955 143.00738 42.84818] CT
10.0 ML
0.667 LW
N
-4 0 M
4 0 L
S
GR
GS
[0.75035 0 0 0.74955 158.19088 45.65129] CT
N
f-401390582
f
GR
GS
[0.75035 0 0 0.74955 158.19088 45.65129] CT
10.0 ML
0.667 LW
N
-4 0 M
4 0 L
S
GR
GS
[0.75035 0 0 0.74955 0 0.0945] CT
2 setlinecap
1 LJ
2.667 LW
N
54 177 M
226 177 L
S
GR
GS
[0.75035 0 0 0.74955 0 0.0945] CT
2 setlinecap
1 LJ
2.667 LW
N
54 5 M
226 5 L
S
GR
GS
[0.75035 0 0 0.74955 0 0.0945] CT
2 setlinecap
1 LJ
2.667 LW
N
69.176 177 M
69.176 175.28 L
S
GR
GS
[0.75035 0 0 0.74955 0 0.0945] CT
2 setlinecap
1 LJ
2.667 LW
N
89.412 177 M
89.412 175.28 L
S
GR
GS
[0.75035 0 0 0.74955 0 0.0945] CT
2 setlinecap
1 LJ
2.667 LW
N
109.647 177 M
109.647 175.28 L
S
GR
GS
[0.75035 0 0 0.74955 0 0.0945] CT
2 setlinecap
1 LJ
2.667 LW
N
129.882 177 M
129.882 175.28 L
S
GR
GS
[0.75035 0 0 0.74955 0 0.0945] CT
2 setlinecap
1 LJ
2.667 LW
N
150.118 177 M
150.118 175.28 L
S
GR
GS
[0.75035 0 0 0.74955 0 0.0945] CT
2 setlinecap
1 LJ
2.667 LW
N
170.353 177 M
170.353 175.28 L
S
GR
GS
[0.75035 0 0 0.74955 0 0.0945] CT
2 setlinecap
1 LJ
2.667 LW
N
190.588 177 M
190.588 175.28 L
S
GR
GS
[0.75035 0 0 0.74955 0 0.0945] CT
2 setlinecap
1 LJ
2.667 LW
N
210.824 177 M
210.824 175.28 L
S
GR
GS
[0.75035 0 0 0.74955 0 0.0945] CT
2 setlinecap
1 LJ
2.667 LW
N
69.176 5 M
69.176 6.72 L
S
GR
GS
[0.75035 0 0 0.74955 0 0.0945] CT
2 setlinecap
1 LJ
2.667 LW
N
89.412 5 M
89.412 6.72 L
S
GR
GS
[0.75035 0 0 0.74955 0 0.0945] CT
2 setlinecap
1 LJ
2.667 LW
N
109.647 5 M
109.647 6.72 L
S
GR
GS
[0.75035 0 0 0.74955 0 0.0945] CT
2 setlinecap
1 LJ
2.667 LW
N
129.882 5 M
129.882 6.72 L
S
GR
GS
[0.75035 0 0 0.74955 0 0.0945] CT
2 setlinecap
1 LJ
2.667 LW
N
150.118 5 M
150.118 6.72 L
S
GR
GS
[0.75035 0 0 0.74955 0 0.0945] CT
2 setlinecap
1 LJ
2.667 LW
N
170.353 5 M
170.353 6.72 L
S
GR
GS
[0.75035 0 0 0.74955 0 0.0945] CT
2 setlinecap
1 LJ
2.667 LW
N
190.588 5 M
190.588 6.72 L
S
GR
GS
[0.75035 0 0 0.74955 0 0.0945] CT
2 setlinecap
1 LJ
2.667 LW
N
210.824 5 M
210.824 6.72 L
S
GR
GS
[0.53058 -0.53001 0.53058 0.53001 47.27188 153.00182] CT
/Helvetica-Bold 10.667 F
GS
[1 0 0 1 0 0] CT
0 0 moveto 
1 -1 scale
(WT) t 
GR
GR
GS
[0.53058 -0.53001 0.53058 0.53001 53.27466 141.00909] CT
/Helvetica-Bold 8.533 F
GS
[1 0 0 1 0 0] CT
0 0 moveto 
1 -1 scale
(+) t 
GR
GR
GS
[0.53058 -0.53001 0.53058 0.53001 58.52709 156] CT
/Helvetica-Bold 10.667 F
GS
[1 0 0 1 0 0] CT
0 0 moveto 
1 -1 scale
(sigV) t 
GR
GR
GS
[0.53058 -0.53001 0.53058 0.53001 68.28161 141.00909] CT
/Helvetica-Bold 8.533 F
GS
[1 0 0 1 0 0] CT
0 0 moveto 
1 -1 scale
(+) t 
GR
GR
GS
[0.53058 -0.53001 0.53058 0.53001 75.78508 155.25045] CT
/Helvetica-Bold 10.667 F
GS
[1 0 0 1 0 0] CT
0 0 moveto 
1 -1 scale
(rsiV) t 
GR
GR
GS
[0.53058 -0.53001 0.53058 0.53001 84.0389 141.75863] CT
/Helvetica-Bold 8.533 F
GS
[1 0 0 1 0 0] CT
0 0 moveto 
1 -1 scale
(+) t 
GR
GR
GS
[0.53058 -0.53001 0.53058 0.53001 89.29134 156.74955] CT
/Helvetica-Bold 10.667 F
GS
[1 0 0 1 0 0] CT
0 0 moveto 
1 -1 scale
(oatA) t 
GR
GR
GS
[0.53058 -0.53001 0.53058 0.53001 99.04585 141.00909] CT
/Helvetica-Bold 8.533 F
GS
[1 0 0 1 0 0] CT
0 0 moveto 
1 -1 scale
(+) t 
GR
GR
GS
[0.53058 -0.53001 0.53058 0.53001 103.54794 156.74955] CT
/Helvetica-Bold 10.667 F
GS
[1 0 0 1 0 0] CT
0 0 moveto 
1 -1 scale
(yrhK) t 
GR
GR
GS
[0.53058 -0.53001 0.53058 0.53001 114.0528 141.00909] CT
/Helvetica-Bold 8.533 F
GS
[1 0 0 1 0 0] CT
0 0 moveto 
1 -1 scale
(+) t 
GR
GR
GS
[0.53058 -0.53001 0.53058 0.53001 119.30523 156] CT
/Helvetica-Bold 10.667 F
GS
[1 0 0 1 0 0] CT
0 0 moveto 
1 -1 scale
(sipS) t 
GR
GR
GS
[0.53058 -0.53001 0.53058 0.53001 129.05975 141.00909] CT
/Helvetica-Bold 8.533 F
GS
[1 0 0 1 0 0] CT
0 0 moveto 
1 -1 scale
(+) t 
GR
GR
GS
[0.53058 -0.53001 0.53058 0.53001 135.06253 156.74955] CT
/Helvetica-Bold 10.667 F
GS
[1 0 0 1 0 0] CT
0 0 moveto 
1 -1 scale
(rasP) t 
GR
GR
GS
[0.53058 -0.53001 0.53058 0.53001 144.81704 141.00909] CT
/Helvetica-Bold 8.533 F
GS
[1 0 0 1 0 0] CT
0 0 moveto 
1 -1 scale
(+) t 
GR
GR
GS
[0.53058 -0.53001 0.53058 0.53001 148.56878 158.24864] CT
/Helvetica-Bold 10.667 F
GS
[1 0 0 1 0 0] CT
0 0 moveto 
1 -1 scale
(pbpX) t 
GR
GR
GS
[0.53058 -0.53001 0.53058 0.53001 160.57434 141.00909] CT
/Helvetica-Bold 8.533 F
GS
[1 0 0 1 0 0] CT
0 0 moveto 
1 -1 scale
(+) t 
GR
GR
GS
[0.75035 0 0 0.74955 0 0.0945] CT
2 setlinecap
1 LJ
2.667 LW
N
54 177 M
54 5 L
S
GR
GS
[0.75035 0 0 0.74955 0 0.0945] CT
2 setlinecap
1 LJ
2.667 LW
N
226 177 M
226 5 L
S
GR
GS
[0.75035 0 0 0.74955 0 0.0945] CT
2 setlinecap
1 LJ
2.667 LW
N
54 168.81 M
55.72 168.81 L
S
GR
GS
[0.75035 0 0 0.74955 0 0.0945] CT
2 setlinecap
1 LJ
2.667 LW
N
54 136.048 M
55.72 136.048 L
S
GR
GS
[0.75035 0 0 0.74955 0 0.0945] CT
2 setlinecap
1 LJ
2.667 LW
N
54 103.286 M
55.72 103.286 L
S
GR
GS
[0.75035 0 0 0.74955 0 0.0945] CT
2 setlinecap
1 LJ
2.667 LW
N
54 70.524 M
55.72 70.524 L
S
GR
GS
[0.75035 0 0 0.74955 0 0.0945] CT
2 setlinecap
1 LJ
2.667 LW
N
54 37.762 M
55.72 37.762 L
S
GR
GS
[0.75035 0 0 0.74955 0 0.0945] CT
2 setlinecap
1 LJ
2.667 LW
N
54 5 M
55.72 5 L
S
GR
GS
[0.75035 0 0 0.74955 0 0.0945] CT
2 setlinecap
1 LJ
2.667 LW
N
226 168.81 M
224.28 168.81 L
S
GR
GS
[0.75035 0 0 0.74955 0 0.0945] CT
2 setlinecap
1 LJ
2.667 LW
N
226 136.048 M
224.28 136.048 L
S
GR
GS
[0.75035 0 0 0.74955 0 0.0945] CT
2 setlinecap
1 LJ
2.667 LW
N
226 103.286 M
224.28 103.286 L
S
GR
GS
[0.75035 0 0 0.74955 0 0.0945] CT
2 setlinecap
1 LJ
2.667 LW
N
226 70.524 M
224.28 70.524 L
S
GR
GS
[0.75035 0 0 0.74955 0 0.0945] CT
2 setlinecap
1 LJ
2.667 LW
N
226 37.762 M
224.28 37.762 L
S
GR
GS
[0.75035 0 0 0.74955 0 0.0945] CT
2 setlinecap
1 LJ
2.667 LW
N
226 5 M
224.28 5 L
S
GR
GS
[0.75035 0 0 0.74955 38.91802 126.62495] CT
/Helvetica-Bold 10.667 F
GS
[1 0 0 1 0 0] CT
-6 3.5 moveto 
1 -1 scale
(0) t 
GR
GR
GS
[0.75035 0 0 0.74955 38.91802 102.06841] CT
/Helvetica-Bold 10.667 F
GS
[1 0 0 1 0 0] CT
-15 3.5 moveto 
1 -1 scale
(0.2) t 
GR
GR
GS
[0.75035 0 0 0.74955 38.91802 77.51186] CT
/Helvetica-Bold 10.667 F
GS
[1 0 0 1 0 0] CT
-15 3.5 moveto 
1 -1 scale
(0.4) t 
GR
GR
GS
[0.75035 0 0 0.74955 38.91802 52.95531] CT
/Helvetica-Bold 10.667 F
GS
[1 0 0 1 0 0] CT
-15 3.5 moveto 
1 -1 scale
(0.6) t 
GR
GR
GS
[0.75035 0 0 0.74955 38.91802 28.39877] CT
/Helvetica-Bold 10.667 F
GS
[1 0 0 1 0 0] CT
-15 3.5 moveto 
1 -1 scale
(0.8) t 
GR
GR
GS
[0.75035 0 0 0.74955 38.91802 3.84223] CT
/Helvetica-Bold 10.667 F
GS
[1 0 0 1 0 0] CT
-6 3.5 moveto 
1 -1 scale
(1) t 
GR
GR
GS
[0 -0.74955 0.75035 0 26.66234 68.30309] CT
/Helvetica-Bold 11.733 F
GS
[1 0 0 1 0 0] CT
-86.5 -3 moveto 
1 -1 scale
(Fraction of Activated Cells \(au\)) t 
GR
GR
GS
[0.75035 0 0 0.74955 0 0.0945] CT
1 GC
N
/f-627034828{273 177 M
444 177 L
444 5 L
273 5 L
cp}def
f-627034828
f
GR
GS
[0.75035 0 0 0.74955 0 0.0945] CT
1 LJ
0.667 LW
N
273 168.81 M
444 168.81 L
S
GR
GS
[0.75035 0 0 0.74955 0 0.0945] CT
1 0 0 RC
N
/f732347638{316.7 168.81 M
316.7 78.899 L
286.3 78.899 L
286.3 168.81 L
cp
354.7 168.81 M
354.7 168.704 L
324.3 168.704 L
324.3 168.81 L
cp
430.7 168.81 M
430.7 72.123 L
400.3 72.123 L
400.3 168.81 L
cp}def
f732347638
f
GR
GS
[0.75035 0 0 0.74955 0 0.0945] CT
10.0 ML
0.667 LW
N
286.3 168.81 M
286.3 78.899 L
316.7 78.899 L
316.7 168.81 L
cp
S
GR
GS
[0.75035 0 0 0.74955 0 0.0945] CT
10.0 ML
0.667 LW
N
324.3 168.81 M
324.3 168.704 L
354.7 168.704 L
354.7 168.81 L
cp
S
GR
GS
[0.75035 0 0 0.74955 0 0.0945] CT
10.0 ML
0.667 LW
N
362.3 168.81 M
362.3 168.81 L
392.7 168.81 L
392.7 168.81 L
cp
S
GR
GS
[0.75035 0 0 0.74955 0 0.0945] CT
10.0 ML
0.667 LW
N
400.3 168.81 M
400.3 72.123 L
430.7 72.123 L
430.7 168.81 L
cp
S
GR
GS
[0.75035 0 0 0.74955 0 0.0945] CT
1 LJ
0.667 LW
N
301.5 78.899 M
301.5 88.462 L
S
GR
GS
[0.75035 0 0 0.74955 0 0.0945] CT
1 LJ
0.667 LW
N
339.5 168.704 M
339.5 168.887 L
S
GR
GS
[0.75035 0 0 0.74955 0 0.0945] CT
1 LJ
0.667 LW
N
377.5 168.81 M
377.5 168.81 L
S
GR
GS
[0.75035 0 0 0.74955 0 0.0945] CT
1 LJ
0.667 LW
N
415.5 72.123 M
415.5 78.206 L
S
GR
GS
[0.75035 0 0 0.74955 0 0.0945] CT
1 LJ
0.667 LW
N
301.5 78.899 M
301.5 69.336 L
S
GR
GS
[0.75035 0 0 0.74955 0 0.0945] CT
1 LJ
0.667 LW
N
339.5 168.704 M
339.5 168.521 L
S
GR
GS
[0.75035 0 0 0.74955 0 0.0945] CT
1 LJ
0.667 LW
N
377.5 168.81 M
377.5 168.81 L
S
GR
GS
[0.75035 0 0 0.74955 0 0.0945] CT
1 LJ
0.667 LW
N
415.5 72.123 M
415.5 66.04 L
S
GR
GS
[0.75035 0 0 0.74955 226.22973 59.23294] CT
N
f-1057828618
f
GR
GS
[0.75035 0 0 0.74955 254.74293 126.54584] CT
N
f-1057828618
f
GR
GS
[0.75035 0 0 0.74955 283.25613 126.62495] CT
N
f-1057828618
f
GR
GS
[0.75035 0 0 0.74955 311.76933 54.15396] CT
N
f-1057828618
f
GR
GS
[0.75035 0 0 0.74955 226.22973 66.40057] CT
N
f-401390582
f
GR
GS
[0.75035 0 0 0.74955 226.22973 66.40057] CT
10.0 ML
0.667 LW
N
-4 0 M
4 0 L
S
GR
GS
[0.75035 0 0 0.74955 254.74293 126.68287] CT
N
f-401390582
f
GR
GS
[0.75035 0 0 0.74955 254.74293 126.68287] CT
10.0 ML
0.667 LW
N
-4 0 M
4 0 L
S
GR
GS
[0.75035 0 0 0.74955 283.25613 126.62495] CT
N
f-401390582
f
GR
GS
[0.75035 0 0 0.74955 283.25613 126.62495] CT
10.0 ML
0.667 LW
N
-4 0 M
4 0 L
S
GR
GS
[0.75035 0 0 0.74955 311.76933 58.71361] CT
N
f-401390582
f
GR
GS
[0.75035 0 0 0.74955 311.76933 58.71361] CT
10.0 ML
0.667 LW
N
-4 0 M
4 0 L
S
GR
GS
[0.75035 0 0 0.74955 226.22973 52.06532] CT
N
f-401390582
f
GR
GS
[0.75035 0 0 0.74955 226.22973 52.06532] CT
10.0 ML
0.667 LW
N
-4 0 M
4 0 L
S
GR
GS
[0.75035 0 0 0.74955 254.74293 126.40881] CT
N
f-401390582
f
GR
GS
[0.75035 0 0 0.74955 254.74293 126.40881] CT
10.0 ML
0.667 LW
N
-4 0 M
4 0 L
S
GR
GS
[0.75035 0 0 0.74955 283.25613 126.62495] CT
N
f-401390582
f
GR
GS
[0.75035 0 0 0.74955 283.25613 126.62495] CT
10.0 ML
0.667 LW
N
-4 0 M
4 0 L
S
GR
GS
[0.75035 0 0 0.74955 311.76933 49.59431] CT
N
f-401390582
f
GR
GS
[0.75035 0 0 0.74955 311.76933 49.59431] CT
10.0 ML
0.667 LW
N
-4 0 M
4 0 L
S
GR
GS
[0.75035 0 0 0.74955 0 0.0945] CT
2 setlinecap
1 LJ
2.667 LW
N
273 177 M
444 177 L
S
GR
GS
[0.75035 0 0 0.74955 0 0.0945] CT
2 setlinecap
1 LJ
2.667 LW
N
273 5 M
444 5 L
S
GR
GS
[0.75035 0 0 0.74955 0 0.0945] CT
2 setlinecap
1 LJ
2.667 LW
N
301.5 177 M
301.5 175.28 L
S
GR
GS
[0.75035 0 0 0.74955 0 0.0945] CT
2 setlinecap
1 LJ
2.667 LW
N
339.5 177 M
339.5 175.28 L
S
GR
GS
[0.75035 0 0 0.74955 0 0.0945] CT
2 setlinecap
1 LJ
2.667 LW
N
377.5 177 M
377.5 175.28 L
S
GR
GS
[0.75035 0 0 0.74955 0 0.0945] CT
2 setlinecap
1 LJ
2.667 LW
N
415.5 177 M
415.5 175.28 L
S
GR
GS
[0.75035 0 0 0.74955 0 0.0945] CT
2 setlinecap
1 LJ
2.667 LW
N
301.5 5 M
301.5 6.72 L
S
GR
GS
[0.75035 0 0 0.74955 0 0.0945] CT
2 setlinecap
1 LJ
2.667 LW
N
339.5 5 M
339.5 6.72 L
S
GR
GS
[0.75035 0 0 0.74955 0 0.0945] CT
2 setlinecap
1 LJ
2.667 LW
N
377.5 5 M
377.5 6.72 L
S
GR
GS
[0.75035 0 0 0.74955 0 0.0945] CT
2 setlinecap
1 LJ
2.667 LW
N
415.5 5 M
415.5 6.72 L
S
GR
GS
[0.53058 -0.53001 0.53058 0.53001 226.22973 134.36311] CT
/Helvetica-Bold 10.667 F
GS
[1 0 0 1 0 0] CT
-17 10 moveto 
1 -1 scale
(WT) t 
GR
GR
GS
[0.53058 -0.53001 0.53058 0.53001 243.11255 156.74955] CT
N
0.594 0 M
0.5 0 0.5 -0.094 QT
0.516 -0.094 0.516 -0.102 QT
0.516 -0.109 0.516 -0.125 QT
4.297 -7.75 L
4.344 -7.875 4.5 -7.875 QT
4.656 -7.875 L
5.797 -7.875 5.844 -7.75 QT
9.438 -0.125 L
9.438 -0.109 9.438 -0.102 QT
9.438 -0.094 9.438 -0.094 QT
9.438 0 8.563 0 QT
0.594 0 L
cp
2.328 -0.875 M
7.109 -0.875 L
4.609 -5.922 L
2.328 -0.875 L
cp
f
GR
GS
[0.53058 -0.53001 0.53058 0.53001 248.36498 151.50273] CT
/Helvetica-Bold 10.667 F
GS
[1 0 0 1 0 0] CT
0 0 moveto 
1 -1 scale
(sigV) t 
GR
GR
GS
[0.53058 -0.53001 0.53058 0.53001 272.37609 156] CT
N
/f-2062981648{0.594 0 M
0.5 0 0.5 -0.094 QT
0.516 -0.094 0.516 -0.102 QT
0.516 -0.109 0.516 -0.125 QT
4.297 -7.75 L
4.344 -7.875 4.5 -7.875 QT
4.656 -7.875 L
5.797 -7.875 5.844 -7.75 QT
9.438 -0.125 L
9.438 -0.109 9.438 -0.102 QT
9.438 -0.094 9.438 -0.094 QT
9.438 0 8.563 0 QT
0.594 0 L
cp
2.328 -0.875 M
7.109 -0.875 L
4.609 -5.922 L
2.328 -0.875 L
cp}def
f-2062981648
f
GR
GS
[0.53058 -0.53001 0.53058 0.53001 277.62852 150.75318] CT
/Helvetica-Bold 10.667 F
GS
[1 0 0 1 0 0] CT
0 0 moveto 
1 -1 scale
(rsiV) t 
GR
GR
GS
[0.53058 -0.53001 0.53058 0.53001 299.3886 157.49909] CT
N
f-2062981648
f
GR
GS
[0.53058 -0.53001 0.53058 0.53001 304.64103 152.25227] CT
/Helvetica-Bold 10.667 F
GS
[1 0 0 1 0 0] CT
0 0 moveto 
1 -1 scale
(oatA) t 
GR
GR
GS
[0.75035 0 0 0.74955 0 0.0945] CT
2 setlinecap
1 LJ
2.667 LW
N
273 177 M
273 5 L
S
GR
GS
[0.75035 0 0 0.74955 0 0.0945] CT
2 setlinecap
1 LJ
2.667 LW
N
444 177 M
444 5 L
S
GR
GS
[0.75035 0 0 0.74955 0 0.0945] CT
2 setlinecap
1 LJ
2.667 LW
N
273 168.81 M
274.72 168.81 L
S
GR
GS
[0.75035 0 0 0.74955 0 0.0945] CT
2 setlinecap
1 LJ
2.667 LW
N
273 136.048 M
274.72 136.048 L
S
GR
GS
[0.75035 0 0 0.74955 0 0.0945] CT
2 setlinecap
1 LJ
2.667 LW
N
273 103.286 M
274.72 103.286 L
S
GR
GS
[0.75035 0 0 0.74955 0 0.0945] CT
2 setlinecap
1 LJ
2.667 LW
N
273 70.524 M
274.72 70.524 L
S
GR
GS
[0.75035 0 0 0.74955 0 0.0945] CT
2 setlinecap
1 LJ
2.667 LW
N
273 37.762 M
274.72 37.762 L
S
GR
GS
[0.75035 0 0 0.74955 0 0.0945] CT
2 setlinecap
1 LJ
2.667 LW
N
273 5 M
274.72 5 L
S
GR
GS
[0.75035 0 0 0.74955 0 0.0945] CT
2 setlinecap
1 LJ
2.667 LW
N
444 168.81 M
442.28 168.81 L
S
GR
GS
[0.75035 0 0 0.74955 0 0.0945] CT
2 setlinecap
1 LJ
2.667 LW
N
444 136.048 M
442.28 136.048 L
S
GR
GS
[0.75035 0 0 0.74955 0 0.0945] CT
2 setlinecap
1 LJ
2.667 LW
N
444 103.286 M
442.28 103.286 L
S
GR
GS
[0.75035 0 0 0.74955 0 0.0945] CT
2 setlinecap
1 LJ
2.667 LW
N
444 70.524 M
442.28 70.524 L
S
GR
GS
[0.75035 0 0 0.74955 0 0.0945] CT
2 setlinecap
1 LJ
2.667 LW
N
444 37.762 M
442.28 37.762 L
S
GR
GS
[0.75035 0 0 0.74955 0 0.0945] CT
2 setlinecap
1 LJ
2.667 LW
N
444 5 M
442.28 5 L
S
GR
GS
[0.75035 0 0 0.74955 203.24409 126.62495] CT
/Helvetica-Bold 10.667 F
GS
[1 0 0 1 0 0] CT
-6 3.5 moveto 
1 -1 scale
(0) t 
GR
GR
GS
[0.75035 0 0 0.74955 203.24409 102.06841] CT
/Helvetica-Bold 10.667 F
GS
[1 0 0 1 0 0] CT
-15 3.5 moveto 
1 -1 scale
(0.2) t 
GR
GR
GS
[0.75035 0 0 0.74955 203.24409 77.51186] CT
/Helvetica-Bold 10.667 F
GS
[1 0 0 1 0 0] CT
-15 3.5 moveto 
1 -1 scale
(0.4) t 
GR
GR
GS
[0.75035 0 0 0.74955 203.24409 52.95531] CT
/Helvetica-Bold 10.667 F
GS
[1 0 0 1 0 0] CT
-15 3.5 moveto 
1 -1 scale
(0.6) t 
GR
GR
GS
[0.75035 0 0 0.74955 203.24409 28.39877] CT
/Helvetica-Bold 10.667 F
GS
[1 0 0 1 0 0] CT
-15 3.5 moveto 
1 -1 scale
(0.8) t 
GR
GR
GS
[0.75035 0 0 0.74955 203.24409 3.84223] CT
/Helvetica-Bold 10.667 F
GS
[1 0 0 1 0 0] CT
-6 3.5 moveto 
1 -1 scale
(1) t 
GR
GR
GS
[0 -0.74955 0.75035 0 190.98842 68.30309] CT
/Helvetica-Bold 11.733 F
GS
[1 0 0 1 0 0] CT
-86.5 -3 moveto 
1 -1 scale
(Fraction of Activated Cells \(au\)) t 
GR
GR
%%Trailer
%%Pages: 1
%%EOF
