%!PS-Adobe-3.0 EPSF-3.0
%%Creator: (MATLAB, The Mathworks, Inc. Version 9.10.0.1602886 \(R2021a\). Operating System: Windows 10)
%%Title: (C:/Users/christian.schwall/OneDrive - University Of Cambridge/SigV_paper_publish/EV5/Figure/MSB-20-9832_Figure_EV5.eps)
%%CreationDate: 2021-04-15T18:25:04
%%Pages: (atend)
%%BoundingBox:    15    50   504   508
%%LanguageLevel: 2
%%EndComments
%%BeginProlog
%%BeginResource: procset (Apache XML Graphics Std ProcSet) 1.2 0
%%Version: 1.2 0
%%Copyright: (Copyright 2001-2003,2010 The Apache Software Foundation. License terms: http://www.apache.org/licenses/LICENSE-2.0)
/bd{bind def}bind def
/ld{load def}bd
/GR/grestore ld
/GS/gsave ld
/RM/rmoveto ld
/C/curveto ld
/t/show ld
/L/lineto ld
/ML/setmiterlimit ld
/CT/concat ld
/f/fill ld
/N/newpath ld
/S/stroke ld
/CC/setcmykcolor ld
/A/ashow ld
/cp/closepath ld
/RC/setrgbcolor ld
/LJ/setlinejoin ld
/GC/setgray ld
/LW/setlinewidth ld
/M/moveto ld
/re {4 2 roll M
1 index 0 rlineto
0 exch rlineto
neg 0 rlineto
cp } bd
/_ctm matrix def
/_tm matrix def
/BT { _ctm currentmatrix pop matrix _tm copy pop 0 0 moveto } bd
/ET { _ctm setmatrix } bd
/iTm { _ctm setmatrix _tm concat } bd
/Tm { _tm astore pop iTm 0 0 moveto } bd
/ux 0.0 def
/uy 0.0 def
/F {
  /Tp exch def
  /Tf exch def
  Tf findfont Tp scalefont setfont
  /cf Tf def  /cs Tp def
} bd
/ULS {currentpoint /uy exch def /ux exch def} bd
/ULE {
  /Tcx currentpoint pop def
  gsave
  newpath
  cf findfont cs scalefont dup
  /FontMatrix get 0 get /Ts exch def /FontInfo get dup
  /UnderlinePosition get Ts mul /To exch def
  /UnderlineThickness get Ts mul /Tt exch def
  ux uy To add moveto  Tcx uy To add lineto
  Tt setlinewidth stroke
  grestore
} bd
/OLE {
  /Tcx currentpoint pop def
  gsave
  newpath
  cf findfont cs scalefont dup
  /FontMatrix get 0 get /Ts exch def /FontInfo get dup
  /UnderlinePosition get Ts mul /To exch def
  /UnderlineThickness get Ts mul /Tt exch def
  ux uy To add cs add moveto Tcx uy To add cs add lineto
  Tt setlinewidth stroke
  grestore
} bd
/SOE {
  /Tcx currentpoint pop def
  gsave
  newpath
  cf findfont cs scalefont dup
  /FontMatrix get 0 get /Ts exch def /FontInfo get dup
  /UnderlinePosition get Ts mul /To exch def
  /UnderlineThickness get Ts mul /Tt exch def
  ux uy To add cs 10 mul 26 idiv add moveto Tcx uy To add cs 10 mul 26 idiv add lineto
  Tt setlinewidth stroke
  grestore
} bd
/QT {
/Y22 exch store
/X22 exch store
/Y21 exch store
/X21 exch store
currentpoint
/Y21 load 2 mul add 3 div exch
/X21 load 2 mul add 3 div exch
/X21 load 2 mul /X22 load add 3 div
/Y21 load 2 mul /Y22 load add 3 div
/X22 load /Y22 load curveto
} bd
/SSPD {
dup length /d exch dict def
{
/v exch def
/k exch def
currentpagedevice k known {
/cpdv currentpagedevice k get def
v cpdv ne {
/upd false def
/nullv v type /nulltype eq def
/nullcpdv cpdv type /nulltype eq def
nullv nullcpdv or
{
/upd true def
} {
/sametype v type cpdv type eq def
sametype {
v type /arraytype eq {
/vlen v length def
/cpdvlen cpdv length def
vlen cpdvlen eq {
0 1 vlen 1 sub {
/i exch def
/obj v i get def
/cpdobj cpdv i get def
obj cpdobj ne {
/upd true def
exit
} if
} for
} {
/upd true def
} ifelse
} {
v type /dicttype eq {
v {
/dv exch def
/dk exch def
/cpddv cpdv dk get def
dv cpddv ne {
/upd true def
exit
} if
} forall
} {
/upd true def
} ifelse
} ifelse
} if
} ifelse
upd true eq {
d k v put
} if
} if
} if
} forall
d length 0 gt {
d setpagedevice
} if
} bd
/RE { % /NewFontName [NewEncodingArray] /FontName RE -
  findfont dup length dict begin
  {
    1 index /FID ne
    {def} {pop pop} ifelse
  } forall
  /Encoding exch def
  /FontName 1 index def
  currentdict definefont pop
  end
} bind def
%%EndResource
%%BeginResource: procset (Apache XML Graphics EPS ProcSet) 1.0 0
%%Version: 1.0 0
%%Copyright: (Copyright 2002-2003 The Apache Software Foundation. License terms: http://www.apache.org/licenses/LICENSE-2.0)
/BeginEPSF { %def
/b4_Inc_state save def         % Save state for cleanup
/dict_count countdictstack def % Count objects on dict stack
/op_count count 1 sub def      % Count objects on operand stack
userdict begin                 % Push userdict on dict stack
/showpage { } def              % Redefine showpage, { } = null proc
0 setgray 0 setlinecap         % Prepare graphics state
1 setlinewidth 0 setlinejoin
10 setmiterlimit [ ] 0 setdash newpath
/languagelevel where           % If level not equal to 1 then
{pop languagelevel             % set strokeadjust and
1 ne                           % overprint to their defaults.
{false setstrokeadjust false setoverprint
} if
} if
} bd
/EndEPSF { %def
count op_count sub {pop} repeat            % Clean up stacks
countdictstack dict_count sub {end} repeat
b4_Inc_state restore
} bd
%%EndResource
%FOPBeginFontDict
%%IncludeResource: font Courier-Oblique
%%IncludeResource: font Courier-BoldOblique
%%IncludeResource: font Courier-Bold
%%IncludeResource: font ZapfDingbats
%%IncludeResource: font Symbol
%%IncludeResource: font Helvetica
%%IncludeResource: font Helvetica-Oblique
%%IncludeResource: font Helvetica-Bold
%%IncludeResource: font Helvetica-BoldOblique
%%IncludeResource: font Times-Roman
%%IncludeResource: font Times-Italic
%%IncludeResource: font Times-Bold
%%IncludeResource: font Times-BoldItalic
%%IncludeResource: font Courier
%FOPEndFontDict
%%BeginResource: encoding WinAnsiEncoding
/WinAnsiEncoding [
/.notdef /.notdef /.notdef /.notdef /.notdef
/.notdef /.notdef /.notdef /.notdef /.notdef
/.notdef /.notdef /.notdef /.notdef /.notdef
/.notdef /.notdef /.notdef /.notdef /.notdef
/.notdef /.notdef /.notdef /.notdef /.notdef
/.notdef /.notdef /.notdef /.notdef /.notdef
/.notdef /.notdef /space /exclam /quotedbl
/numbersign /dollar /percent /ampersand /quotesingle
/parenleft /parenright /asterisk /plus /comma
/hyphen /period /slash /zero /one
/two /three /four /five /six
/seven /eight /nine /colon /semicolon
/less /equal /greater /question /at
/A /B /C /D /E
/F /G /H /I /J
/K /L /M /N /O
/P /Q /R /S /T
/U /V /W /X /Y
/Z /bracketleft /backslash /bracketright /asciicircum
/underscore /quoteleft /a /b /c
/d /e /f /g /h
/i /j /k /l /m
/n /o /p /q /r
/s /t /u /v /w
/x /y /z /braceleft /bar
/braceright /asciitilde /bullet /Euro /bullet
/quotesinglbase /florin /quotedblbase /ellipsis /dagger
/daggerdbl /circumflex /perthousand /Scaron /guilsinglleft
/OE /bullet /Zcaron /bullet /bullet
/quoteleft /quoteright /quotedblleft /quotedblright /bullet
/endash /emdash /asciitilde /trademark /scaron
/guilsinglright /oe /bullet /zcaron /Ydieresis
/space /exclamdown /cent /sterling /currency
/yen /brokenbar /section /dieresis /copyright
/ordfeminine /guillemotleft /logicalnot /sfthyphen /registered
/macron /degree /plusminus /twosuperior /threesuperior
/acute /mu /paragraph /middot /cedilla
/onesuperior /ordmasculine /guillemotright /onequarter /onehalf
/threequarters /questiondown /Agrave /Aacute /Acircumflex
/Atilde /Adieresis /Aring /AE /Ccedilla
/Egrave /Eacute /Ecircumflex /Edieresis /Igrave
/Iacute /Icircumflex /Idieresis /Eth /Ntilde
/Ograve /Oacute /Ocircumflex /Otilde /Odieresis
/multiply /Oslash /Ugrave /Uacute /Ucircumflex
/Udieresis /Yacute /Thorn /germandbls /agrave
/aacute /acircumflex /atilde /adieresis /aring
/ae /ccedilla /egrave /eacute /ecircumflex
/edieresis /igrave /iacute /icircumflex /idieresis
/eth /ntilde /ograve /oacute /ocircumflex
/otilde /odieresis /divide /oslash /ugrave
/uacute /ucircumflex /udieresis /yacute /thorn
/ydieresis
] def
%%EndResource
%FOPBeginFontReencode
/Courier-Oblique findfont
dup length dict begin
  {1 index /FID ne {def} {pop pop} ifelse} forall
  /Encoding WinAnsiEncoding def
  currentdict
end
/Courier-Oblique exch definefont pop
/Courier-BoldOblique findfont
dup length dict begin
  {1 index /FID ne {def} {pop pop} ifelse} forall
  /Encoding WinAnsiEncoding def
  currentdict
end
/Courier-BoldOblique exch definefont pop
/Courier-Bold findfont
dup length dict begin
  {1 index /FID ne {def} {pop pop} ifelse} forall
  /Encoding WinAnsiEncoding def
  currentdict
end
/Courier-Bold exch definefont pop
/Helvetica findfont
dup length dict begin
  {1 index /FID ne {def} {pop pop} ifelse} forall
  /Encoding WinAnsiEncoding def
  currentdict
end
/Helvetica exch definefont pop
/Helvetica-Oblique findfont
dup length dict begin
  {1 index /FID ne {def} {pop pop} ifelse} forall
  /Encoding WinAnsiEncoding def
  currentdict
end
/Helvetica-Oblique exch definefont pop
/Helvetica-Bold findfont
dup length dict begin
  {1 index /FID ne {def} {pop pop} ifelse} forall
  /Encoding WinAnsiEncoding def
  currentdict
end
/Helvetica-Bold exch definefont pop
/Helvetica-BoldOblique findfont
dup length dict begin
  {1 index /FID ne {def} {pop pop} ifelse} forall
  /Encoding WinAnsiEncoding def
  currentdict
end
/Helvetica-BoldOblique exch definefont pop
/Times-Roman findfont
dup length dict begin
  {1 index /FID ne {def} {pop pop} ifelse} forall
  /Encoding WinAnsiEncoding def
  currentdict
end
/Times-Roman exch definefont pop
/Times-Italic findfont
dup length dict begin
  {1 index /FID ne {def} {pop pop} ifelse} forall
  /Encoding WinAnsiEncoding def
  currentdict
end
/Times-Italic exch definefont pop
/Times-Bold findfont
dup length dict begin
  {1 index /FID ne {def} {pop pop} ifelse} forall
  /Encoding WinAnsiEncoding def
  currentdict
end
/Times-Bold exch definefont pop
/Times-BoldItalic findfont
dup length dict begin
  {1 index /FID ne {def} {pop pop} ifelse} forall
  /Encoding WinAnsiEncoding def
  currentdict
end
/Times-BoldItalic exch definefont pop
/Courier findfont
dup length dict begin
  {1 index /FID ne {def} {pop pop} ifelse} forall
  /Encoding WinAnsiEncoding def
  currentdict
end
/Courier exch definefont pop
%FOPEndFontReencode
%%EndProlog
%%Page: 1 1
%%PageBoundingBox: 0 0 510 510
%%BeginPageSetup
[1 0 0 -1 0 510] CT
%%EndPageSetup
GS
[0.75035 0 0 0.75035 0 -0.23621] CT
1 GC
N
0 0 680 680 re
f
GR
GS
[0.75035 0 0 0.75035 0 -0.23621] CT
1 GC
N
0 0 680 680 re
f
GR
GS
[0.75035 0 0 0.75035 0 -0.23621] CT
1 GC
N
54 612 M
332 612 L
332 348 L
54 348 L
cp
f
GR
GS
[0.75035 0 0 0.75035 0 -0.23621] CT
2 setlinecap
1 LJ
0.667 LW
N
54 612 M
332 612 L
S
GR
GS
[0.75035 0 0 0.75035 0 -0.23621] CT
2 setlinecap
1 LJ
0.667 LW
N
54 612 M
54 609.22 L
S
GR
GS
[0.75035 0 0 0.75035 0 -0.23621] CT
2 setlinecap
1 LJ
0.667 LW
N
109.6 612 M
109.6 609.22 L
S
GR
GS
[0.75035 0 0 0.75035 0 -0.23621] CT
2 setlinecap
1 LJ
0.667 LW
N
165.2 612 M
165.2 609.22 L
S
GR
GS
[0.75035 0 0 0.75035 0 -0.23621] CT
2 setlinecap
1 LJ
0.667 LW
N
220.8 612 M
220.8 609.22 L
S
GR
GS
[0.75035 0 0 0.75035 0 -0.23621] CT
2 setlinecap
1 LJ
0.667 LW
N
276.4 612 M
276.4 609.22 L
S
GR
GS
[0.75035 0 0 0.75035 0 -0.23621] CT
2 setlinecap
1 LJ
0.667 LW
N
332 612 M
332 609.22 L
S
GR
GS
[0.75035 0 0 0.75035 0 -0.23621] CT
2 setlinecap
1 LJ
0.667 LW
N
54 612 M
54 348 L
S
GR
GS
[0.75035 0 0 0.75035 0 -0.23621] CT
2 setlinecap
1 LJ
0.667 LW
N
54 612 M
56.78 612 L
S
GR
GS
[0.75035 0 0 0.75035 0 -0.23621] CT
2 setlinecap
1 LJ
0.667 LW
N
54 559.2 M
56.78 559.2 L
S
GR
GS
[0.75035 0 0 0.75035 0 -0.23621] CT
2 setlinecap
1 LJ
0.667 LW
N
54 506.4 M
56.78 506.4 L
S
GR
GS
[0.75035 0 0 0.75035 0 -0.23621] CT
2 setlinecap
1 LJ
0.667 LW
N
54 453.6 M
56.78 453.6 L
S
GR
GS
[0.75035 0 0 0.75035 0 -0.23621] CT
2 setlinecap
1 LJ
0.667 LW
N
54 400.8 M
56.78 400.8 L
S
GR
GS
[0.75035 0 0 0.75035 0 -0.23621] CT
2 setlinecap
1 LJ
0.667 LW
N
54 348 M
56.78 348 L
S
GR
GS
[0.75035 0 0 0.75035 0 -0.23621] CT
1 GC
N
386 612 M
663 612 L
663 348 L
386 348 L
cp
f
GR
GS
[0.75035 0 0 0.75035 0 -0.23621] CT
2 setlinecap
1 LJ
0.667 LW
N
386 612 M
663 612 L
S
GR
GS
[0.75035 0 0 0.75035 0 -0.23621] CT
2 setlinecap
1 LJ
0.667 LW
N
386 612 M
386 609.23 L
S
GR
GS
[0.75035 0 0 0.75035 0 -0.23621] CT
2 setlinecap
1 LJ
0.667 LW
N
441.4 612 M
441.4 609.23 L
S
GR
GS
[0.75035 0 0 0.75035 0 -0.23621] CT
2 setlinecap
1 LJ
0.667 LW
N
496.8 612 M
496.8 609.23 L
S
GR
GS
[0.75035 0 0 0.75035 0 -0.23621] CT
2 setlinecap
1 LJ
0.667 LW
N
552.2 612 M
552.2 609.23 L
S
GR
GS
[0.75035 0 0 0.75035 0 -0.23621] CT
2 setlinecap
1 LJ
0.667 LW
N
607.6 612 M
607.6 609.23 L
S
GR
GS
[0.75035 0 0 0.75035 0 -0.23621] CT
2 setlinecap
1 LJ
0.667 LW
N
663 612 M
663 609.23 L
S
GR
GS
[0.75035 0 0 0.75035 0 -0.23621] CT
2 setlinecap
1 LJ
0.667 LW
N
386 612 M
386 348 L
S
GR
GS
[0.75035 0 0 0.75035 0 -0.23621] CT
2 setlinecap
1 LJ
0.667 LW
N
386 612 M
388.77 612 L
S
GR
GS
[0.75035 0 0 0.75035 0 -0.23621] CT
2 setlinecap
1 LJ
0.667 LW
N
386 559.2 M
388.77 559.2 L
S
GR
GS
[0.75035 0 0 0.75035 0 -0.23621] CT
2 setlinecap
1 LJ
0.667 LW
N
386 506.4 M
388.77 506.4 L
S
GR
GS
[0.75035 0 0 0.75035 0 -0.23621] CT
2 setlinecap
1 LJ
0.667 LW
N
386 453.6 M
388.77 453.6 L
S
GR
GS
[0.75035 0 0 0.75035 0 -0.23621] CT
2 setlinecap
1 LJ
0.667 LW
N
386 400.8 M
388.77 400.8 L
S
GR
GS
[0.75035 0 0 0.75035 0 -0.23621] CT
2 setlinecap
1 LJ
0.667 LW
N
386 348 M
388.77 348 L
S
GR
GS
[0.75035 0 0 0.75035 0 -0.23621] CT
1 GC
N
54 281 M
332 281 L
332 17 L
54 17 L
cp
f
GR
GS
[0.75035 0 0 0.75035 0 -0.23621] CT
2 setlinecap
1 LJ
2.667 LW
N
54 281 M
332 281 L
S
GR
GS
[0.75035 0 0 0.75035 0 -0.23621] CT
2 setlinecap
1 LJ
2.667 LW
N
54 17 M
332 17 L
S
GR
GS
[0.75035 0 0 0.75035 0 -0.23621] CT
2 setlinecap
1 LJ
2.667 LW
N
54 281 M
54 278.22 L
S
GR
GS
[0.75035 0 0 0.75035 0 -0.23621] CT
2 setlinecap
1 LJ
2.667 LW
N
109.6 281 M
109.6 278.22 L
S
GR
GS
[0.75035 0 0 0.75035 0 -0.23621] CT
2 setlinecap
1 LJ
2.667 LW
N
165.2 281 M
165.2 278.22 L
S
GR
GS
[0.75035 0 0 0.75035 0 -0.23621] CT
2 setlinecap
1 LJ
2.667 LW
N
220.8 281 M
220.8 278.22 L
S
GR
GS
[0.75035 0 0 0.75035 0 -0.23621] CT
2 setlinecap
1 LJ
2.667 LW
N
276.4 281 M
276.4 278.22 L
S
GR
GS
[0.75035 0 0 0.75035 0 -0.23621] CT
2 setlinecap
1 LJ
2.667 LW
N
332 281 M
332 278.22 L
S
GR
GS
[0.75035 0 0 0.75035 0 -0.23621] CT
2 setlinecap
1 LJ
2.667 LW
N
54 17 M
54 19.78 L
S
GR
GS
[0.75035 0 0 0.75035 0 -0.23621] CT
2 setlinecap
1 LJ
2.667 LW
N
109.6 17 M
109.6 19.78 L
S
GR
GS
[0.75035 0 0 0.75035 0 -0.23621] CT
2 setlinecap
1 LJ
2.667 LW
N
165.2 17 M
165.2 19.78 L
S
GR
GS
[0.75035 0 0 0.75035 0 -0.23621] CT
2 setlinecap
1 LJ
2.667 LW
N
220.8 17 M
220.8 19.78 L
S
GR
GS
[0.75035 0 0 0.75035 0 -0.23621] CT
2 setlinecap
1 LJ
2.667 LW
N
276.4 17 M
276.4 19.78 L
S
GR
GS
[0.75035 0 0 0.75035 0 -0.23621] CT
2 setlinecap
1 LJ
2.667 LW
N
332 17 M
332 19.78 L
S
GR
GS
[0.75035 0 0 0.75035 40.51876 212.21214] CT
/Helvetica-Bold 10.667 F
GS
[1 0 0 1 0 0] CT
-3 10 moveto 
1 -1 scale
(0) t 
GR
GR
GS
[0.75035 0 0 0.75035 82.23807 212.21214] CT
/Helvetica-Bold 10.667 F
GS
[1 0 0 1 0 0] CT
-3 10 moveto 
1 -1 scale
(1) t 
GR
GR
GS
[0.75035 0 0 0.75035 123.95738 212.21214] CT
/Helvetica-Bold 10.667 F
GS
[1 0 0 1 0 0] CT
-3 10 moveto 
1 -1 scale
(2) t 
GR
GR
GS
[0.75035 0 0 0.75035 165.6767 212.21214] CT
/Helvetica-Bold 10.667 F
GS
[1 0 0 1 0 0] CT
-3 10 moveto 
1 -1 scale
(3) t 
GR
GR
GS
[0.75035 0 0 0.75035 207.39601 212.21214] CT
/Helvetica-Bold 10.667 F
GS
[1 0 0 1 0 0] CT
-3 10 moveto 
1 -1 scale
(4) t 
GR
GR
GS
[0.75035 0 0 0.75035 249.11532 212.21214] CT
/Helvetica-Bold 10.667 F
GS
[1 0 0 1 0 0] CT
-3 10 moveto 
1 -1 scale
(5) t 
GR
GR
GS
[0.75035 0 0 0.75035 144.81714 221.96666] CT
/Helvetica-Bold 11.733 F
GS
[1 0 0 1 0 0] CT
-64 11 moveto 
1 -1 scale
(Induction strength \(au\)) t 
GR
GR
GS
[0.75035 0 0 0.75035 0 -0.23621] CT
2 setlinecap
1 LJ
2.667 LW
N
54 281 M
54 17 L
S
GR
GS
[0.75035 0 0 0.75035 0 -0.23621] CT
2 setlinecap
1 LJ
2.667 LW
N
332 281 M
332 17 L
S
GR
GS
[0.75035 0 0 0.75035 0 -0.23621] CT
2 setlinecap
1 LJ
2.667 LW
N
54 281 M
56.78 281 L
S
GR
GS
[0.75035 0 0 0.75035 0 -0.23621] CT
2 setlinecap
1 LJ
2.667 LW
N
54 193 M
56.78 193 L
S
GR
GS
[0.75035 0 0 0.75035 0 -0.23621] CT
2 setlinecap
1 LJ
2.667 LW
N
54 105 M
56.78 105 L
S
GR
GS
[0.75035 0 0 0.75035 0 -0.23621] CT
2 setlinecap
1 LJ
2.667 LW
N
54 17 M
56.78 17 L
S
GR
GS
[0.75035 0 0 0.75035 0 -0.23621] CT
2 setlinecap
1 LJ
2.667 LW
N
332 281 M
329.22 281 L
S
GR
GS
[0.75035 0 0 0.75035 0 -0.23621] CT
2 setlinecap
1 LJ
2.667 LW
N
332 193 M
329.22 193 L
S
GR
GS
[0.75035 0 0 0.75035 0 -0.23621] CT
2 setlinecap
1 LJ
2.667 LW
N
332 105 M
329.22 105 L
S
GR
GS
[0.75035 0 0 0.75035 0 -0.23621] CT
2 setlinecap
1 LJ
2.667 LW
N
332 17 M
329.22 17 L
S
GR
GS
[0.75035 0 0 0.75035 38.91802 210.6114] CT
/Helvetica-Bold 10.667 F
GS
[1 0 0 1 0 0] CT
-6 3.5 moveto 
1 -1 scale
(0) t 
GR
GR
GS
[0.75035 0 0 0.75035 38.91802 144.58083] CT
/Helvetica-Bold 10.667 F
GS
[1 0 0 1 0 0] CT
-12 3.5 moveto 
1 -1 scale
(50) t 
GR
GR
GS
[0.75035 0 0 0.75035 38.91802 78.55027] CT
/Helvetica-Bold 10.667 F
GS
[1 0 0 1 0 0] CT
-18 3.5 moveto 
1 -1 scale
(100) t 
GR
GR
GS
[0.75035 0 0 0.75035 38.91802 12.5197] CT
/Helvetica-Bold 10.667 F
GS
[1 0 0 1 0 0] CT
-18 3.5 moveto 
1 -1 scale
(150) t 
GR
GR
GS
[0 -0.75035 0.75035 0 24.4113 111.56546] CT
/Helvetica-Bold 11.733 F
GS
[1 0 0 1 0 0] CT
-35.5 -3 moveto 
1 -1 scale
(Fold Change) t 
GR
GR
GS
[0.75035 0 0 0.75035 144.81718 10.86894] CT
/Helvetica-Bold 11.733 F
GS
[1 0 0 1 0 0] CT
-17 -3 moveto 
1 -1 scale
(Model) t 
GR
GR
GS
[0.75035 0 0 0.75035 0 -0.23621] CT
0.851 0.851 1 RC
N
76.24 128.538 M
87.36 128.538 L
98.48 128.538 L
109.6 128.538 L
120.72 128.538 L
131.84 128.538 L
142.96 128.538 L
154.08 128.538 L
165.2 128.538 L
176.32 128.538 L
187.44 128.538 L
198.56 128.538 L
209.68 128.538 L
220.8 128.538 L
231.92 128.538 L
243.04 128.538 L
254.16 128.538 L
265.28 128.538 L
276.4 128.538 L
287.52 128.538 L
298.64 128.538 L
309.76 128.538 L
320.88 128.538 L
332 128.538 L
332 30.666 L
320.88 30.666 L
309.76 30.666 L
298.64 30.666 L
287.52 30.666 L
276.4 30.666 L
265.28 30.666 L
254.16 30.666 L
243.04 30.666 L
231.92 30.666 L
220.8 30.666 L
209.68 30.666 L
198.56 30.666 L
187.44 30.666 L
176.32 30.666 L
165.2 30.666 L
154.08 30.666 L
142.96 30.666 L
131.84 30.666 L
120.72 30.666 L
109.6 30.666 L
98.48 30.666 L
87.36 30.666 L
76.24 30.666 L
65.12 30.666 L
65.12 128.538 L
cp
f
GR
GS
[0.75035 0 0 0.75035 0 -0.23621] CT
0.549 0.549 1 RC
1 LJ
0.667 LW
N
65.12 128.538 M
76.24 128.538 L
87.36 128.538 L
98.48 128.538 L
109.6 128.538 L
120.72 128.538 L
131.84 128.538 L
142.96 128.538 L
154.08 128.538 L
165.2 128.538 L
176.32 128.538 L
187.44 128.538 L
198.56 128.538 L
209.68 128.538 L
220.8 128.538 L
231.92 128.538 L
243.04 128.538 L
254.16 128.538 L
265.28 128.538 L
276.4 128.538 L
287.52 128.538 L
298.64 128.538 L
309.76 128.538 L
320.88 128.538 L
332 128.538 L
S
GR
GS
[0.75035 0 0 0.75035 0 -0.23621] CT
0.549 0.549 1 RC
1 LJ
0.667 LW
N
65.12 30.666 M
76.24 30.666 L
87.36 30.666 L
98.48 30.666 L
109.6 30.666 L
120.72 30.666 L
131.84 30.666 L
142.96 30.666 L
154.08 30.666 L
165.2 30.666 L
176.32 30.666 L
187.44 30.666 L
198.56 30.666 L
209.68 30.666 L
220.8 30.666 L
231.92 30.666 L
243.04 30.666 L
254.16 30.666 L
265.28 30.666 L
276.4 30.666 L
287.52 30.666 L
298.64 30.666 L
309.76 30.666 L
320.88 30.666 L
332 30.666 L
S
GR
GS
[0.75035 0 0 0.75035 0 -0.23621] CT
0 0 1 RC
1 LJ
0.667 LW
N
65.12 79.602 M
76.24 79.602 L
87.36 79.602 L
98.48 79.602 L
109.6 79.602 L
120.72 79.602 L
131.84 79.602 L
142.96 79.602 L
154.08 79.602 L
165.2 79.602 L
176.32 79.602 L
187.44 79.602 L
198.56 79.602 L
209.68 79.602 L
220.8 79.602 L
231.92 79.602 L
243.04 79.602 L
254.16 79.602 L
265.28 79.602 L
276.4 79.602 L
287.52 79.602 L
298.64 79.602 L
309.76 79.602 L
320.88 79.602 L
332 79.602 L
S
GR
GS
[0.75035 0 0 0.75035 0 -0.23621] CT
1 0.851 0.851 RC
N
87.36 272.333 M
98.48 270.46 L
109.6 269.151 L
120.72 268.109 L
131.84 267.939 L
142.96 267.849 L
154.08 265.693 L
165.2 265.721 L
176.32 264.434 L
187.44 262.578 L
198.56 262.218 L
209.68 260.066 L
220.8 261.573 L
231.92 260.991 L
243.04 258.791 L
254.16 260.256 L
265.28 260.156 L
276.4 257.922 L
287.52 258.235 L
298.64 256.218 L
309.76 257.004 L
320.88 257.151 L
332 258.474 L
332 231.597 L
320.88 231.993 L
309.76 233.692 L
298.64 237.468 L
287.52 239.613 L
276.4 237.285 L
265.28 241.848 L
254.16 242.585 L
243.04 242.909 L
231.92 244.059 L
220.8 243.777 L
209.68 245.513 L
198.56 248.198 L
187.44 247.308 L
176.32 249.425 L
165.2 253.849 L
154.08 254.392 L
142.96 252.621 L
131.84 255.7 L
120.72 258.904 L
109.6 259.77 L
98.48 261.181 L
87.36 263.472 L
76.24 266.331 L
65.12 270.006 L
65.12 275.444 L
76.24 273.514 L
cp
f
GR
GS
[0.75035 0 0 0.75035 0 -0.23621] CT
1 0.549 0.549 RC
1 LJ
0.667 LW
N
65.12 275.444 M
76.24 273.514 L
87.36 272.333 L
98.48 270.46 L
109.6 269.151 L
120.72 268.109 L
131.84 267.939 L
142.96 267.849 L
154.08 265.693 L
165.2 265.721 L
176.32 264.434 L
187.44 262.578 L
198.56 262.218 L
209.68 260.066 L
220.8 261.573 L
231.92 260.991 L
243.04 258.791 L
254.16 260.256 L
265.28 260.156 L
276.4 257.922 L
287.52 258.235 L
298.64 256.218 L
309.76 257.004 L
320.88 257.151 L
332 258.474 L
S
GR
GS
[0.75035 0 0 0.75035 0 -0.23621] CT
1 0.549 0.549 RC
1 LJ
0.667 LW
N
65.12 270.006 M
76.24 266.331 L
87.36 263.472 L
98.48 261.181 L
109.6 259.77 L
120.72 258.904 L
131.84 255.7 L
142.96 252.621 L
154.08 254.392 L
165.2 253.849 L
176.32 249.425 L
187.44 247.308 L
198.56 248.198 L
209.68 245.513 L
220.8 243.777 L
231.92 244.059 L
243.04 242.909 L
254.16 242.585 L
265.28 241.848 L
276.4 237.285 L
287.52 239.613 L
298.64 237.468 L
309.76 233.692 L
320.88 231.993 L
332 231.597 L
S
GR
GS
[0.75035 0 0 0.75035 0 -0.23621] CT
1 0 0 RC
1 LJ
0.667 LW
N
65.12 272.725 M
76.24 269.922 L
87.36 267.903 L
98.48 265.82 L
109.6 264.461 L
120.72 263.507 L
131.84 261.82 L
142.96 260.235 L
154.08 260.042 L
165.2 259.785 L
176.32 256.93 L
187.44 254.943 L
198.56 255.208 L
209.68 252.79 L
220.8 252.675 L
231.92 252.525 L
243.04 250.85 L
254.16 251.421 L
265.28 251.002 L
276.4 247.603 L
287.52 248.924 L
298.64 246.843 L
309.76 245.348 L
320.88 244.572 L
332 245.036 L
S
GR
GS
[0.75035 0 0 0.75035 0 -0.23621] CT
1 GC
N
322 162 M
322 136 L
185 136 L
185 162 L
cp
f
GR
GS
[0.75035 0 0 0.75035 174.08059 107.33246] CT
/Helvetica-Bold 9.6 F
GS
[1 0 0 1 0 0] CT
0 3.5 moveto 
1 -1 scale
(WT) t 
GR
GR
GS
[0.75035 0 0 0.75035 0 -0.23621] CT
0 0 1 RC
1 LJ
0.667 LW
N
189 143.358 M
229 143.358 L
S
GR
GS
[0.75035 0 0 0.75035 174.08059 115.79864] CT
/Helvetica-Bold 9.6 F
GS
[1 0 0 1 0 0] CT
0 3.5 moveto 
1 -1 scale
(No Feedback Loop) t 
GR
GR
GS
[0.75035 0 0 0.75035 0 -0.23621] CT
1 0 0 RC
1 LJ
0.667 LW
N
189 154.642 M
229 154.642 L
S
GR
GS
[0.75035 0 0 0.75035 0 -0.23621] CT
10.0 ML
2.667 LW
N
185 162 M
185 136 L
322 136 L
322 162 L
cp
S
GR
GS
[0.75035 0 0 0.75035 0 -0.23621] CT
1 GC
N
386 281 M
663 281 L
663 17 L
386 17 L
cp
f
GR
GS
[0.75035 0 0 0.75035 0 -0.23621] CT
2 setlinecap
1 LJ
2.667 LW
N
386 281 M
663 281 L
S
GR
GS
[0.75035 0 0 0.75035 0 -0.23621] CT
2 setlinecap
1 LJ
2.667 LW
N
386 17 M
663 17 L
S
GR
GS
[0.75035 0 0 0.75035 0 -0.23621] CT
2 setlinecap
1 LJ
2.667 LW
N
386 281 M
386 278.23 L
S
GR
GS
[0.75035 0 0 0.75035 0 -0.23621] CT
2 setlinecap
1 LJ
2.667 LW
N
478.333 281 M
478.333 278.23 L
S
GR
GS
[0.75035 0 0 0.75035 0 -0.23621] CT
2 setlinecap
1 LJ
2.667 LW
N
570.667 281 M
570.667 278.23 L
S
GR
GS
[0.75035 0 0 0.75035 0 -0.23621] CT
2 setlinecap
1 LJ
2.667 LW
N
663 281 M
663 278.23 L
S
GR
GS
[0.75035 0 0 0.75035 0 -0.23621] CT
2 setlinecap
1 LJ
2.667 LW
N
386 17 M
386 19.77 L
S
GR
GS
[0.75035 0 0 0.75035 0 -0.23621] CT
2 setlinecap
1 LJ
2.667 LW
N
478.333 17 M
478.333 19.77 L
S
GR
GS
[0.75035 0 0 0.75035 0 -0.23621] CT
2 setlinecap
1 LJ
2.667 LW
N
570.667 17 M
570.667 19.77 L
S
GR
GS
[0.75035 0 0 0.75035 0 -0.23621] CT
2 setlinecap
1 LJ
2.667 LW
N
663 17 M
663 19.77 L
S
GR
GS
[0.75035 0 0 0.75035 0 -0.23621] CT
2 setlinecap
1 LJ
2.667 LW
N
386 281 M
386 279.615 L
S
GR
GS
[0.75035 0 0 0.75035 0 -0.23621] CT
2 setlinecap
1 LJ
2.667 LW
N
413.795 281 M
413.795 279.615 L
S
GR
GS
[0.75035 0 0 0.75035 0 -0.23621] CT
2 setlinecap
1 LJ
2.667 LW
N
430.054 281 M
430.054 279.615 L
S
GR
GS
[0.75035 0 0 0.75035 0 -0.23621] CT
2 setlinecap
1 LJ
2.667 LW
N
441.59 281 M
441.59 279.615 L
S
GR
GS
[0.75035 0 0 0.75035 0 -0.23621] CT
2 setlinecap
1 LJ
2.667 LW
N
450.538 281 M
450.538 279.615 L
S
GR
GS
[0.75035 0 0 0.75035 0 -0.23621] CT
2 setlinecap
1 LJ
2.667 LW
N
457.849 281 M
457.849 279.615 L
S
GR
GS
[0.75035 0 0 0.75035 0 -0.23621] CT
2 setlinecap
1 LJ
2.667 LW
N
464.031 281 M
464.031 279.615 L
S
GR
GS
[0.75035 0 0 0.75035 0 -0.23621] CT
2 setlinecap
1 LJ
2.667 LW
N
469.385 281 M
469.385 279.615 L
S
GR
GS
[0.75035 0 0 0.75035 0 -0.23621] CT
2 setlinecap
1 LJ
2.667 LW
N
474.108 281 M
474.108 279.615 L
S
GR
GS
[0.75035 0 0 0.75035 0 -0.23621] CT
2 setlinecap
1 LJ
2.667 LW
N
478.333 281 M
478.333 279.615 L
S
GR
GS
[0.75035 0 0 0.75035 0 -0.23621] CT
2 setlinecap
1 LJ
2.667 LW
N
506.128 281 M
506.128 279.615 L
S
GR
GS
[0.75035 0 0 0.75035 0 -0.23621] CT
2 setlinecap
1 LJ
2.667 LW
N
522.388 281 M
522.388 279.615 L
S
GR
GS
[0.75035 0 0 0.75035 0 -0.23621] CT
2 setlinecap
1 LJ
2.667 LW
N
533.924 281 M
533.924 279.615 L
S
GR
GS
[0.75035 0 0 0.75035 0 -0.23621] CT
2 setlinecap
1 LJ
2.667 LW
N
542.872 281 M
542.872 279.615 L
S
GR
GS
[0.75035 0 0 0.75035 0 -0.23621] CT
2 setlinecap
1 LJ
2.667 LW
N
550.183 281 M
550.183 279.615 L
S
GR
GS
[0.75035 0 0 0.75035 0 -0.23621] CT
2 setlinecap
1 LJ
2.667 LW
N
556.364 281 M
556.364 279.615 L
S
GR
GS
[0.75035 0 0 0.75035 0 -0.23621] CT
2 setlinecap
1 LJ
2.667 LW
N
561.719 281 M
561.719 279.615 L
S
GR
GS
[0.75035 0 0 0.75035 0 -0.23621] CT
2 setlinecap
1 LJ
2.667 LW
N
566.442 281 M
566.442 279.615 L
S
GR
GS
[0.75035 0 0 0.75035 0 -0.23621] CT
2 setlinecap
1 LJ
2.667 LW
N
570.667 281 M
570.667 279.615 L
S
GR
GS
[0.75035 0 0 0.75035 0 -0.23621] CT
2 setlinecap
1 LJ
2.667 LW
N
598.462 281 M
598.462 279.615 L
S
GR
GS
[0.75035 0 0 0.75035 0 -0.23621] CT
2 setlinecap
1 LJ
2.667 LW
N
614.721 281 M
614.721 279.615 L
S
GR
GS
[0.75035 0 0 0.75035 0 -0.23621] CT
2 setlinecap
1 LJ
2.667 LW
N
626.257 281 M
626.257 279.615 L
S
GR
GS
[0.75035 0 0 0.75035 0 -0.23621] CT
2 setlinecap
1 LJ
2.667 LW
N
635.205 281 M
635.205 279.615 L
S
GR
GS
[0.75035 0 0 0.75035 0 -0.23621] CT
2 setlinecap
1 LJ
2.667 LW
N
642.516 281 M
642.516 279.615 L
S
GR
GS
[0.75035 0 0 0.75035 0 -0.23621] CT
2 setlinecap
1 LJ
2.667 LW
N
648.697 281 M
648.697 279.615 L
S
GR
GS
[0.75035 0 0 0.75035 0 -0.23621] CT
2 setlinecap
1 LJ
2.667 LW
N
654.052 281 M
654.052 279.615 L
S
GR
GS
[0.75035 0 0 0.75035 0 -0.23621] CT
2 setlinecap
1 LJ
2.667 LW
N
658.775 281 M
658.775 279.615 L
S
GR
GS
[0.75035 0 0 0.75035 0 -0.23621] CT
2 setlinecap
1 LJ
2.667 LW
N
663 281 M
663 279.615 L
S
GR
GS
[0.75035 0 0 0.75035 0 -0.23621] CT
2 setlinecap
1 LJ
2.667 LW
N
386 17 M
386 18.385 L
S
GR
GS
[0.75035 0 0 0.75035 0 -0.23621] CT
2 setlinecap
1 LJ
2.667 LW
N
413.795 17 M
413.795 18.385 L
S
GR
GS
[0.75035 0 0 0.75035 0 -0.23621] CT
2 setlinecap
1 LJ
2.667 LW
N
430.054 17 M
430.054 18.385 L
S
GR
GS
[0.75035 0 0 0.75035 0 -0.23621] CT
2 setlinecap
1 LJ
2.667 LW
N
441.59 17 M
441.59 18.385 L
S
GR
GS
[0.75035 0 0 0.75035 0 -0.23621] CT
2 setlinecap
1 LJ
2.667 LW
N
450.538 17 M
450.538 18.385 L
S
GR
GS
[0.75035 0 0 0.75035 0 -0.23621] CT
2 setlinecap
1 LJ
2.667 LW
N
457.849 17 M
457.849 18.385 L
S
GR
GS
[0.75035 0 0 0.75035 0 -0.23621] CT
2 setlinecap
1 LJ
2.667 LW
N
464.031 17 M
464.031 18.385 L
S
GR
GS
[0.75035 0 0 0.75035 0 -0.23621] CT
2 setlinecap
1 LJ
2.667 LW
N
469.385 17 M
469.385 18.385 L
S
GR
GS
[0.75035 0 0 0.75035 0 -0.23621] CT
2 setlinecap
1 LJ
2.667 LW
N
474.108 17 M
474.108 18.385 L
S
GR
GS
[0.75035 0 0 0.75035 0 -0.23621] CT
2 setlinecap
1 LJ
2.667 LW
N
478.333 17 M
478.333 18.385 L
S
GR
GS
[0.75035 0 0 0.75035 0 -0.23621] CT
2 setlinecap
1 LJ
2.667 LW
N
506.128 17 M
506.128 18.385 L
S
GR
GS
[0.75035 0 0 0.75035 0 -0.23621] CT
2 setlinecap
1 LJ
2.667 LW
N
522.388 17 M
522.388 18.385 L
S
GR
GS
[0.75035 0 0 0.75035 0 -0.23621] CT
2 setlinecap
1 LJ
2.667 LW
N
533.924 17 M
533.924 18.385 L
S
GR
GS
[0.75035 0 0 0.75035 0 -0.23621] CT
2 setlinecap
1 LJ
2.667 LW
N
542.872 17 M
542.872 18.385 L
S
GR
GS
[0.75035 0 0 0.75035 0 -0.23621] CT
2 setlinecap
1 LJ
2.667 LW
N
550.183 17 M
550.183 18.385 L
S
GR
GS
[0.75035 0 0 0.75035 0 -0.23621] CT
2 setlinecap
1 LJ
2.667 LW
N
556.364 17 M
556.364 18.385 L
S
GR
GS
[0.75035 0 0 0.75035 0 -0.23621] CT
2 setlinecap
1 LJ
2.667 LW
N
561.719 17 M
561.719 18.385 L
S
GR
GS
[0.75035 0 0 0.75035 0 -0.23621] CT
2 setlinecap
1 LJ
2.667 LW
N
566.442 17 M
566.442 18.385 L
S
GR
GS
[0.75035 0 0 0.75035 0 -0.23621] CT
2 setlinecap
1 LJ
2.667 LW
N
570.667 17 M
570.667 18.385 L
S
GR
GS
[0.75035 0 0 0.75035 0 -0.23621] CT
2 setlinecap
1 LJ
2.667 LW
N
598.462 17 M
598.462 18.385 L
S
GR
GS
[0.75035 0 0 0.75035 0 -0.23621] CT
2 setlinecap
1 LJ
2.667 LW
N
614.721 17 M
614.721 18.385 L
S
GR
GS
[0.75035 0 0 0.75035 0 -0.23621] CT
2 setlinecap
1 LJ
2.667 LW
N
626.257 17 M
626.257 18.385 L
S
GR
GS
[0.75035 0 0 0.75035 0 -0.23621] CT
2 setlinecap
1 LJ
2.667 LW
N
635.205 17 M
635.205 18.385 L
S
GR
GS
[0.75035 0 0 0.75035 0 -0.23621] CT
2 setlinecap
1 LJ
2.667 LW
N
642.516 17 M
642.516 18.385 L
S
GR
GS
[0.75035 0 0 0.75035 0 -0.23621] CT
2 setlinecap
1 LJ
2.667 LW
N
648.697 17 M
648.697 18.385 L
S
GR
GS
[0.75035 0 0 0.75035 0 -0.23621] CT
2 setlinecap
1 LJ
2.667 LW
N
654.052 17 M
654.052 18.385 L
S
GR
GS
[0.75035 0 0 0.75035 0 -0.23621] CT
2 setlinecap
1 LJ
2.667 LW
N
658.775 17 M
658.775 18.385 L
S
GR
GS
[0.75035 0 0 0.75035 0 -0.23621] CT
2 setlinecap
1 LJ
2.667 LW
N
663 17 M
663 18.385 L
S
GR
GS
[0.75035 0 0 0.75035 282.88096 221.86661] CT
/Helvetica-Bold 10.667 F
GS
[1 0 0 1 0 0] CT
0 0 moveto 
1 -1 scale
(10) t 
GR
GR
GS
[0.75035 0 0 0.75035 291.88512 218.11488] CT
/Helvetica-Bold 8.533 F
GS
[1 0 0 1 0 0] CT
0 0 moveto 
1 -1 scale
(0) t 
GR
GR
GS
[0.75035 0 0 0.75035 351.91291 221.86661] CT
/Helvetica-Bold 10.667 F
GS
[1 0 0 1 0 0] CT
0 0 moveto 
1 -1 scale
(10) t 
GR
GR
GS
[0.75035 0 0 0.75035 360.91708 218.11488] CT
/Helvetica-Bold 8.533 F
GS
[1 0 0 1 0 0] CT
0 0 moveto 
1 -1 scale
(1) t 
GR
GR
GS
[0.75035 0 0 0.75035 421.69522 221.86661] CT
/Helvetica-Bold 10.667 F
GS
[1 0 0 1 0 0] CT
0 0 moveto 
1 -1 scale
(10) t 
GR
GR
GS
[0.75035 0 0 0.75035 430.69939 218.11488] CT
/Helvetica-Bold 8.533 F
GS
[1 0 0 1 0 0] CT
0 0 moveto 
1 -1 scale
(2) t 
GR
GR
GS
[0.75035 0 0 0.75035 490.72717 221.86661] CT
/Helvetica-Bold 10.667 F
GS
[1 0 0 1 0 0] CT
0 0 moveto 
1 -1 scale
(10) t 
GR
GR
GS
[0.75035 0 0 0.75035 499.73134 218.11488] CT
/Helvetica-Bold 8.533 F
GS
[1 0 0 1 0 0] CT
0 0 moveto 
1 -1 scale
(3) t 
GR
GR
GS
[0.75035 0 0 0.75035 393.55728 224.2177] CT
/Helvetica-Bold 11.733 F
GS
[1 0 0 1 0 0] CT
-31 11 moveto 
1 -1 scale
(IPTG in uM) t 
GR
GR
GS
[0.75035 0 0 0.75035 0 -0.23621] CT
2 setlinecap
1 LJ
2.667 LW
N
386 281 M
386 17 L
S
GR
GS
[0.75035 0 0 0.75035 0 -0.23621] CT
2 setlinecap
1 LJ
2.667 LW
N
663 281 M
663 17 L
S
GR
GS
[0.75035 0 0 0.75035 0 -0.23621] CT
2 setlinecap
1 LJ
2.667 LW
N
386 281 M
388.77 281 L
S
GR
GS
[0.75035 0 0 0.75035 0 -0.23621] CT
2 setlinecap
1 LJ
2.667 LW
N
386 243.286 M
388.77 243.286 L
S
GR
GS
[0.75035 0 0 0.75035 0 -0.23621] CT
2 setlinecap
1 LJ
2.667 LW
N
386 205.571 M
388.77 205.571 L
S
GR
GS
[0.75035 0 0 0.75035 0 -0.23621] CT
2 setlinecap
1 LJ
2.667 LW
N
386 167.857 M
388.77 167.857 L
S
GR
GS
[0.75035 0 0 0.75035 0 -0.23621] CT
2 setlinecap
1 LJ
2.667 LW
N
386 130.143 M
388.77 130.143 L
S
GR
GS
[0.75035 0 0 0.75035 0 -0.23621] CT
2 setlinecap
1 LJ
2.667 LW
N
386 92.429 M
388.77 92.429 L
S
GR
GS
[0.75035 0 0 0.75035 0 -0.23621] CT
2 setlinecap
1 LJ
2.667 LW
N
386 54.714 M
388.77 54.714 L
S
GR
GS
[0.75035 0 0 0.75035 0 -0.23621] CT
2 setlinecap
1 LJ
2.667 LW
N
386 17 M
388.77 17 L
S
GR
GS
[0.75035 0 0 0.75035 0 -0.23621] CT
2 setlinecap
1 LJ
2.667 LW
N
663 281 M
660.23 281 L
S
GR
GS
[0.75035 0 0 0.75035 0 -0.23621] CT
2 setlinecap
1 LJ
2.667 LW
N
663 243.286 M
660.23 243.286 L
S
GR
GS
[0.75035 0 0 0.75035 0 -0.23621] CT
2 setlinecap
1 LJ
2.667 LW
N
663 205.571 M
660.23 205.571 L
S
GR
GS
[0.75035 0 0 0.75035 0 -0.23621] CT
2 setlinecap
1 LJ
2.667 LW
N
663 167.857 M
660.23 167.857 L
S
GR
GS
[0.75035 0 0 0.75035 0 -0.23621] CT
2 setlinecap
1 LJ
2.667 LW
N
663 130.143 M
660.23 130.143 L
S
GR
GS
[0.75035 0 0 0.75035 0 -0.23621] CT
2 setlinecap
1 LJ
2.667 LW
N
663 92.429 M
660.23 92.429 L
S
GR
GS
[0.75035 0 0 0.75035 0 -0.23621] CT
2 setlinecap
1 LJ
2.667 LW
N
663 54.714 M
660.23 54.714 L
S
GR
GS
[0.75035 0 0 0.75035 0 -0.23621] CT
2 setlinecap
1 LJ
2.667 LW
N
663 17 M
660.23 17 L
S
GR
GS
[0.75035 0 0 0.75035 288.03334 210.6114] CT
/Helvetica-Bold 10.667 F
GS
[1 0 0 1 0 0] CT
-6 3.5 moveto 
1 -1 scale
(0) t 
GR
GR
GS
[0.75035 0 0 0.75035 288.03334 182.31258] CT
/Helvetica-Bold 10.667 F
GS
[1 0 0 1 0 0] CT
-6 3.5 moveto 
1 -1 scale
(5) t 
GR
GR
GS
[0.75035 0 0 0.75035 288.03334 154.01377] CT
/Helvetica-Bold 10.667 F
GS
[1 0 0 1 0 0] CT
-12 3.5 moveto 
1 -1 scale
(10) t 
GR
GR
GS
[0.75035 0 0 0.75035 288.03334 125.71496] CT
/Helvetica-Bold 10.667 F
GS
[1 0 0 1 0 0] CT
-12 3.5 moveto 
1 -1 scale
(15) t 
GR
GR
GS
[0.75035 0 0 0.75035 288.03334 97.41614] CT
/Helvetica-Bold 10.667 F
GS
[1 0 0 1 0 0] CT
-12 3.5 moveto 
1 -1 scale
(20) t 
GR
GR
GS
[0.75035 0 0 0.75035 288.03334 69.11732] CT
/Helvetica-Bold 10.667 F
GS
[1 0 0 1 0 0] CT
-12 3.5 moveto 
1 -1 scale
(25) t 
GR
GR
GS
[0.75035 0 0 0.75035 288.03334 40.81851] CT
/Helvetica-Bold 10.667 F
GS
[1 0 0 1 0 0] CT
-12 3.5 moveto 
1 -1 scale
(30) t 
GR
GR
GS
[0.75035 0 0 0.75035 288.03334 12.5197] CT
/Helvetica-Bold 10.667 F
GS
[1 0 0 1 0 0] CT
-12 3.5 moveto 
1 -1 scale
(35) t 
GR
GR
GS
[0 -0.75035 0.75035 0 278.0287 111.56546] CT
/Helvetica-Bold 11.733 F
GS
[1 0 0 1 0 0] CT
-35.5 -3 moveto 
1 -1 scale
(Fold Change) t 
GR
GR
GS
[0.75035 0 0 0.75035 393.55756 10.86894] CT
/Helvetica-Bold 11.733 F
GS
[1 0 0 1 0 0] CT
-32 -3 moveto 
1 -1 scale
(Experiment) t 
GR
GR
GS
[0.75035 0 0 0.75035 0 -0.23621] CT
1 0.851 0.851 RC
N
385.967 253.744 M
385.967 253.744 L
385.967 255.822 L
386 255.822 L
413.795 257.511 L
450.538 251.454 L
478.333 242.286 L
506.128 244.592 L
542.872 259.339 L
570.667 268.275 L
598.462 278.196 L
635.205 278.347 L
663 273.719 L
663 270.683 L
635.205 267.157 L
598.462 266.309 L
570.667 263.41 L
542.872 256.435 L
506.128 229.32 L
478.333 235.362 L
450.538 245.393 L
413.795 253.447 L
386 253.744 L
cp
f
GR
GS
[0.75035 0 0 0.75035 0 -0.23621] CT
1 0.549 0.549 RC
1 LJ
0.667 LW
N
385.967 255.822 M
386 255.822 L
413.795 257.511 L
450.538 251.454 L
478.333 242.286 L
506.128 244.592 L
542.872 259.339 L
570.667 268.275 L
598.462 278.196 L
635.205 278.347 L
663 273.719 L
S
GR
GS
[0.75035 0 0 0.75035 0 -0.23621] CT
1 0.549 0.549 RC
1 LJ
0.667 LW
N
385.967 253.744 M
386 253.744 L
413.795 253.447 L
450.538 245.393 L
478.333 235.362 L
506.128 229.32 L
542.872 256.435 L
570.667 263.41 L
598.462 266.309 L
635.205 267.157 L
663 270.683 L
S
GR
GS
[0.75035 0 0 0.75035 0 -0.23621] CT
1 0 0 RC
1 LJ
0.667 LW
N
385.967 254.783 M
386 254.783 L
413.795 255.479 L
450.538 248.424 L
478.333 238.824 L
506.128 236.956 L
542.872 257.887 L
570.667 265.842 L
598.462 272.252 L
635.205 272.752 L
663 272.201 L
S
GR
GS
[0.75035 0 0 0.75035 0 -0.23621] CT
0.851 0.851 1 RC
N
385.967 129.516 M
385.967 129.516 L
386 129.516 L
413.795 129.516 L
450.538 129.516 L
478.333 129.516 L
506.128 129.516 L
542.872 129.516 L
570.667 129.516 L
598.462 129.516 L
635.205 129.516 L
663 129.516 L
663 31.138 L
635.205 31.138 L
598.462 31.138 L
570.667 31.138 L
542.872 31.138 L
506.128 31.138 L
478.333 31.138 L
450.538 31.138 L
413.795 31.138 L
386 31.138 L
385.967 31.138 L
cp
f
GR
GS
[0.75035 0 0 0.75035 0 -0.23621] CT
0.549 0.549 1 RC
1 LJ
0.667 LW
N
385.967 129.516 M
386 129.516 L
413.795 129.516 L
450.538 129.516 L
478.333 129.516 L
506.128 129.516 L
542.872 129.516 L
570.667 129.516 L
598.462 129.516 L
635.205 129.516 L
663 129.516 L
S
GR
GS
[0.75035 0 0 0.75035 0 -0.23621] CT
0.549 0.549 1 RC
1 LJ
0.667 LW
N
385.967 31.138 M
386 31.138 L
413.795 31.138 L
450.538 31.138 L
478.333 31.138 L
506.128 31.138 L
542.872 31.138 L
570.667 31.138 L
598.462 31.138 L
635.205 31.138 L
663 31.138 L
S
GR
GS
[0.75035 0 0 0.75035 0 -0.23621] CT
0 0 1 RC
1 LJ
0.667 LW
N
385.967 80.327 M
386 80.327 L
413.795 80.327 L
450.538 80.327 L
478.333 80.327 L
506.128 80.327 L
542.872 80.327 L
570.667 80.327 L
598.462 80.327 L
635.205 80.327 L
663 80.327 L
S
GR
GS
[0.75035 0 0 0.75035 0 -0.23621] CT
1 GC
N
653 162 M
653 136 L
516 136 L
516 162 L
cp
f
GR
GS
[0.75035 0 0 0.75035 422.44556 107.33246] CT
/Helvetica-Bold 9.6 F
GS
[1 0 0 1 0 0] CT
0 3.5 moveto 
1 -1 scale
(WT) t 
GR
GR
GS
[0.75035 0 0 0.75035 0 -0.23621] CT
0 0 1 RC
1 LJ
0.667 LW
N
520 143.358 M
560 143.358 L
S
GR
GS
[0.75035 0 0 0.75035 422.44556 115.79864] CT
/Helvetica-Bold 9.6 F
GS
[1 0 0 1 0 0] CT
0 3.5 moveto 
1 -1 scale
(No Feedback Loop) t 
GR
GR
GS
[0.75035 0 0 0.75035 0 -0.23621] CT
1 0 0 RC
1 LJ
0.667 LW
N
520 154.642 M
560 154.642 L
S
GR
GS
[0.75035 0 0 0.75035 0 -0.23621] CT
10.0 ML
2.667 LW
N
516 162 M
516 136 L
653 136 L
653 162 L
cp
S
GR
%%Trailer
%%Pages: 1
%%EOF
