%!PS-Adobe-3.0 EPSF-3.0
%%Creator: (MATLAB, The Mathworks, Inc. Version 9.10.0.1602886 \(R2021a\). Operating System: Windows 10)
%%Title: (C:/Users/christian.schwall/OneDrive - University Of Cambridge/SigV_paper_publish/Figure5/Figure/MSB-20-9832_Figure5.eps)
%%CreationDate: 2021-04-15T18:23:53
%%Pages: (atend)
%%BoundingBox:    40     0   499   157
%%LanguageLevel: 2
%%EndComments
%%BeginProlog
%%BeginResource: procset (Apache XML Graphics Std ProcSet) 1.2 0
%%Version: 1.2 0
%%Copyright: (Copyright 2001-2003,2010 The Apache Software Foundation. License terms: http://www.apache.org/licenses/LICENSE-2.0)
/bd{bind def}bind def
/ld{load def}bd
/GR/grestore ld
/GS/gsave ld
/RM/rmoveto ld
/C/curveto ld
/t/show ld
/L/lineto ld
/ML/setmiterlimit ld
/CT/concat ld
/f/fill ld
/N/newpath ld
/S/stroke ld
/CC/setcmykcolor ld
/A/ashow ld
/cp/closepath ld
/RC/setrgbcolor ld
/LJ/setlinejoin ld
/GC/setgray ld
/LW/setlinewidth ld
/M/moveto ld
/re {4 2 roll M
1 index 0 rlineto
0 exch rlineto
neg 0 rlineto
cp } bd
/_ctm matrix def
/_tm matrix def
/BT { _ctm currentmatrix pop matrix _tm copy pop 0 0 moveto } bd
/ET { _ctm setmatrix } bd
/iTm { _ctm setmatrix _tm concat } bd
/Tm { _tm astore pop iTm 0 0 moveto } bd
/ux 0.0 def
/uy 0.0 def
/F {
  /Tp exch def
  /Tf exch def
  Tf findfont Tp scalefont setfont
  /cf Tf def  /cs Tp def
} bd
/ULS {currentpoint /uy exch def /ux exch def} bd
/ULE {
  /Tcx currentpoint pop def
  gsave
  newpath
  cf findfont cs scalefont dup
  /FontMatrix get 0 get /Ts exch def /FontInfo get dup
  /UnderlinePosition get Ts mul /To exch def
  /UnderlineThickness get Ts mul /Tt exch def
  ux uy To add moveto  Tcx uy To add lineto
  Tt setlinewidth stroke
  grestore
} bd
/OLE {
  /Tcx currentpoint pop def
  gsave
  newpath
  cf findfont cs scalefont dup
  /FontMatrix get 0 get /Ts exch def /FontInfo get dup
  /UnderlinePosition get Ts mul /To exch def
  /UnderlineThickness get Ts mul /Tt exch def
  ux uy To add cs add moveto Tcx uy To add cs add lineto
  Tt setlinewidth stroke
  grestore
} bd
/SOE {
  /Tcx currentpoint pop def
  gsave
  newpath
  cf findfont cs scalefont dup
  /FontMatrix get 0 get /Ts exch def /FontInfo get dup
  /UnderlinePosition get Ts mul /To exch def
  /UnderlineThickness get Ts mul /Tt exch def
  ux uy To add cs 10 mul 26 idiv add moveto Tcx uy To add cs 10 mul 26 idiv add lineto
  Tt setlinewidth stroke
  grestore
} bd
/QT {
/Y22 exch store
/X22 exch store
/Y21 exch store
/X21 exch store
currentpoint
/Y21 load 2 mul add 3 div exch
/X21 load 2 mul add 3 div exch
/X21 load 2 mul /X22 load add 3 div
/Y21 load 2 mul /Y22 load add 3 div
/X22 load /Y22 load curveto
} bd
/SSPD {
dup length /d exch dict def
{
/v exch def
/k exch def
currentpagedevice k known {
/cpdv currentpagedevice k get def
v cpdv ne {
/upd false def
/nullv v type /nulltype eq def
/nullcpdv cpdv type /nulltype eq def
nullv nullcpdv or
{
/upd true def
} {
/sametype v type cpdv type eq def
sametype {
v type /arraytype eq {
/vlen v length def
/cpdvlen cpdv length def
vlen cpdvlen eq {
0 1 vlen 1 sub {
/i exch def
/obj v i get def
/cpdobj cpdv i get def
obj cpdobj ne {
/upd true def
exit
} if
} for
} {
/upd true def
} ifelse
} {
v type /dicttype eq {
v {
/dv exch def
/dk exch def
/cpddv cpdv dk get def
dv cpddv ne {
/upd true def
exit
} if
} forall
} {
/upd true def
} ifelse
} ifelse
} if
} ifelse
upd true eq {
d k v put
} if
} if
} if
} forall
d length 0 gt {
d setpagedevice
} if
} bd
/RE { % /NewFontName [NewEncodingArray] /FontName RE -
  findfont dup length dict begin
  {
    1 index /FID ne
    {def} {pop pop} ifelse
  } forall
  /Encoding exch def
  /FontName 1 index def
  currentdict definefont pop
  end
} bind def
%%EndResource
%%BeginResource: procset (Apache XML Graphics EPS ProcSet) 1.0 0
%%Version: 1.0 0
%%Copyright: (Copyright 2002-2003 The Apache Software Foundation. License terms: http://www.apache.org/licenses/LICENSE-2.0)
/BeginEPSF { %def
/b4_Inc_state save def         % Save state for cleanup
/dict_count countdictstack def % Count objects on dict stack
/op_count count 1 sub def      % Count objects on operand stack
userdict begin                 % Push userdict on dict stack
/showpage { } def              % Redefine showpage, { } = null proc
0 setgray 0 setlinecap         % Prepare graphics state
1 setlinewidth 0 setlinejoin
10 setmiterlimit [ ] 0 setdash newpath
/languagelevel where           % If level not equal to 1 then
{pop languagelevel             % set strokeadjust and
1 ne                           % overprint to their defaults.
{false setstrokeadjust false setoverprint
} if
} if
} bd
/EndEPSF { %def
count op_count sub {pop} repeat            % Clean up stacks
countdictstack dict_count sub {end} repeat
b4_Inc_state restore
} bd
%%EndResource
%FOPBeginFontDict
%%IncludeResource: font Courier-Oblique
%%IncludeResource: font Courier-BoldOblique
%%IncludeResource: font Courier-Bold
%%IncludeResource: font ZapfDingbats
%%IncludeResource: font Symbol
%%IncludeResource: font Helvetica
%%IncludeResource: font Helvetica-Oblique
%%IncludeResource: font Helvetica-Bold
%%IncludeResource: font Helvetica-BoldOblique
%%IncludeResource: font Times-Roman
%%IncludeResource: font Times-Italic
%%IncludeResource: font Times-Bold
%%IncludeResource: font Times-BoldItalic
%%IncludeResource: font Courier
%FOPEndFontDict
%%BeginResource: encoding WinAnsiEncoding
/WinAnsiEncoding [
/.notdef /.notdef /.notdef /.notdef /.notdef
/.notdef /.notdef /.notdef /.notdef /.notdef
/.notdef /.notdef /.notdef /.notdef /.notdef
/.notdef /.notdef /.notdef /.notdef /.notdef
/.notdef /.notdef /.notdef /.notdef /.notdef
/.notdef /.notdef /.notdef /.notdef /.notdef
/.notdef /.notdef /space /exclam /quotedbl
/numbersign /dollar /percent /ampersand /quotesingle
/parenleft /parenright /asterisk /plus /comma
/hyphen /period /slash /zero /one
/two /three /four /five /six
/seven /eight /nine /colon /semicolon
/less /equal /greater /question /at
/A /B /C /D /E
/F /G /H /I /J
/K /L /M /N /O
/P /Q /R /S /T
/U /V /W /X /Y
/Z /bracketleft /backslash /bracketright /asciicircum
/underscore /quoteleft /a /b /c
/d /e /f /g /h
/i /j /k /l /m
/n /o /p /q /r
/s /t /u /v /w
/x /y /z /braceleft /bar
/braceright /asciitilde /bullet /Euro /bullet
/quotesinglbase /florin /quotedblbase /ellipsis /dagger
/daggerdbl /circumflex /perthousand /Scaron /guilsinglleft
/OE /bullet /Zcaron /bullet /bullet
/quoteleft /quoteright /quotedblleft /quotedblright /bullet
/endash /emdash /asciitilde /trademark /scaron
/guilsinglright /oe /bullet /zcaron /Ydieresis
/space /exclamdown /cent /sterling /currency
/yen /brokenbar /section /dieresis /copyright
/ordfeminine /guillemotleft /logicalnot /sfthyphen /registered
/macron /degree /plusminus /twosuperior /threesuperior
/acute /mu /paragraph /middot /cedilla
/onesuperior /ordmasculine /guillemotright /onequarter /onehalf
/threequarters /questiondown /Agrave /Aacute /Acircumflex
/Atilde /Adieresis /Aring /AE /Ccedilla
/Egrave /Eacute /Ecircumflex /Edieresis /Igrave
/Iacute /Icircumflex /Idieresis /Eth /Ntilde
/Ograve /Oacute /Ocircumflex /Otilde /Odieresis
/multiply /Oslash /Ugrave /Uacute /Ucircumflex
/Udieresis /Yacute /Thorn /germandbls /agrave
/aacute /acircumflex /atilde /adieresis /aring
/ae /ccedilla /egrave /eacute /ecircumflex
/edieresis /igrave /iacute /icircumflex /idieresis
/eth /ntilde /ograve /oacute /ocircumflex
/otilde /odieresis /divide /oslash /ugrave
/uacute /ucircumflex /udieresis /yacute /thorn
/ydieresis
] def
%%EndResource
%FOPBeginFontReencode
/Courier-Oblique findfont
dup length dict begin
  {1 index /FID ne {def} {pop pop} ifelse} forall
  /Encoding WinAnsiEncoding def
  currentdict
end
/Courier-Oblique exch definefont pop
/Courier-BoldOblique findfont
dup length dict begin
  {1 index /FID ne {def} {pop pop} ifelse} forall
  /Encoding WinAnsiEncoding def
  currentdict
end
/Courier-BoldOblique exch definefont pop
/Courier-Bold findfont
dup length dict begin
  {1 index /FID ne {def} {pop pop} ifelse} forall
  /Encoding WinAnsiEncoding def
  currentdict
end
/Courier-Bold exch definefont pop
/Helvetica findfont
dup length dict begin
  {1 index /FID ne {def} {pop pop} ifelse} forall
  /Encoding WinAnsiEncoding def
  currentdict
end
/Helvetica exch definefont pop
/Helvetica-Oblique findfont
dup length dict begin
  {1 index /FID ne {def} {pop pop} ifelse} forall
  /Encoding WinAnsiEncoding def
  currentdict
end
/Helvetica-Oblique exch definefont pop
/Helvetica-Bold findfont
dup length dict begin
  {1 index /FID ne {def} {pop pop} ifelse} forall
  /Encoding WinAnsiEncoding def
  currentdict
end
/Helvetica-Bold exch definefont pop
/Helvetica-BoldOblique findfont
dup length dict begin
  {1 index /FID ne {def} {pop pop} ifelse} forall
  /Encoding WinAnsiEncoding def
  currentdict
end
/Helvetica-BoldOblique exch definefont pop
/Times-Roman findfont
dup length dict begin
  {1 index /FID ne {def} {pop pop} ifelse} forall
  /Encoding WinAnsiEncoding def
  currentdict
end
/Times-Roman exch definefont pop
/Times-Italic findfont
dup length dict begin
  {1 index /FID ne {def} {pop pop} ifelse} forall
  /Encoding WinAnsiEncoding def
  currentdict
end
/Times-Italic exch definefont pop
/Times-Bold findfont
dup length dict begin
  {1 index /FID ne {def} {pop pop} ifelse} forall
  /Encoding WinAnsiEncoding def
  currentdict
end
/Times-Bold exch definefont pop
/Times-BoldItalic findfont
dup length dict begin
  {1 index /FID ne {def} {pop pop} ifelse} forall
  /Encoding WinAnsiEncoding def
  currentdict
end
/Times-BoldItalic exch definefont pop
/Courier findfont
dup length dict begin
  {1 index /FID ne {def} {pop pop} ifelse} forall
  /Encoding WinAnsiEncoding def
  currentdict
end
/Courier exch definefont pop
%FOPEndFontReencode
%%EndProlog
%%Page: 1 1
%%PageBoundingBox: 0 0 510 156
%%BeginPageSetup
[1 0 0 -1 0 156] CT
%%EndPageSetup
GS
[0.75035 0 0 0.74955 0 0.0945] CT
1 GC
N
0 0 680 208 re
f
GR
GS
[0.75035 0 0 0.74955 0 0.0945] CT
1 GC
N
0 0 680 208 re
f
GR
GS
[0.75035 0 0 0.74955 0 0.0945] CT
1 GC
N
54 177 M
226 177 L
226 5 L
54 5 L
cp
f
GR
GS
[0.75035 0 0 0.74955 0 0.0945] CT
2 setlinecap
1 LJ
0.667 LW
N
54 177 M
226 177 L
S
GR
GS
[0.75035 0 0 0.74955 0 0.0945] CT
2 setlinecap
1 LJ
0.667 LW
N
54 177 M
54 175.28 L
S
GR
GS
[0.75035 0 0 0.74955 0 0.0945] CT
2 setlinecap
1 LJ
0.667 LW
N
140 177 M
140 175.28 L
S
GR
GS
[0.75035 0 0 0.74955 0 0.0945] CT
2 setlinecap
1 LJ
0.667 LW
N
226 177 M
226 175.28 L
S
GR
GS
[0.75035 0 0 0.74955 0 0.0945] CT
2 setlinecap
1 LJ
0.667 LW
N
54 177 M
54 5 L
S
GR
GS
[0.75035 0 0 0.74955 0 0.0945] CT
2 setlinecap
1 LJ
0.667 LW
N
54 177 M
55.72 177 L
S
GR
GS
[0.75035 0 0 0.74955 0 0.0945] CT
2 setlinecap
1 LJ
0.667 LW
N
54 142.6 M
55.72 142.6 L
S
GR
GS
[0.75035 0 0 0.74955 0 0.0945] CT
2 setlinecap
1 LJ
0.667 LW
N
54 108.2 M
55.72 108.2 L
S
GR
GS
[0.75035 0 0 0.74955 0 0.0945] CT
2 setlinecap
1 LJ
0.667 LW
N
54 73.8 M
55.72 73.8 L
S
GR
GS
[0.75035 0 0 0.74955 0 0.0945] CT
2 setlinecap
1 LJ
0.667 LW
N
54 39.4 M
55.72 39.4 L
S
GR
GS
[0.75035 0 0 0.74955 0 0.0945] CT
2 setlinecap
1 LJ
0.667 LW
N
54 5 M
55.72 5 L
S
GR
GS
[0.75035 0 0 0.74955 0 0.0945] CT
1 GC
N
273 177 M
444 177 L
444 5 L
273 5 L
cp
f
GR
GS
[0.75035 0 0 0.74955 268.99978 2.19323] CT
/Helvetica-Bold 11.733 F
GS
[1 0 0 1 0 0] CT
-17 -3 moveto 
1 -1 scale
(Model) t 
GR
GR
GS
[0.75035 0 0 0.74955 0 0.0945] CT
1 LJ
0.667 LW
N
273 177 M
444 177 L
S
GR
GS
[0.75035 0 0 0.74955 0 0.0945] CT
1 0 0 RC
N
311.475 177 M
311.475 41.058 L
277.275 41.058 L
277.275 177 L
cp
354.225 177 M
354.225 13.19 L
320.025 13.19 L
320.025 177 L
cp
396.975 177 M
396.975 109.146 L
362.775 109.146 L
362.775 177 L
cp
439.725 177 M
439.725 13.19 L
405.525 13.19 L
405.525 177 L
cp
f
GR
GS
[0.75035 0 0 0.74955 0 0.0945] CT
10.0 ML
0.667 LW
N
277.275 177 M
277.275 41.058 L
311.475 41.058 L
311.475 177 L
cp
S
GR
GS
[0.75035 0 0 0.74955 0 0.0945] CT
10.0 ML
0.667 LW
N
320.025 177 M
320.025 13.19 L
354.225 13.19 L
354.225 177 L
cp
S
GR
GS
[0.75035 0 0 0.74955 0 0.0945] CT
10.0 ML
0.667 LW
N
362.775 177 M
362.775 109.146 L
396.975 109.146 L
396.975 177 L
cp
S
GR
GS
[0.75035 0 0 0.74955 0 0.0945] CT
10.0 ML
0.667 LW
N
405.525 177 M
405.525 13.19 L
439.725 13.19 L
439.725 177 L
cp
S
GR
GS
[0.75035 0 0 0.74955 0 0.0945] CT
1 LJ
0.667 LW
N
294.375 41.058 M
294.375 47.161 L
S
GR
GS
[0.75035 0 0 0.74955 0 0.0945] CT
1 LJ
0.667 LW
N
337.125 13.19 M
337.125 13.19 L
S
GR
GS
[0.75035 0 0 0.74955 0 0.0945] CT
1 LJ
0.667 LW
N
379.875 109.146 M
379.875 117.04 L
S
GR
GS
[0.75035 0 0 0.74955 0 0.0945] CT
1 LJ
0.667 LW
N
422.625 13.19 M
422.625 13.19 L
S
GR
GS
[0.75035 0 0 0.74955 0 0.0945] CT
1 LJ
0.667 LW
N
294.375 41.058 M
294.375 34.955 L
S
GR
GS
[0.75035 0 0 0.74955 0 0.0945] CT
1 LJ
0.667 LW
N
337.125 13.19 M
337.125 13.19 L
S
GR
GS
[0.75035 0 0 0.74955 0 0.0945] CT
1 LJ
0.667 LW
N
379.875 109.146 M
379.875 101.252 L
S
GR
GS
[0.75035 0 0 0.74955 0 0.0945] CT
1 LJ
0.667 LW
N
422.625 13.19 M
422.625 13.19 L
S
GR
GS
[0.75035 0 0 0.74955 220.8835 30.86931] CT
N
1.333 0 M
1.333 0.736 0.736 1.333 0 1.333 C
-0.736 1.333 -1.333 0.736 -1.333 0 C
-1.333 -0.736 -0.736 -1.333 0 -1.333 C
0.736 -1.333 1.333 -0.736 1.333 0 C
cp
f
GR
GS
[0.75035 0 0 0.74955 252.96085 9.98136] CT
N
/f-1057828618{1.333 0 M
1.333 0.736 0.736 1.333 0 1.333 C
-0.736 1.333 -1.333 0.736 -1.333 0 C
-1.333 -0.736 -0.736 -1.333 0 -1.333 C
0.736 -1.333 1.333 -0.736 1.333 0 C
cp}def
f-1057828618
f
GR
GS
[0.75035 0 0 0.74955 285.0382 81.90475] CT
N
f-1057828618
f
GR
GS
[0.75035 0 0 0.74955 317.11555 9.98136] CT
N
f-1057828618
f
GR
GS
[0.75035 0 0 0.74955 220.8835 35.44349] CT
N
-2 0 M
2 0 L
f
GR
GS
[0.75035 0 0 0.74955 220.8835 35.44349] CT
10.0 ML
0.667 LW
N
-2 0 M
2 0 L
S
GR
GS
[0.75035 0 0 0.74955 252.96085 9.98136] CT
N
/f-1104302202{-2 0 M
2 0 L}def
f-1104302202
f
GR
GS
[0.75035 0 0 0.74955 252.96085 9.98136] CT
10.0 ML
0.667 LW
N
-2 0 M
2 0 L
S
GR
GS
[0.75035 0 0 0.74955 285.0382 87.82166] CT
N
f-1104302202
f
GR
GS
[0.75035 0 0 0.74955 285.0382 87.82166] CT
10.0 ML
0.667 LW
N
-2 0 M
2 0 L
S
GR
GS
[0.75035 0 0 0.74955 317.11555 9.98136] CT
N
f-1104302202
f
GR
GS
[0.75035 0 0 0.74955 317.11555 9.98136] CT
10.0 ML
0.667 LW
N
-2 0 M
2 0 L
S
GR
GS
[0.75035 0 0 0.74955 220.8835 26.29512] CT
N
f-1104302202
f
GR
GS
[0.75035 0 0 0.74955 220.8835 26.29512] CT
10.0 ML
0.667 LW
N
-2 0 M
2 0 L
S
GR
GS
[0.75035 0 0 0.74955 252.96085 9.98136] CT
N
f-1104302202
f
GR
GS
[0.75035 0 0 0.74955 252.96085 9.98136] CT
10.0 ML
0.667 LW
N
-2 0 M
2 0 L
S
GR
GS
[0.75035 0 0 0.74955 285.0382 75.98785] CT
N
f-1104302202
f
GR
GS
[0.75035 0 0 0.74955 285.0382 75.98785] CT
10.0 ML
0.667 LW
N
-2 0 M
2 0 L
S
GR
GS
[0.75035 0 0 0.74955 317.11555 9.98136] CT
N
f-1104302202
f
GR
GS
[0.75035 0 0 0.74955 317.11555 9.98136] CT
10.0 ML
0.667 LW
N
-2 0 M
2 0 L
S
GR
GS
[0.75035 0 0 0.74955 0 0.0945] CT
1 0 0 RC
[1 3] 0 setdash
2 LJ
0.667 LW
N
272.98 41.058 M
444.02 41.058 L
S
GR
GS
[0.75035 0 0 0.74955 0 0.0945] CT
2 setlinecap
1 LJ
2.667 LW
N
273 177 M
444 177 L
S
GR
GS
[0.75035 0 0 0.74955 0 0.0945] CT
2 setlinecap
1 LJ
2.667 LW
N
273 5 M
444 5 L
S
GR
GS
[0.75035 0 0 0.74955 0 0.0945] CT
2 setlinecap
1 LJ
2.667 LW
N
294.375 177 M
294.375 175.28 L
S
GR
GS
[0.75035 0 0 0.74955 0 0.0945] CT
2 setlinecap
1 LJ
2.667 LW
N
337.125 177 M
337.125 175.28 L
S
GR
GS
[0.75035 0 0 0.74955 0 0.0945] CT
2 setlinecap
1 LJ
2.667 LW
N
379.875 177 M
379.875 175.28 L
S
GR
GS
[0.75035 0 0 0.74955 0 0.0945] CT
2 setlinecap
1 LJ
2.667 LW
N
422.625 177 M
422.625 175.28 L
S
GR
GS
[0.75035 0 0 0.74955 0 0.0945] CT
2 setlinecap
1 LJ
2.667 LW
N
294.375 5 M
294.375 6.72 L
S
GR
GS
[0.75035 0 0 0.74955 0 0.0945] CT
2 setlinecap
1 LJ
2.667 LW
N
337.125 5 M
337.125 6.72 L
S
GR
GS
[0.75035 0 0 0.74955 0 0.0945] CT
2 setlinecap
1 LJ
2.667 LW
N
379.875 5 M
379.875 6.72 L
S
GR
GS
[0.75035 0 0 0.74955 0 0.0945] CT
2 setlinecap
1 LJ
2.667 LW
N
422.625 5 M
422.625 6.72 L
S
GR
GS
[0.64982 -0.37477 0.37517 0.64913 220.8835 134.36311] CT
/Helvetica-Bold 10.667 F
GS
[1 0 0 1 0 0] CT
-17 10 moveto 
1 -1 scale
(WT) t 
GR
GR
GS
[0.64982 -0.37477 0.37517 0.64913 252.96085 134.36311] CT
/Helvetica-Bold 10.667 F
GS
[1 0 0 1 0 0] CT
-35 10 moveto 
1 -1 scale
(2xsigV) t 
GR
GR
GS
[0.64982 -0.37477 0.37517 0.64913 285.0382 134.36311] CT
/Helvetica-Bold 10.667 F
GS
[1 0 0 1 0 0] CT
-32 10 moveto 
1 -1 scale
(2xrsiV) t 
GR
GR
GS
[0.64982 -0.37477 0.37517 0.64913 317.11555 134.36311] CT
/Helvetica-Bold 10.667 F
GS
[1 0 0 1 0 0] CT
-55 10 moveto 
1 -1 scale
(2xsigVrsiV) t 
GR
GR
GS
[0.75035 0 0 0.74955 0 0.0945] CT
2 setlinecap
1 LJ
2.667 LW
N
273 177 M
273 5 L
S
GR
GS
[0.75035 0 0 0.74955 0 0.0945] CT
2 setlinecap
1 LJ
2.667 LW
N
444 177 M
444 5 L
S
GR
GS
[0.75035 0 0 0.74955 0 0.0945] CT
2 setlinecap
1 LJ
2.667 LW
N
273 177 M
274.72 177 L
S
GR
GS
[0.75035 0 0 0.74955 0 0.0945] CT
2 setlinecap
1 LJ
2.667 LW
N
273 144.238 M
274.72 144.238 L
S
GR
GS
[0.75035 0 0 0.74955 0 0.0945] CT
2 setlinecap
1 LJ
2.667 LW
N
273 111.476 M
274.72 111.476 L
S
GR
GS
[0.75035 0 0 0.74955 0 0.0945] CT
2 setlinecap
1 LJ
2.667 LW
N
273 78.714 M
274.72 78.714 L
S
GR
GS
[0.75035 0 0 0.74955 0 0.0945] CT
2 setlinecap
1 LJ
2.667 LW
N
273 45.952 M
274.72 45.952 L
S
GR
GS
[0.75035 0 0 0.74955 0 0.0945] CT
2 setlinecap
1 LJ
2.667 LW
N
273 13.19 M
274.72 13.19 L
S
GR
GS
[0.75035 0 0 0.74955 0 0.0945] CT
2 setlinecap
1 LJ
2.667 LW
N
444 177 M
442.28 177 L
S
GR
GS
[0.75035 0 0 0.74955 0 0.0945] CT
2 setlinecap
1 LJ
2.667 LW
N
444 144.238 M
442.28 144.238 L
S
GR
GS
[0.75035 0 0 0.74955 0 0.0945] CT
2 setlinecap
1 LJ
2.667 LW
N
444 111.476 M
442.28 111.476 L
S
GR
GS
[0.75035 0 0 0.74955 0 0.0945] CT
2 setlinecap
1 LJ
2.667 LW
N
444 78.714 M
442.28 78.714 L
S
GR
GS
[0.75035 0 0 0.74955 0 0.0945] CT
2 setlinecap
1 LJ
2.667 LW
N
444 45.952 M
442.28 45.952 L
S
GR
GS
[0.75035 0 0 0.74955 0 0.0945] CT
2 setlinecap
1 LJ
2.667 LW
N
444 13.19 M
442.28 13.19 L
S
GR
GS
[0.75035 0 0 0.74955 203.24409 132.76408] CT
/Helvetica-Bold 10.667 F
GS
[1 0 0 1 0 0] CT
-6 3.5 moveto 
1 -1 scale
(0) t 
GR
GR
GS
[0.75035 0 0 0.74955 203.24409 108.20754] CT
/Helvetica-Bold 10.667 F
GS
[1 0 0 1 0 0] CT
-15 3.5 moveto 
1 -1 scale
(0.2) t 
GR
GR
GS
[0.75035 0 0 0.74955 203.24409 83.65099] CT
/Helvetica-Bold 10.667 F
GS
[1 0 0 1 0 0] CT
-15 3.5 moveto 
1 -1 scale
(0.4) t 
GR
GR
GS
[0.75035 0 0 0.74955 203.24409 59.09445] CT
/Helvetica-Bold 10.667 F
GS
[1 0 0 1 0 0] CT
-15 3.5 moveto 
1 -1 scale
(0.6) t 
GR
GR
GS
[0.75035 0 0 0.74955 203.24409 34.5379] CT
/Helvetica-Bold 10.667 F
GS
[1 0 0 1 0 0] CT
-15 3.5 moveto 
1 -1 scale
(0.8) t 
GR
GR
GS
[0.75035 0 0 0.74955 203.24409 9.98136] CT
/Helvetica-Bold 10.667 F
GS
[1 0 0 1 0 0] CT
-6 3.5 moveto 
1 -1 scale
(1) t 
GR
GR
GS
[0 -0.74955 0.75035 0 190.98842 68.3031] CT
/Helvetica-Bold 11.733 F
GS
[1 0 0 1 0 0] CT
-86.5 -3 moveto 
1 -1 scale
(Fraction of Activated Cells \(au\)) t 
GR
GR
GS
[0.75035 0 0 0.74955 0 0.0945] CT
1 GC
N
/f-1797197832{492 177 M
663 177 L
663 5 L
492 5 L
cp}def
f-1797197832
f
GR
GS
[0.75035 0 0 0.74955 433.32601 2.19322] CT
/Helvetica-Bold 11.733 F
GS
[1 0 0 1 0 0] CT
-32 -3 moveto 
1 -1 scale
(Experiment) t 
GR
GR
GS
[0.75035 0 0 0.74955 0 0.0945] CT
1 LJ
0.667 LW
N
492 177 M
663 177 L
S
GR
GS
[0.75035 0 0 0.74955 0 0.0945] CT
1 0 0 RC
N
/f1937514132{530.475 177 M
530.475 87.456 L
496.275 87.456 L
496.275 177 L
cp
573.225 177 M
573.225 20.751 L
539.025 20.751 L
539.025 177 L
cp
615.975 177 M
615.975 103.716 L
581.775 103.716 L
581.775 177 L
cp
658.725 177 M
658.725 40.717 L
624.525 40.717 L
624.525 177 L
cp}def
f1937514132
f
GR
GS
[0.75035 0 0 0.74955 0 0.0945] CT
10.0 ML
0.667 LW
N
496.275 177 M
496.275 87.456 L
530.475 87.456 L
530.475 177 L
cp
S
GR
GS
[0.75035 0 0 0.74955 0 0.0945] CT
10.0 ML
0.667 LW
N
539.025 177 M
539.025 20.751 L
573.225 20.751 L
573.225 177 L
cp
S
GR
GS
[0.75035 0 0 0.74955 0 0.0945] CT
10.0 ML
0.667 LW
N
581.775 177 M
581.775 103.716 L
615.975 103.716 L
615.975 177 L
cp
S
GR
GS
[0.75035 0 0 0.74955 0 0.0945] CT
10.0 ML
0.667 LW
N
624.525 177 M
624.525 40.717 L
658.725 40.717 L
658.725 177 L
cp
S
GR
GS
[0.75035 0 0 0.74955 0 0.0945] CT
1 LJ
0.667 LW
N
513.375 87.456 M
513.375 88.253 L
S
GR
GS
[0.75035 0 0 0.74955 0 0.0945] CT
1 LJ
0.667 LW
N
556.125 20.751 M
556.125 20.95 L
S
GR
GS
[0.75035 0 0 0.74955 0 0.0945] CT
1 LJ
0.667 LW
N
598.875 103.716 M
598.875 116.482 L
S
GR
GS
[0.75035 0 0 0.74955 0 0.0945] CT
1 LJ
0.667 LW
N
641.625 40.717 M
641.625 48.858 L
S
GR
GS
[0.75035 0 0 0.74955 0 0.0945] CT
1 LJ
0.667 LW
N
513.375 87.456 M
513.375 86.659 L
S
GR
GS
[0.75035 0 0 0.74955 0 0.0945] CT
1 LJ
0.667 LW
N
556.125 20.751 M
556.125 20.552 L
S
GR
GS
[0.75035 0 0 0.74955 0 0.0945] CT
1 LJ
0.667 LW
N
598.875 103.716 M
598.875 90.949 L
S
GR
GS
[0.75035 0 0 0.74955 0 0.0945] CT
1 LJ
0.667 LW
N
641.625 40.717 M
641.625 32.575 L
S
GR
GS
[0.75035 0 0 0.74955 385.20958 65.64676] CT
N
f-1057828618
f
GR
GS
[0.75035 0 0 0.74955 417.28693 15.64845] CT
N
f-1057828618
f
GR
GS
[0.75035 0 0 0.74955 449.36428 77.83409] CT
N
f-1057828618
f
GR
GS
[0.75035 0 0 0.74955 481.44163 30.61362] CT
N
f-1057828618
f
GR
GS
[0.75035 0 0 0.74955 385.20958 66.24422] CT
N
f-1104302202
f
GR
GS
[0.75035 0 0 0.74955 385.20958 66.24422] CT
10.0 ML
0.667 LW
N
-2 0 M
2 0 L
S
GR
GS
[0.75035 0 0 0.74955 417.28693 15.79749] CT
N
f-1104302202
f
GR
GS
[0.75035 0 0 0.74955 417.28693 15.79749] CT
10.0 ML
0.667 LW
N
-2 0 M
2 0 L
S
GR
GS
[0.75035 0 0 0.74955 449.36428 87.40318] CT
N
f-1104302202
f
GR
GS
[0.75035 0 0 0.74955 449.36428 87.40318] CT
10.0 ML
0.667 LW
N
-2 0 M
2 0 L
S
GR
GS
[0.75035 0 0 0.74955 481.44163 36.71601] CT
N
f-1104302202
f
GR
GS
[0.75035 0 0 0.74955 481.44163 36.71601] CT
10.0 ML
0.667 LW
N
-2 0 M
2 0 L
S
GR
GS
[0.75035 0 0 0.74955 385.20958 65.04929] CT
N
f-1104302202
f
GR
GS
[0.75035 0 0 0.74955 385.20958 65.04929] CT
10.0 ML
0.667 LW
N
-2 0 M
2 0 L
S
GR
GS
[0.75035 0 0 0.74955 417.28693 15.4994] CT
N
f-1104302202
f
GR
GS
[0.75035 0 0 0.74955 417.28693 15.4994] CT
10.0 ML
0.667 LW
N
-2 0 M
2 0 L
S
GR
GS
[0.75035 0 0 0.74955 449.36428 68.26499] CT
N
f-1104302202
f
GR
GS
[0.75035 0 0 0.74955 449.36428 68.26499] CT
10.0 ML
0.667 LW
N
-2 0 M
2 0 L
S
GR
GS
[0.75035 0 0 0.74955 481.44163 24.51124] CT
N
f-1104302202
f
GR
GS
[0.75035 0 0 0.74955 481.44163 24.51124] CT
10.0 ML
0.667 LW
N
-2 0 M
2 0 L
S
GR
GS
[0.75035 0 0 0.74955 0 0.0945] CT
1 0 0 RC
[1 3] 0 setdash
2 LJ
0.667 LW
N
492 87.456 M
663 87.456 L
S
GR
GS
[0.75035 0 0 0.74955 0 0.0945] CT
2 setlinecap
1 LJ
2.667 LW
N
492 177 M
663 177 L
S
GR
GS
[0.75035 0 0 0.74955 0 0.0945] CT
2 setlinecap
1 LJ
2.667 LW
N
492 5 M
663 5 L
S
GR
GS
[0.75035 0 0 0.74955 0 0.0945] CT
2 setlinecap
1 LJ
2.667 LW
N
513.375 177 M
513.375 175.28 L
S
GR
GS
[0.75035 0 0 0.74955 0 0.0945] CT
2 setlinecap
1 LJ
2.667 LW
N
556.125 177 M
556.125 175.28 L
S
GR
GS
[0.75035 0 0 0.74955 0 0.0945] CT
2 setlinecap
1 LJ
2.667 LW
N
598.875 177 M
598.875 175.28 L
S
GR
GS
[0.75035 0 0 0.74955 0 0.0945] CT
2 setlinecap
1 LJ
2.667 LW
N
641.625 177 M
641.625 175.28 L
S
GR
GS
[0.75035 0 0 0.74955 0 0.0945] CT
2 setlinecap
1 LJ
2.667 LW
N
513.375 5 M
513.375 6.72 L
S
GR
GS
[0.75035 0 0 0.74955 0 0.0945] CT
2 setlinecap
1 LJ
2.667 LW
N
556.125 5 M
556.125 6.72 L
S
GR
GS
[0.75035 0 0 0.74955 0 0.0945] CT
2 setlinecap
1 LJ
2.667 LW
N
598.875 5 M
598.875 6.72 L
S
GR
GS
[0.75035 0 0 0.74955 0 0.0945] CT
2 setlinecap
1 LJ
2.667 LW
N
641.625 5 M
641.625 6.72 L
S
GR
GS
[0.64982 -0.37477 0.37517 0.64913 385.20958 134.36311] CT
/Helvetica-Bold 10.667 F
GS
[1 0 0 1 0 0] CT
-29 10 moveto 
1 -1 scale
(2xWT) t 
GR
GR
GS
[0.64982 -0.37477 0.37517 0.64913 417.28693 134.36311] CT
/Helvetica-Bold 10.667 F
GS
[1 0 0 1 0 0] CT
-35 10 moveto 
1 -1 scale
(2xsigV) t 
GR
GR
GS
[0.64982 -0.37477 0.37517 0.64913 449.36428 134.36311] CT
/Helvetica-Bold 10.667 F
GS
[1 0 0 1 0 0] CT
-32 10 moveto 
1 -1 scale
(2xrsiV) t 
GR
GR
GS
[0.64982 -0.37477 0.37517 0.64913 481.44163 134.36311] CT
/Helvetica-Bold 10.667 F
GS
[1 0 0 1 0 0] CT
-55 10 moveto 
1 -1 scale
(2xsigVrsiV) t 
GR
GR
GS
[0.75035 0 0 0.74955 0 0.0945] CT
2 setlinecap
1 LJ
2.667 LW
N
492 177 M
492 5 L
S
GR
GS
[0.75035 0 0 0.74955 0 0.0945] CT
2 setlinecap
1 LJ
2.667 LW
N
663 177 M
663 5 L
S
GR
GS
[0.75035 0 0 0.74955 0 0.0945] CT
2 setlinecap
1 LJ
2.667 LW
N
492 177 M
493.72 177 L
S
GR
GS
[0.75035 0 0 0.74955 0 0.0945] CT
2 setlinecap
1 LJ
2.667 LW
N
492 145.727 M
493.72 145.727 L
S
GR
GS
[0.75035 0 0 0.74955 0 0.0945] CT
2 setlinecap
1 LJ
2.667 LW
N
492 114.455 M
493.72 114.455 L
S
GR
GS
[0.75035 0 0 0.74955 0 0.0945] CT
2 setlinecap
1 LJ
2.667 LW
N
492 83.182 M
493.72 83.182 L
S
GR
GS
[0.75035 0 0 0.74955 0 0.0945] CT
2 setlinecap
1 LJ
2.667 LW
N
492 51.909 M
493.72 51.909 L
S
GR
GS
[0.75035 0 0 0.74955 0 0.0945] CT
2 setlinecap
1 LJ
2.667 LW
N
492 20.636 M
493.72 20.636 L
S
GR
GS
[0.75035 0 0 0.74955 0 0.0945] CT
2 setlinecap
1 LJ
2.667 LW
N
663 177 M
661.28 177 L
S
GR
GS
[0.75035 0 0 0.74955 0 0.0945] CT
2 setlinecap
1 LJ
2.667 LW
N
663 145.727 M
661.28 145.727 L
S
GR
GS
[0.75035 0 0 0.74955 0 0.0945] CT
2 setlinecap
1 LJ
2.667 LW
N
663 114.455 M
661.28 114.455 L
S
GR
GS
[0.75035 0 0 0.74955 0 0.0945] CT
2 setlinecap
1 LJ
2.667 LW
N
663 83.182 M
661.28 83.182 L
S
GR
GS
[0.75035 0 0 0.74955 0 0.0945] CT
2 setlinecap
1 LJ
2.667 LW
N
663 51.909 M
661.28 51.909 L
S
GR
GS
[0.75035 0 0 0.74955 0 0.0945] CT
2 setlinecap
1 LJ
2.667 LW
N
663 20.636 M
661.28 20.636 L
S
GR
GS
[0.75035 0 0 0.74955 367.57016 132.76408] CT
/Helvetica-Bold 10.667 F
GS
[1 0 0 1 0 0] CT
-6 3.5 moveto 
1 -1 scale
(0) t 
GR
GR
GS
[0.75035 0 0 0.74955 367.57016 109.32375] CT
/Helvetica-Bold 10.667 F
GS
[1 0 0 1 0 0] CT
-15 3.5 moveto 
1 -1 scale
(0.2) t 
GR
GR
GS
[0.75035 0 0 0.74955 367.57016 85.88341] CT
/Helvetica-Bold 10.667 F
GS
[1 0 0 1 0 0] CT
-15 3.5 moveto 
1 -1 scale
(0.4) t 
GR
GR
GS
[0.75035 0 0 0.74955 367.57016 62.44307] CT
/Helvetica-Bold 10.667 F
GS
[1 0 0 1 0 0] CT
-15 3.5 moveto 
1 -1 scale
(0.6) t 
GR
GR
GS
[0.75035 0 0 0.74955 367.57016 39.00273] CT
/Helvetica-Bold 10.667 F
GS
[1 0 0 1 0 0] CT
-15 3.5 moveto 
1 -1 scale
(0.8) t 
GR
GR
GS
[0.75035 0 0 0.74955 367.57016 15.5624] CT
/Helvetica-Bold 10.667 F
GS
[1 0 0 1 0 0] CT
-6 3.5 moveto 
1 -1 scale
(1) t 
GR
GR
GS
[0 -0.74955 0.75035 0 355.31448 68.30309] CT
/Helvetica-Bold 11.733 F
GS
[1 0 0 1 0 0] CT
-86.5 -3 moveto 
1 -1 scale
(Fraction of Activated Cells \(au\)) t 
GR
GR
%%Trailer
%%Pages: 1
%%EOF
