%!PS-Adobe-3.0 EPSF-3.0
%%Creator: (MATLAB, The Mathworks, Inc. Version 9.10.0.1602886 \(R2021a\). Operating System: Windows 10)
%%Title: (C:/Users/christian.schwall/OneDrive - University Of Cambridge/SigV_paper_publish/Figure2/Figure/MSB-20-9832_Figure2.eps)
%%CreationDate: 2021-04-15T18:23:27
%%Pages: (atend)
%%BoundingBox:    40     0   499   157
%%LanguageLevel: 2
%%EndComments
%%BeginProlog
%%BeginResource: procset (Apache XML Graphics Std ProcSet) 1.2 0
%%Version: 1.2 0
%%Copyright: (Copyright 2001-2003,2010 The Apache Software Foundation. License terms: http://www.apache.org/licenses/LICENSE-2.0)
/bd{bind def}bind def
/ld{load def}bd
/GR/grestore ld
/GS/gsave ld
/RM/rmoveto ld
/C/curveto ld
/t/show ld
/L/lineto ld
/ML/setmiterlimit ld
/CT/concat ld
/f/fill ld
/N/newpath ld
/S/stroke ld
/CC/setcmykcolor ld
/A/ashow ld
/cp/closepath ld
/RC/setrgbcolor ld
/LJ/setlinejoin ld
/GC/setgray ld
/LW/setlinewidth ld
/M/moveto ld
/re {4 2 roll M
1 index 0 rlineto
0 exch rlineto
neg 0 rlineto
cp } bd
/_ctm matrix def
/_tm matrix def
/BT { _ctm currentmatrix pop matrix _tm copy pop 0 0 moveto } bd
/ET { _ctm setmatrix } bd
/iTm { _ctm setmatrix _tm concat } bd
/Tm { _tm astore pop iTm 0 0 moveto } bd
/ux 0.0 def
/uy 0.0 def
/F {
  /Tp exch def
  /Tf exch def
  Tf findfont Tp scalefont setfont
  /cf Tf def  /cs Tp def
} bd
/ULS {currentpoint /uy exch def /ux exch def} bd
/ULE {
  /Tcx currentpoint pop def
  gsave
  newpath
  cf findfont cs scalefont dup
  /FontMatrix get 0 get /Ts exch def /FontInfo get dup
  /UnderlinePosition get Ts mul /To exch def
  /UnderlineThickness get Ts mul /Tt exch def
  ux uy To add moveto  Tcx uy To add lineto
  Tt setlinewidth stroke
  grestore
} bd
/OLE {
  /Tcx currentpoint pop def
  gsave
  newpath
  cf findfont cs scalefont dup
  /FontMatrix get 0 get /Ts exch def /FontInfo get dup
  /UnderlinePosition get Ts mul /To exch def
  /UnderlineThickness get Ts mul /Tt exch def
  ux uy To add cs add moveto Tcx uy To add cs add lineto
  Tt setlinewidth stroke
  grestore
} bd
/SOE {
  /Tcx currentpoint pop def
  gsave
  newpath
  cf findfont cs scalefont dup
  /FontMatrix get 0 get /Ts exch def /FontInfo get dup
  /UnderlinePosition get Ts mul /To exch def
  /UnderlineThickness get Ts mul /Tt exch def
  ux uy To add cs 10 mul 26 idiv add moveto Tcx uy To add cs 10 mul 26 idiv add lineto
  Tt setlinewidth stroke
  grestore
} bd
/QT {
/Y22 exch store
/X22 exch store
/Y21 exch store
/X21 exch store
currentpoint
/Y21 load 2 mul add 3 div exch
/X21 load 2 mul add 3 div exch
/X21 load 2 mul /X22 load add 3 div
/Y21 load 2 mul /Y22 load add 3 div
/X22 load /Y22 load curveto
} bd
/SSPD {
dup length /d exch dict def
{
/v exch def
/k exch def
currentpagedevice k known {
/cpdv currentpagedevice k get def
v cpdv ne {
/upd false def
/nullv v type /nulltype eq def
/nullcpdv cpdv type /nulltype eq def
nullv nullcpdv or
{
/upd true def
} {
/sametype v type cpdv type eq def
sametype {
v type /arraytype eq {
/vlen v length def
/cpdvlen cpdv length def
vlen cpdvlen eq {
0 1 vlen 1 sub {
/i exch def
/obj v i get def
/cpdobj cpdv i get def
obj cpdobj ne {
/upd true def
exit
} if
} for
} {
/upd true def
} ifelse
} {
v type /dicttype eq {
v {
/dv exch def
/dk exch def
/cpddv cpdv dk get def
dv cpddv ne {
/upd true def
exit
} if
} forall
} {
/upd true def
} ifelse
} ifelse
} if
} ifelse
upd true eq {
d k v put
} if
} if
} if
} forall
d length 0 gt {
d setpagedevice
} if
} bd
/RE { % /NewFontName [NewEncodingArray] /FontName RE -
  findfont dup length dict begin
  {
    1 index /FID ne
    {def} {pop pop} ifelse
  } forall
  /Encoding exch def
  /FontName 1 index def
  currentdict definefont pop
  end
} bind def
%%EndResource
%%BeginResource: procset (Apache XML Graphics EPS ProcSet) 1.0 0
%%Version: 1.0 0
%%Copyright: (Copyright 2002-2003 The Apache Software Foundation. License terms: http://www.apache.org/licenses/LICENSE-2.0)
/BeginEPSF { %def
/b4_Inc_state save def         % Save state for cleanup
/dict_count countdictstack def % Count objects on dict stack
/op_count count 1 sub def      % Count objects on operand stack
userdict begin                 % Push userdict on dict stack
/showpage { } def              % Redefine showpage, { } = null proc
0 setgray 0 setlinecap         % Prepare graphics state
1 setlinewidth 0 setlinejoin
10 setmiterlimit [ ] 0 setdash newpath
/languagelevel where           % If level not equal to 1 then
{pop languagelevel             % set strokeadjust and
1 ne                           % overprint to their defaults.
{false setstrokeadjust false setoverprint
} if
} if
} bd
/EndEPSF { %def
count op_count sub {pop} repeat            % Clean up stacks
countdictstack dict_count sub {end} repeat
b4_Inc_state restore
} bd
%%EndResource
%FOPBeginFontDict
%%IncludeResource: font Courier-Oblique
%%IncludeResource: font Courier-BoldOblique
%%IncludeResource: font Courier-Bold
%%IncludeResource: font ZapfDingbats
%%IncludeResource: font Symbol
%%IncludeResource: font Helvetica
%%IncludeResource: font Helvetica-Oblique
%%IncludeResource: font Helvetica-Bold
%%IncludeResource: font Helvetica-BoldOblique
%%IncludeResource: font Times-Roman
%%IncludeResource: font Times-Italic
%%IncludeResource: font Times-Bold
%%IncludeResource: font Times-BoldItalic
%%IncludeResource: font Courier
%FOPEndFontDict
%%BeginResource: encoding WinAnsiEncoding
/WinAnsiEncoding [
/.notdef /.notdef /.notdef /.notdef /.notdef
/.notdef /.notdef /.notdef /.notdef /.notdef
/.notdef /.notdef /.notdef /.notdef /.notdef
/.notdef /.notdef /.notdef /.notdef /.notdef
/.notdef /.notdef /.notdef /.notdef /.notdef
/.notdef /.notdef /.notdef /.notdef /.notdef
/.notdef /.notdef /space /exclam /quotedbl
/numbersign /dollar /percent /ampersand /quotesingle
/parenleft /parenright /asterisk /plus /comma
/hyphen /period /slash /zero /one
/two /three /four /five /six
/seven /eight /nine /colon /semicolon
/less /equal /greater /question /at
/A /B /C /D /E
/F /G /H /I /J
/K /L /M /N /O
/P /Q /R /S /T
/U /V /W /X /Y
/Z /bracketleft /backslash /bracketright /asciicircum
/underscore /quoteleft /a /b /c
/d /e /f /g /h
/i /j /k /l /m
/n /o /p /q /r
/s /t /u /v /w
/x /y /z /braceleft /bar
/braceright /asciitilde /bullet /Euro /bullet
/quotesinglbase /florin /quotedblbase /ellipsis /dagger
/daggerdbl /circumflex /perthousand /Scaron /guilsinglleft
/OE /bullet /Zcaron /bullet /bullet
/quoteleft /quoteright /quotedblleft /quotedblright /bullet
/endash /emdash /asciitilde /trademark /scaron
/guilsinglright /oe /bullet /zcaron /Ydieresis
/space /exclamdown /cent /sterling /currency
/yen /brokenbar /section /dieresis /copyright
/ordfeminine /guillemotleft /logicalnot /sfthyphen /registered
/macron /degree /plusminus /twosuperior /threesuperior
/acute /mu /paragraph /middot /cedilla
/onesuperior /ordmasculine /guillemotright /onequarter /onehalf
/threequarters /questiondown /Agrave /Aacute /Acircumflex
/Atilde /Adieresis /Aring /AE /Ccedilla
/Egrave /Eacute /Ecircumflex /Edieresis /Igrave
/Iacute /Icircumflex /Idieresis /Eth /Ntilde
/Ograve /Oacute /Ocircumflex /Otilde /Odieresis
/multiply /Oslash /Ugrave /Uacute /Ucircumflex
/Udieresis /Yacute /Thorn /germandbls /agrave
/aacute /acircumflex /atilde /adieresis /aring
/ae /ccedilla /egrave /eacute /ecircumflex
/edieresis /igrave /iacute /icircumflex /idieresis
/eth /ntilde /ograve /oacute /ocircumflex
/otilde /odieresis /divide /oslash /ugrave
/uacute /ucircumflex /udieresis /yacute /thorn
/ydieresis
] def
%%EndResource
%FOPBeginFontReencode
/Courier-Oblique findfont
dup length dict begin
  {1 index /FID ne {def} {pop pop} ifelse} forall
  /Encoding WinAnsiEncoding def
  currentdict
end
/Courier-Oblique exch definefont pop
/Courier-BoldOblique findfont
dup length dict begin
  {1 index /FID ne {def} {pop pop} ifelse} forall
  /Encoding WinAnsiEncoding def
  currentdict
end
/Courier-BoldOblique exch definefont pop
/Courier-Bold findfont
dup length dict begin
  {1 index /FID ne {def} {pop pop} ifelse} forall
  /Encoding WinAnsiEncoding def
  currentdict
end
/Courier-Bold exch definefont pop
/Helvetica findfont
dup length dict begin
  {1 index /FID ne {def} {pop pop} ifelse} forall
  /Encoding WinAnsiEncoding def
  currentdict
end
/Helvetica exch definefont pop
/Helvetica-Oblique findfont
dup length dict begin
  {1 index /FID ne {def} {pop pop} ifelse} forall
  /Encoding WinAnsiEncoding def
  currentdict
end
/Helvetica-Oblique exch definefont pop
/Helvetica-Bold findfont
dup length dict begin
  {1 index /FID ne {def} {pop pop} ifelse} forall
  /Encoding WinAnsiEncoding def
  currentdict
end
/Helvetica-Bold exch definefont pop
/Helvetica-BoldOblique findfont
dup length dict begin
  {1 index /FID ne {def} {pop pop} ifelse} forall
  /Encoding WinAnsiEncoding def
  currentdict
end
/Helvetica-BoldOblique exch definefont pop
/Times-Roman findfont
dup length dict begin
  {1 index /FID ne {def} {pop pop} ifelse} forall
  /Encoding WinAnsiEncoding def
  currentdict
end
/Times-Roman exch definefont pop
/Times-Italic findfont
dup length dict begin
  {1 index /FID ne {def} {pop pop} ifelse} forall
  /Encoding WinAnsiEncoding def
  currentdict
end
/Times-Italic exch definefont pop
/Times-Bold findfont
dup length dict begin
  {1 index /FID ne {def} {pop pop} ifelse} forall
  /Encoding WinAnsiEncoding def
  currentdict
end
/Times-Bold exch definefont pop
/Times-BoldItalic findfont
dup length dict begin
  {1 index /FID ne {def} {pop pop} ifelse} forall
  /Encoding WinAnsiEncoding def
  currentdict
end
/Times-BoldItalic exch definefont pop
/Courier findfont
dup length dict begin
  {1 index /FID ne {def} {pop pop} ifelse} forall
  /Encoding WinAnsiEncoding def
  currentdict
end
/Courier exch definefont pop
%FOPEndFontReencode
%%EndProlog
%%Page: 1 1
%%PageBoundingBox: 0 0 510 156
%%BeginPageSetup
[1 0 0 -1 0 156] CT
%%EndPageSetup
GS
[0.75035 0 0 0.74955 0 0.0945] CT
1 GC
N
0 0 680 208 re
f
GR
GS
[0.75035 0 0 0.74955 0 0.0945] CT
1 GC
N
0 0 680 208 re
f
GR
GS
[0.75035 0 0 0.74955 0 0.0945] CT
1 GC
N
54 177 M
226 177 L
226 5 L
54 5 L
cp
f
GR
GS
[0.75035 0 0 0.74955 0 0.0945] CT
0.149 GC
2 setlinecap
1 LJ
0.667 LW
N
54 177 M
226 177 L
S
GR
GS
[0.75035 0 0 0.74955 0 0.0945] CT
0.149 GC
2 setlinecap
1 LJ
0.667 LW
N
54 177 M
54 175.28 L
S
GR
GS
[0.75035 0 0 0.74955 0 0.0945] CT
0.149 GC
2 setlinecap
1 LJ
0.667 LW
N
140 177 M
140 175.28 L
S
GR
GS
[0.75035 0 0 0.74955 0 0.0945] CT
0.149 GC
2 setlinecap
1 LJ
0.667 LW
N
226 177 M
226 175.28 L
S
GR
GS
[0.75035 0 0 0.74955 0 0.0945] CT
0.149 GC
2 setlinecap
1 LJ
0.667 LW
N
54 177 M
54 5 L
S
GR
GS
[0.75035 0 0 0.74955 0 0.0945] CT
0.149 GC
2 setlinecap
1 LJ
0.667 LW
N
54 177 M
55.72 177 L
S
GR
GS
[0.75035 0 0 0.74955 0 0.0945] CT
0.149 GC
2 setlinecap
1 LJ
0.667 LW
N
54 142.6 M
55.72 142.6 L
S
GR
GS
[0.75035 0 0 0.74955 0 0.0945] CT
0.149 GC
2 setlinecap
1 LJ
0.667 LW
N
54 108.2 M
55.72 108.2 L
S
GR
GS
[0.75035 0 0 0.74955 0 0.0945] CT
0.149 GC
2 setlinecap
1 LJ
0.667 LW
N
54 73.8 M
55.72 73.8 L
S
GR
GS
[0.75035 0 0 0.74955 0 0.0945] CT
0.149 GC
2 setlinecap
1 LJ
0.667 LW
N
54 39.4 M
55.72 39.4 L
S
GR
GS
[0.75035 0 0 0.74955 0 0.0945] CT
0.149 GC
2 setlinecap
1 LJ
0.667 LW
N
54 5 M
55.72 5 L
S
GR
GS
[0.75035 0 0 0.74955 0 0.0945] CT
1 GC
N
273 177 M
444 177 L
444 5 L
273 5 L
cp
f
GR
GS
[0.75035 0 0 0.74955 0 0.0945] CT
2 setlinecap
1 LJ
2.667 LW
N
273 177 M
444 177 L
S
GR
GS
[0.75035 0 0 0.74955 0 0.0945] CT
2 setlinecap
1 LJ
2.667 LW
N
273 5 M
444 5 L
S
GR
GS
[0.75035 0 0 0.74955 0 0.0945] CT
2 setlinecap
1 LJ
2.667 LW
N
273 177 M
273 175.28 L
S
GR
GS
[0.75035 0 0 0.74955 0 0.0945] CT
2 setlinecap
1 LJ
2.667 LW
N
334.071 177 M
334.071 175.28 L
S
GR
GS
[0.75035 0 0 0.74955 0 0.0945] CT
2 setlinecap
1 LJ
2.667 LW
N
395.143 177 M
395.143 175.28 L
S
GR
GS
[0.75035 0 0 0.74955 0 0.0945] CT
2 setlinecap
1 LJ
2.667 LW
N
273 5 M
273 6.72 L
S
GR
GS
[0.75035 0 0 0.74955 0 0.0945] CT
2 setlinecap
1 LJ
2.667 LW
N
334.071 5 M
334.071 6.72 L
S
GR
GS
[0.75035 0 0 0.74955 0 0.0945] CT
2 setlinecap
1 LJ
2.667 LW
N
395.143 5 M
395.143 6.72 L
S
GR
GS
[0.75035 0 0 0.74955 204.84483 134.36311] CT
/Helvetica-Bold 10.667 F
GS
[1 0 0 1 0 0] CT
-3 10 moveto 
1 -1 scale
(0) t 
GR
GR
GS
[0.75035 0 0 0.74955 250.66962 134.36311] CT
/Helvetica-Bold 10.667 F
GS
[1 0 0 1 0 0] CT
-9 10 moveto 
1 -1 scale
(100) t 
GR
GR
GS
[0.75035 0 0 0.74955 296.4944 134.36311] CT
/Helvetica-Bold 10.667 F
GS
[1 0 0 1 0 0] CT
-9 10 moveto 
1 -1 scale
(200) t 
GR
GR
GS
[0.75035 0 0 0.74955 268.9996 144.10721] CT
/Helvetica-Bold 11.733 F
GS
[1 0 0 1 0 0] CT
-29.5 11 moveto 
1 -1 scale
(Time \(Min\)) t 
GR
GR
GS
[0.75035 0 0 0.74955 0 0.0945] CT
2 setlinecap
1 LJ
2.667 LW
N
273 177 M
273 5 L
S
GR
GS
[0.75035 0 0 0.74955 0 0.0945] CT
2 setlinecap
1 LJ
2.667 LW
N
444 177 M
444 5 L
S
GR
GS
[0.75035 0 0 0.74955 0 0.0945] CT
2 setlinecap
1 LJ
2.667 LW
N
273 177 M
274.72 177 L
S
GR
GS
[0.75035 0 0 0.74955 0 0.0945] CT
2 setlinecap
1 LJ
2.667 LW
N
273 142.6 M
274.72 142.6 L
S
GR
GS
[0.75035 0 0 0.74955 0 0.0945] CT
2 setlinecap
1 LJ
2.667 LW
N
273 108.2 M
274.72 108.2 L
S
GR
GS
[0.75035 0 0 0.74955 0 0.0945] CT
2 setlinecap
1 LJ
2.667 LW
N
273 73.8 M
274.72 73.8 L
S
GR
GS
[0.75035 0 0 0.74955 0 0.0945] CT
2 setlinecap
1 LJ
2.667 LW
N
273 39.4 M
274.72 39.4 L
S
GR
GS
[0.75035 0 0 0.74955 0 0.0945] CT
2 setlinecap
1 LJ
2.667 LW
N
273 5 M
274.72 5 L
S
GR
GS
[0.75035 0 0 0.74955 0 0.0945] CT
2 setlinecap
1 LJ
2.667 LW
N
444 177 M
442.28 177 L
S
GR
GS
[0.75035 0 0 0.74955 0 0.0945] CT
2 setlinecap
1 LJ
2.667 LW
N
444 142.6 M
442.28 142.6 L
S
GR
GS
[0.75035 0 0 0.74955 0 0.0945] CT
2 setlinecap
1 LJ
2.667 LW
N
444 108.2 M
442.28 108.2 L
S
GR
GS
[0.75035 0 0 0.74955 0 0.0945] CT
2 setlinecap
1 LJ
2.667 LW
N
444 73.8 M
442.28 73.8 L
S
GR
GS
[0.75035 0 0 0.74955 0 0.0945] CT
2 setlinecap
1 LJ
2.667 LW
N
444 39.4 M
442.28 39.4 L
S
GR
GS
[0.75035 0 0 0.74955 0 0.0945] CT
2 setlinecap
1 LJ
2.667 LW
N
444 5 M
442.28 5 L
S
GR
GS
[0.75035 0 0 0.74955 203.24409 132.76408] CT
/Helvetica-Bold 10.667 F
GS
[1 0 0 1 0 0] CT
-6 3.5 moveto 
1 -1 scale
(0) t 
GR
GR
GS
[0.75035 0 0 0.74955 203.24409 106.97972] CT
/Helvetica-Bold 10.667 F
GS
[1 0 0 1 0 0] CT
-15 3.5 moveto 
1 -1 scale
(0.2) t 
GR
GR
GS
[0.75035 0 0 0.74955 203.24409 81.19534] CT
/Helvetica-Bold 10.667 F
GS
[1 0 0 1 0 0] CT
-15 3.5 moveto 
1 -1 scale
(0.4) t 
GR
GR
GS
[0.75035 0 0 0.74955 203.24409 55.41097] CT
/Helvetica-Bold 10.667 F
GS
[1 0 0 1 0 0] CT
-15 3.5 moveto 
1 -1 scale
(0.6) t 
GR
GR
GS
[0.75035 0 0 0.74955 203.24409 29.6266] CT
/Helvetica-Bold 10.667 F
GS
[1 0 0 1 0 0] CT
-15 3.5 moveto 
1 -1 scale
(0.8) t 
GR
GR
GS
[0.75035 0 0 0.74955 203.24409 3.84223] CT
/Helvetica-Bold 10.667 F
GS
[1 0 0 1 0 0] CT
-6 3.5 moveto 
1 -1 scale
(1) t 
GR
GR
GS
[0 -0.74955 0.75035 0 190.98842 68.30309] CT
/Helvetica-Bold 11.733 F
GS
[1 0 0 1 0 0] CT
-87 -3 moveto 
1 -1 scale
(Fraction of Surviving Cells \(au\)) t 
GR
GR
GS
[0.75035 0 0 0.74955 0 0.0945] CT
1 0 0 RC
[10 6] 0 setdash
2 LJ
1.333 LW
N
273 5 M
279.107 20.451 L
285.214 63.826 L
291.321 112.11 L
297.429 120.349 L
303.536 124.047 L
309.643 126.55 L
315.75 128.554 L
321.857 130.556 L
327.964 133.209 L
334.071 134.995 L
340.179 137.365 L
346.286 139.672 L
352.393 141.449 L
358.5 143.516 L
364.607 145.147 L
370.714 146.779 L
376.821 148.271 L
382.929 149.721 L
389.036 150.699 L
395.143 151.262 L
401.25 151.882 L
407.357 152.275 L
413.464 152.794 L
419.571 153.477 L
425.679 154.007 L
431.786 154.706 L
437.893 154.962 L
444 155.552 L
S
GR
GS
[0.75035 0 0 0.74955 0 0.0945] CT
1 0 0 RC
1 LJ
0.667 LW
N
273 5 M
279.107 8.704 L
285.214 64.588 L
291.321 125.142 L
297.429 134.322 L
303.536 139.476 L
309.643 141.891 L
315.75 143.019 L
321.857 143.663 L
327.964 146.079 L
334.071 147.045 L
340.179 148.655 L
346.286 150.105 L
352.393 151.554 L
358.5 153.004 L
364.607 154.453 L
370.714 155.258 L
376.821 156.064 L
382.929 157.513 L
389.036 158.318 L
395.143 158.64 L
401.25 159.285 L
407.357 159.446 L
413.464 159.607 L
419.571 159.768 L
425.679 160.251 L
431.786 161.056 L
437.893 161.539 L
444 161.7 L
S
GR
GS
[0.75035 0 0 0.74955 0 0.0945] CT
1 0 0 RC
1 LJ
0.667 LW
N
273 5 M
279.107 56.622 L
285.214 97.787 L
291.321 131.163 L
297.429 134.946 L
303.536 137.838 L
309.643 140.063 L
315.75 142.511 L
321.857 143.846 L
327.964 145.404 L
334.071 146.294 L
340.179 147.184 L
346.286 148.296 L
352.393 149.409 L
358.5 151.411 L
364.607 151.411 L
370.714 151.634 L
376.821 152.301 L
382.929 153.191 L
389.036 153.414 L
395.143 153.414 L
401.25 153.636 L
407.357 153.859 L
413.464 154.081 L
419.571 154.749 L
425.679 155.194 L
431.786 155.417 L
437.893 155.639 L
444 156.752 L
S
GR
GS
[0.75035 0 0 0.74955 0 0.0945] CT
1 0 0 RC
1 LJ
0.667 LW
N
273 5 M
279.107 8.699 L
285.214 47.908 L
291.321 93.589 L
297.429 101.912 L
303.536 104.686 L
309.643 106.166 L
315.75 107.83 L
321.857 111.714 L
327.964 115.968 L
334.071 119.112 L
340.179 122.441 L
346.286 125.77 L
352.393 128.174 L
358.5 130.763 L
364.607 133.538 L
370.714 137.052 L
376.821 139.641 L
382.929 142.23 L
389.036 144.08 L
395.143 145.374 L
401.25 146.114 L
407.357 146.669 L
413.464 147.963 L
419.571 149.073 L
425.679 149.628 L
431.786 150.923 L
437.893 150.923 L
444 151.847 L
S
GR
GS
[0.75035 0 0 0.74955 0 0.0945] CT
1 0 0 RC
1 LJ
0.667 LW
N
273 5 M
279.107 7.779 L
285.214 45.022 L
291.321 98.544 L
297.429 110.217 L
303.536 114.187 L
309.643 118.078 L
315.75 120.858 L
321.857 123.002 L
327.964 125.384 L
334.071 127.528 L
340.179 131.181 L
346.286 134.516 L
352.393 136.66 L
358.5 138.884 L
364.607 141.187 L
370.714 143.172 L
376.821 145.078 L
382.929 145.951 L
389.036 146.983 L
395.143 147.619 L
401.25 148.492 L
407.357 149.127 L
413.464 149.524 L
419.571 150.319 L
425.679 150.954 L
431.786 151.43 L
437.893 151.748 L
444 151.907 L
S
GR
GS
[0.75035 0 0 0.74955 0 0.0945] CT
0 0 1 RC
[10 6] 0 setdash
2 LJ
1.333 LW
N
273 5 M
279.107 95.836 L
285.214 176.316 L
291.321 176.917 L
297.429 177 L
303.536 177 L
309.643 177 L
315.75 177 L
321.857 177 L
327.964 177 L
334.071 177 L
340.179 177 L
346.286 177 L
352.393 177 L
358.5 177 L
364.607 177 L
370.714 177 L
376.821 177 L
382.929 177 L
389.036 177 L
395.143 177 L
401.25 177 L
407.357 177 L
413.464 177 L
419.571 177 L
425.679 177 L
431.786 177 L
437.893 177 L
444 177 L
S
GR
GS
[0.75035 0 0 0.74955 0 0.0945] CT
0 0 1 RC
1 LJ
0.667 LW
N
273 5 M
279.107 167.006 L
285.214 176.299 L
291.321 177 L
297.429 177 L
303.536 177 L
309.643 177 L
315.75 177 L
321.857 177 L
327.964 177 L
334.071 177 L
340.179 177 L
346.286 177 L
352.393 177 L
358.5 177 L
364.607 177 L
370.714 177 L
376.821 177 L
382.929 177 L
389.036 177 L
395.143 177 L
401.25 177 L
407.357 177 L
413.464 177 L
419.571 177 L
425.679 177 L
431.786 177 L
437.893 177 L
444 177 L
S
GR
GS
[0.75035 0 0 0.74955 0 0.0945] CT
0 0 1 RC
1 LJ
0.667 LW
N
273 5 M
279.107 24.667 L
285.214 176.333 L
291.321 176.833 L
297.429 177 L
303.536 177 L
309.643 177 L
315.75 177 L
321.857 177 L
327.964 177 L
334.071 177 L
340.179 177 L
346.286 177 L
352.393 177 L
358.5 177 L
364.607 177 L
370.714 177 L
376.821 177 L
382.929 177 L
389.036 177 L
395.143 177 L
401.25 177 L
407.357 177 L
413.464 177 L
419.571 177 L
425.679 177 L
431.786 177 L
437.893 177 L
444 177 L
S
GR
GS
[0.75035 0 0 0.74955 0 0.0945] CT
1 GC
N
437 59 M
437 13 L
320 13 L
320 59 L
cp
f
GR
GS
[0.75035 0 0 0.74955 275.37748 15.14307] CT
/Helvetica-Bold 8 F
GS
[1 0 0 1 0 0] CT
0 3 moveto 
1 -1 scale
(No Priming) t 
GR
GR
GS
[0.75035 0 0 0.74955 0 0.0945] CT
0 0 1 RC
1 LJ
0.667 LW
N
324 20.077 M
364 20.077 L
S
GR
GS
[0.75035 0 0 0.74955 275.37748 23.09978] CT
/Helvetica-Bold 8 F
GS
[1 0 0 1 0 0] CT
0 3 moveto 
1 -1 scale
(Mean No Priming) t 
GR
GR
GS
[0.75035 0 0 0.74955 0 0.0945] CT
0 0 1 RC
[10 6] 0 setdash
2 LJ
1.333 LW
N
324 30.692 M
364 30.692 L
S
GR
GS
[0.75035 0 0 0.74955 275.37748 31.0565] CT
/Helvetica-Bold 8 F
GS
[1 0 0 1 0 0] CT
0 3 moveto 
1 -1 scale
(Priming) t 
GR
GR
GS
[0.75035 0 0 0.74955 0 0.0945] CT
1 0 0 RC
1 LJ
0.667 LW
N
324 41.308 M
364 41.308 L
S
GR
GS
[0.75035 0 0 0.74955 275.37748 39.01322] CT
/Helvetica-Bold 8 F
GS
[1 0 0 1 0 0] CT
0 3 moveto 
1 -1 scale
(Mean Priming) t 
GR
GR
GS
[0.75035 0 0 0.74955 0 0.0945] CT
1 0 0 RC
[10 6] 0 setdash
2 LJ
1.333 LW
N
324 51.923 M
364 51.923 L
S
GR
GS
[0.75035 0 0 0.74955 0 0.0945] CT
10.0 ML
2.667 LW
N
320 59 M
320 13 L
437 13 L
437 59 L
cp
S
GR
GS
[0.75035 0 0 0.74955 0 0.0945] CT
1 GC
N
492 177 M
663 177 L
663 5 L
492 5 L
cp
f
GR
GS
[0.75035 0 0 0.74955 0 0.0945] CT
1 0 0 RC
1 LJ
0.667 LW
N
492 177 M
493.71 177 L
495.42 177 L
497.13 173.261 L
498.84 169.522 L
500.55 162.043 L
502.26 150.826 L
503.97 150.826 L
505.68 150.826 L
507.39 147.087 L
509.1 147.087 L
510.81 143.348 L
512.52 143.348 L
514.23 143.348 L
515.94 135.87 L
517.65 135.87 L
519.36 128.391 L
521.07 128.391 L
522.78 124.652 L
524.49 113.435 L
526.2 105.957 L
527.91 102.217 L
529.62 102.217 L
531.33 98.478 L
533.04 98.478 L
534.75 91 L
536.46 83.522 L
538.17 76.043 L
539.88 72.304 L
541.59 68.565 L
543.3 64.826 L
545.01 64.826 L
546.72 61.087 L
548.43 61.087 L
550.14 57.348 L
551.85 53.609 L
553.56 49.87 L
555.27 49.87 L
556.98 46.13 L
558.69 46.13 L
560.4 34.913 L
562.11 34.913 L
563.82 34.913 L
565.53 34.913 L
567.24 34.913 L
568.95 34.913 L
570.66 31.174 L
572.37 27.435 L
574.08 23.696 L
575.79 23.696 L
577.5 23.696 L
579.21 23.696 L
580.92 23.696 L
582.63 23.696 L
584.34 19.957 L
586.05 19.957 L
587.76 19.957 L
589.47 19.957 L
591.18 19.957 L
592.89 19.957 L
594.6 16.217 L
596.31 12.478 L
598.02 12.478 L
599.73 12.478 L
601.44 12.478 L
603.15 8.739 L
604.86 8.739 L
606.57 8.739 L
608.28 8.739 L
609.99 8.739 L
611.7 8.739 L
613.41 8.739 L
615.12 8.739 L
616.83 8.739 L
618.54 8.739 L
620.25 8.739 L
621.96 8.739 L
623.67 8.739 L
625.38 8.739 L
627.09 8.739 L
628.8 8.739 L
630.51 5 L
632.22 5 L
633.93 5 L
635.64 5 L
637.35 5 L
639.06 5 L
640.77 5 L
642.48 5 L
644.19 5 L
645.9 5 L
647.61 5 L
649.32 5 L
651.03 5 L
652.74 5 L
654.45 5 L
656.16 5 L
657.87 5 L
659.58 5 L
661.29 5 L
663 5 L
S
GR
GS
[0.75035 0 0 0.74955 0 0.0945] CT
1 0 0 RC
1 LJ
0.667 LW
N
492 177 M
493.71 177 L
495.42 165.533 L
497.13 159.8 L
498.84 154.067 L
500.55 148.333 L
502.26 148.333 L
503.97 148.333 L
505.68 148.333 L
507.39 136.867 L
509.1 136.867 L
510.81 136.867 L
512.52 136.867 L
514.23 125.4 L
515.94 125.4 L
517.65 119.667 L
519.36 119.667 L
521.07 108.2 L
522.78 108.2 L
524.49 108.2 L
526.2 108.2 L
527.91 102.467 L
529.62 102.467 L
531.33 96.733 L
533.04 85.267 L
534.75 85.267 L
536.46 85.267 L
538.17 73.8 L
539.88 73.8 L
541.59 62.333 L
543.3 62.333 L
545.01 50.867 L
546.72 50.867 L
548.43 45.133 L
550.14 39.4 L
551.85 39.4 L
553.56 33.667 L
555.27 27.933 L
556.98 27.933 L
558.69 27.933 L
560.4 27.933 L
562.11 22.2 L
563.82 22.2 L
565.53 22.2 L
567.24 22.2 L
568.95 16.467 L
570.66 16.467 L
572.37 16.467 L
574.08 16.467 L
575.79 16.467 L
577.5 16.467 L
579.21 16.467 L
580.92 16.467 L
582.63 16.467 L
584.34 16.467 L
586.05 16.467 L
587.76 16.467 L
589.47 16.467 L
591.18 16.467 L
592.89 16.467 L
594.6 16.467 L
596.31 16.467 L
598.02 16.467 L
599.73 16.467 L
601.44 16.467 L
603.15 16.467 L
604.86 16.467 L
606.57 16.467 L
608.28 16.467 L
609.99 16.467 L
611.7 16.467 L
613.41 16.467 L
615.12 16.467 L
616.83 16.467 L
618.54 16.467 L
620.25 16.467 L
621.96 16.467 L
623.67 10.733 L
625.38 10.733 L
627.09 10.733 L
628.8 10.733 L
630.51 10.733 L
632.22 10.733 L
633.93 10.733 L
635.64 10.733 L
637.35 10.733 L
639.06 10.733 L
640.77 10.733 L
642.48 10.733 L
644.19 10.733 L
645.9 10.733 L
647.61 10.733 L
649.32 10.733 L
651.03 10.733 L
652.74 10.733 L
654.45 10.733 L
656.16 10.733 L
657.87 10.733 L
659.58 10.733 L
661.29 10.733 L
663 5 L
S
GR
GS
[0.75035 0 0 0.74955 0 0.0945] CT
1 0 0 RC
1 LJ
0.667 LW
N
492 177 M
493.71 177 L
495.42 177 L
497.13 174.133 L
498.84 169.833 L
500.55 161.233 L
502.26 154.067 L
503.97 148.333 L
505.68 139.733 L
507.39 131.133 L
509.1 126.833 L
510.81 122.533 L
512.52 118.233 L
514.23 118.233 L
515.94 113.933 L
517.65 112.5 L
519.36 111.067 L
521.07 106.767 L
522.78 103.9 L
524.49 102.467 L
526.2 99.6 L
527.91 92.433 L
529.62 88.133 L
531.33 86.7 L
533.04 79.533 L
534.75 72.367 L
536.46 70.933 L
538.17 70.933 L
539.88 69.5 L
541.59 66.633 L
543.3 63.767 L
545.01 55.167 L
546.72 50.867 L
548.43 48 L
550.14 46.567 L
551.85 45.133 L
553.56 42.267 L
555.27 39.4 L
556.98 39.4 L
558.69 36.533 L
560.4 35.1 L
562.11 32.233 L
563.82 32.233 L
565.53 32.233 L
567.24 30.8 L
568.95 26.5 L
570.66 25.067 L
572.37 22.2 L
574.08 22.2 L
575.79 22.2 L
577.5 22.2 L
579.21 22.2 L
580.92 20.767 L
582.63 20.767 L
584.34 19.333 L
586.05 19.333 L
587.76 19.333 L
589.47 17.9 L
591.18 17.9 L
592.89 16.467 L
594.6 16.467 L
596.31 16.467 L
598.02 15.033 L
599.73 15.033 L
601.44 15.033 L
603.15 15.033 L
604.86 15.033 L
606.57 13.6 L
608.28 13.6 L
609.99 12.167 L
611.7 12.167 L
613.41 12.167 L
615.12 12.167 L
616.83 12.167 L
618.54 10.733 L
620.25 10.733 L
621.96 10.733 L
623.67 10.733 L
625.38 9.3 L
627.09 9.3 L
628.8 9.3 L
630.51 9.3 L
632.22 9.3 L
633.93 9.3 L
635.64 9.3 L
637.35 9.3 L
639.06 9.3 L
640.77 9.3 L
642.48 7.867 L
644.19 7.867 L
645.9 7.867 L
647.61 7.867 L
649.32 7.867 L
651.03 7.867 L
652.74 7.867 L
654.45 7.867 L
656.16 7.867 L
657.87 7.867 L
659.58 7.867 L
661.29 6.433 L
663 5 L
S
GR
GS
[0.75035 0 0 0.74955 0 0.0945] CT
1 0 0 RC
1 LJ
0.667 LW
N
492 177 M
493.71 177 L
495.42 177 L
497.13 177 L
498.84 177 L
500.55 167.444 L
502.26 151.519 L
503.97 148.333 L
505.68 145.148 L
507.39 145.148 L
509.1 138.778 L
510.81 132.407 L
512.52 129.222 L
514.23 116.481 L
515.94 110.111 L
517.65 106.926 L
519.36 106.926 L
521.07 103.741 L
522.78 103.741 L
524.49 97.37 L
526.2 94.185 L
527.91 91 L
529.62 91 L
531.33 87.815 L
533.04 84.63 L
534.75 81.444 L
536.46 78.259 L
538.17 71.889 L
539.88 68.704 L
541.59 68.704 L
543.3 68.704 L
545.01 65.519 L
546.72 65.519 L
548.43 59.148 L
550.14 55.963 L
551.85 55.963 L
553.56 55.963 L
555.27 55.963 L
556.98 52.778 L
558.69 52.778 L
560.4 52.778 L
562.11 52.778 L
563.82 52.778 L
565.53 52.778 L
567.24 52.778 L
568.95 49.593 L
570.66 49.593 L
572.37 46.407 L
574.08 43.222 L
575.79 43.222 L
577.5 33.667 L
579.21 33.667 L
580.92 30.481 L
582.63 30.481 L
584.34 30.481 L
586.05 30.481 L
587.76 30.481 L
589.47 30.481 L
591.18 27.296 L
592.89 27.296 L
594.6 27.296 L
596.31 27.296 L
598.02 27.296 L
599.73 27.296 L
601.44 24.111 L
603.15 24.111 L
604.86 24.111 L
606.57 24.111 L
608.28 24.111 L
609.99 24.111 L
611.7 24.111 L
613.41 20.926 L
615.12 20.926 L
616.83 17.741 L
618.54 17.741 L
620.25 17.741 L
621.96 17.741 L
623.67 17.741 L
625.38 17.741 L
627.09 17.741 L
628.8 17.741 L
630.51 17.741 L
632.22 17.741 L
633.93 17.741 L
635.64 17.741 L
637.35 17.741 L
639.06 17.741 L
640.77 17.741 L
642.48 17.741 L
644.19 17.741 L
645.9 17.741 L
647.61 17.741 L
649.32 17.741 L
651.03 17.741 L
652.74 14.556 L
654.45 11.37 L
656.16 8.185 L
657.87 8.185 L
659.58 8.185 L
661.29 8.185 L
663 5 L
S
GR
GS
[0.75035 0 0 0.74955 0 0.0945] CT
0 0 1 RC
1 LJ
0.667 LW
N
492 177 M
493.71 177 L
495.42 177 L
497.13 177 L
498.84 154.662 L
500.55 143.493 L
502.26 132.325 L
503.97 121.156 L
505.68 118.922 L
507.39 112.221 L
509.1 107.753 L
510.81 105.519 L
512.52 105.519 L
514.23 103.286 L
515.94 94.351 L
517.65 92.117 L
519.36 80.948 L
521.07 74.247 L
522.78 74.247 L
524.49 72.013 L
526.2 72.013 L
527.91 72.013 L
529.62 72.013 L
531.33 69.779 L
533.04 69.779 L
534.75 65.312 L
536.46 60.844 L
538.17 60.844 L
539.88 56.377 L
541.59 56.377 L
543.3 49.675 L
545.01 47.442 L
546.72 45.208 L
548.43 42.974 L
550.14 42.974 L
551.85 40.74 L
553.56 38.506 L
555.27 38.506 L
556.98 38.506 L
558.69 36.273 L
560.4 36.273 L
562.11 34.039 L
563.82 31.805 L
565.53 29.571 L
567.24 29.571 L
568.95 29.571 L
570.66 25.104 L
572.37 22.87 L
574.08 22.87 L
575.79 22.87 L
577.5 22.87 L
579.21 20.636 L
580.92 20.636 L
582.63 20.636 L
584.34 20.636 L
586.05 18.403 L
587.76 18.403 L
589.47 18.403 L
591.18 16.169 L
592.89 16.169 L
594.6 16.169 L
596.31 13.935 L
598.02 11.701 L
599.73 11.701 L
601.44 11.701 L
603.15 11.701 L
604.86 11.701 L
606.57 11.701 L
608.28 11.701 L
609.99 11.701 L
611.7 11.701 L
613.41 11.701 L
615.12 9.468 L
616.83 9.468 L
618.54 9.468 L
620.25 9.468 L
621.96 9.468 L
623.67 9.468 L
625.38 9.468 L
627.09 9.468 L
628.8 9.468 L
630.51 9.468 L
632.22 9.468 L
633.93 9.468 L
635.64 9.468 L
637.35 9.468 L
639.06 9.468 L
640.77 9.468 L
642.48 9.468 L
644.19 9.468 L
645.9 9.468 L
647.61 9.468 L
649.32 9.468 L
651.03 9.468 L
652.74 9.468 L
654.45 9.468 L
656.16 9.468 L
657.87 9.468 L
659.58 9.468 L
661.29 7.234 L
663 5 L
S
GR
GS
[0.75035 0 0 0.74955 0 0.0945] CT
0 0 1 RC
1 LJ
0.667 LW
N
492 177 M
493.71 177 L
495.42 155.939 L
497.13 124.347 L
498.84 103.286 L
500.55 92.755 L
502.26 85.735 L
503.97 78.714 L
505.68 75.204 L
507.39 75.204 L
509.1 75.204 L
510.81 75.204 L
512.52 68.184 L
514.23 68.184 L
515.94 61.163 L
517.65 57.653 L
519.36 54.143 L
521.07 50.633 L
522.78 47.122 L
524.49 40.102 L
526.2 40.102 L
527.91 40.102 L
529.62 36.592 L
531.33 33.082 L
533.04 33.082 L
534.75 29.571 L
536.46 29.571 L
538.17 29.571 L
539.88 29.571 L
541.59 29.571 L
543.3 26.061 L
545.01 26.061 L
546.72 26.061 L
548.43 26.061 L
550.14 22.551 L
551.85 19.041 L
553.56 19.041 L
555.27 15.531 L
556.98 15.531 L
558.69 15.531 L
560.4 15.531 L
562.11 15.531 L
563.82 15.531 L
565.53 15.531 L
567.24 15.531 L
568.95 15.531 L
570.66 12.02 L
572.37 12.02 L
574.08 12.02 L
575.79 12.02 L
577.5 12.02 L
579.21 12.02 L
580.92 12.02 L
582.63 8.51 L
584.34 8.51 L
586.05 8.51 L
587.76 8.51 L
589.47 8.51 L
591.18 8.51 L
592.89 8.51 L
594.6 8.51 L
596.31 8.51 L
598.02 8.51 L
599.73 8.51 L
601.44 8.51 L
603.15 8.51 L
604.86 8.51 L
606.57 8.51 L
608.28 8.51 L
609.99 5 L
611.7 5 L
613.41 5 L
615.12 5 L
616.83 5 L
618.54 5 L
620.25 5 L
621.96 5 L
623.67 5 L
625.38 5 L
627.09 5 L
628.8 5 L
630.51 5 L
632.22 5 L
633.93 5 L
635.64 5 L
637.35 5 L
639.06 5 L
640.77 5 L
642.48 5 L
644.19 5 L
645.9 5 L
647.61 5 L
649.32 5 L
651.03 5 L
652.74 5 L
654.45 5 L
656.16 5 L
657.87 5 L
659.58 5 L
661.29 5 L
663 5 L
S
GR
GS
[0.75035 0 0 0.74955 0 0.0945] CT
0 0 1 RC
1 LJ
0.667 LW
N
492 177 M
493.71 177 L
495.42 174.18 L
497.13 171.361 L
498.84 158.672 L
500.55 151.623 L
502.26 127.656 L
503.97 110.738 L
505.68 99.459 L
507.39 88.18 L
509.1 83.951 L
510.81 78.311 L
512.52 72.672 L
514.23 71.262 L
515.94 71.262 L
517.65 69.852 L
519.36 65.623 L
521.07 65.623 L
522.78 64.213 L
524.49 61.393 L
526.2 58.574 L
527.91 55.754 L
529.62 52.934 L
531.33 51.525 L
533.04 50.115 L
534.75 48.705 L
536.46 44.475 L
538.17 41.656 L
539.88 41.656 L
541.59 37.426 L
543.3 37.426 L
545.01 36.016 L
546.72 34.607 L
548.43 31.787 L
550.14 28.967 L
551.85 27.557 L
553.56 27.557 L
555.27 27.557 L
556.98 26.148 L
558.69 26.148 L
560.4 26.148 L
562.11 24.738 L
563.82 24.738 L
565.53 21.918 L
567.24 21.918 L
568.95 21.918 L
570.66 19.098 L
572.37 16.279 L
574.08 16.279 L
575.79 16.279 L
577.5 16.279 L
579.21 13.459 L
580.92 13.459 L
582.63 13.459 L
584.34 13.459 L
586.05 13.459 L
587.76 13.459 L
589.47 13.459 L
591.18 10.639 L
592.89 10.639 L
594.6 10.639 L
596.31 10.639 L
598.02 10.639 L
599.73 10.639 L
601.44 10.639 L
603.15 10.639 L
604.86 10.639 L
606.57 10.639 L
608.28 10.639 L
609.99 9.23 L
611.7 7.82 L
613.41 6.41 L
615.12 6.41 L
616.83 6.41 L
618.54 6.41 L
620.25 6.41 L
621.96 6.41 L
623.67 6.41 L
625.38 6.41 L
627.09 6.41 L
628.8 6.41 L
630.51 6.41 L
632.22 6.41 L
633.93 6.41 L
635.64 6.41 L
637.35 6.41 L
639.06 5 L
640.77 5 L
642.48 5 L
644.19 5 L
645.9 5 L
647.61 5 L
649.32 5 L
651.03 5 L
652.74 5 L
654.45 5 L
656.16 5 L
657.87 5 L
659.58 5 L
661.29 5 L
663 5 L
S
GR
GS
[0.75035 0 0 0.74955 0 0.0945] CT
0 0 1 RC
1 LJ
0.667 LW
N
492 177 M
493.71 177 L
495.42 177 L
497.13 177 L
498.84 177 L
500.55 174.394 L
502.26 148.333 L
503.97 130.091 L
505.68 117.061 L
507.39 104.03 L
509.1 88.394 L
510.81 77.97 L
512.52 75.364 L
514.23 67.545 L
515.94 67.545 L
517.65 62.333 L
519.36 59.727 L
521.07 59.727 L
522.78 59.727 L
524.49 57.121 L
526.2 54.515 L
527.91 46.697 L
529.62 41.485 L
531.33 41.485 L
533.04 38.879 L
534.75 36.273 L
536.46 36.273 L
538.17 33.667 L
539.88 33.667 L
541.59 33.667 L
543.3 33.667 L
545.01 31.061 L
546.72 31.061 L
548.43 31.061 L
550.14 31.061 L
551.85 28.455 L
553.56 28.455 L
555.27 28.455 L
556.98 28.455 L
558.69 28.455 L
560.4 28.455 L
562.11 28.455 L
563.82 28.455 L
565.53 28.455 L
567.24 28.455 L
568.95 28.455 L
570.66 28.455 L
572.37 28.455 L
574.08 28.455 L
575.79 28.455 L
577.5 25.848 L
579.21 23.242 L
580.92 23.242 L
582.63 23.242 L
584.34 23.242 L
586.05 23.242 L
587.76 20.636 L
589.47 20.636 L
591.18 18.03 L
592.89 18.03 L
594.6 18.03 L
596.31 18.03 L
598.02 15.424 L
599.73 15.424 L
601.44 15.424 L
603.15 15.424 L
604.86 15.424 L
606.57 15.424 L
608.28 15.424 L
609.99 15.424 L
611.7 12.818 L
613.41 12.818 L
615.12 10.212 L
616.83 10.212 L
618.54 10.212 L
620.25 10.212 L
621.96 10.212 L
623.67 10.212 L
625.38 10.212 L
627.09 10.212 L
628.8 10.212 L
630.51 10.212 L
632.22 10.212 L
633.93 10.212 L
635.64 10.212 L
637.35 10.212 L
639.06 10.212 L
640.77 10.212 L
642.48 10.212 L
644.19 10.212 L
645.9 7.606 L
647.61 7.606 L
649.32 5 L
651.03 5 L
652.74 5 L
654.45 5 L
656.16 5 L
657.87 5 L
659.58 5 L
661.29 5 L
663 5 L
S
GR
GS
[0.75035 0 0 0.74955 0 0.0945] CT
1 0.851 0.851 RC
N
493.722 177.021 M
493.751 177.021 L
494.1 177.021 L
498.744 177.021 L
498.885 177.021 L
500.55 167.867 L
502.26 153.544 L
503.97 150.203 L
505.68 150.797 L
507.39 147.478 L
509.1 145.711 L
510.81 142.534 L
512.52 142.714 L
514.23 138.142 L
515.94 132.998 L
517.65 131.294 L
519.36 126.045 L
521.07 123.007 L
522.78 120.027 L
524.49 112.332 L
526.2 108.334 L
527.91 103.193 L
529.62 103.423 L
531.33 98.466 L
533.04 95.062 L
534.75 90.345 L
536.46 85.934 L
538.17 75.425 L
539.88 73.46 L
541.59 69.53 L
543.3 67.637 L
545.01 66.334 L
546.72 64.489 L
548.43 61.292 L
550.14 58.257 L
551.85 56.184 L
553.56 55.086 L
555.27 55.605 L
556.98 52.16 L
558.69 51.731 L
560.4 48.284 L
562.11 48.265 L
563.82 48.265 L
565.53 48.265 L
567.24 48.049 L
568.95 45.885 L
570.66 44.616 L
572.37 41.111 L
574.08 38.038 L
575.79 38.038 L
577.5 31.161 L
579.21 31.161 L
580.92 28.742 L
582.63 28.742 L
584.34 27.699 L
586.05 27.699 L
587.76 27.699 L
589.47 27.552 L
591.18 25.217 L
592.89 25.152 L
594.6 24.569 L
596.31 24.541 L
598.02 24.349 L
599.73 24.349 L
601.44 22.028 L
603.15 22.402 L
604.86 22.402 L
606.57 22.163 L
608.28 22.163 L
609.99 22 L
611.7 22 L
613.41 19.859 L
615.12 19.859 L
616.83 17.898 L
618.54 17.782 L
620.25 17.782 L
621.96 17.782 L
623.67 15.936 L
625.38 15.789 L
627.09 15.789 L
628.8 15.789 L
630.51 15.986 L
632.22 15.986 L
633.93 15.986 L
635.64 15.986 L
637.35 15.986 L
639.06 15.986 L
640.77 15.986 L
642.48 15.799 L
644.19 15.799 L
645.9 15.799 L
647.61 15.799 L
649.32 15.799 L
651.03 15.799 L
652.74 13.621 L
654.45 11.666 L
656.16 10.292 L
657.87 10.292 L
659.58 10.292 L
661.29 10.056 L
663 5 L
661.29 5.119 L
659.58 5.6 L
657.87 5.6 L
656.16 5.6 L
654.45 5.819 L
652.74 5.457 L
651.346 4.979 L
651.084 4.979 L
649.402 4.979 L
649.362 4.979 L
647.673 4.979 L
647.61 4.979 L
645.917 4.979 L
645.9 4.979 L
644.207 4.979 L
644.19 4.979 L
642.497 4.979 L
642.48 4.979 L
642.131 4.979 L
640.77 5.401 L
639.06 5.401 L
637.35 5.401 L
635.64 5.401 L
633.93 5.401 L
632.22 5.401 L
630.51 5.401 L
628.8 7.468 L
627.09 7.468 L
625.38 7.468 L
623.67 8.037 L
621.96 9.058 L
620.25 9.058 L
618.54 9.058 L
616.83 9.658 L
615.12 9.29 L
613.41 9.29 L
611.7 8.742 L
609.99 8.742 L
608.28 9.295 L
606.57 9.295 L
604.86 9.773 L
603.15 9.773 L
601.44 12.017 L
599.73 11.288 L
598.02 11.288 L
596.31 11.813 L
594.6 13.654 L
592.89 14.941 L
591.18 15.593 L
589.47 14.851 L
587.76 15.42 L
586.05 15.42 L
584.34 15.42 L
582.63 16.964 L
580.92 16.964 L
579.21 16.854 L
577.5 16.854 L
575.79 14.754 L
574.08 14.754 L
572.37 15.143 L
570.66 16.534 L
568.95 17.851 L
567.24 22.296 L
565.53 22.798 L
563.82 22.798 L
562.11 22.798 L
560.4 27.078 L
558.69 29.956 L
556.98 30.96 L
555.27 30.978 L
553.56 35.797 L
551.85 40.868 L
550.14 41.382 L
548.43 45.392 L
546.72 49.68 L
545.01 51.855 L
543.3 62.178 L
541.59 63.588 L
539.88 68.694 L
538.17 70.908 L
536.46 73.057 L
534.75 74.694 L
533.04 78.892 L
531.33 86.397 L
529.62 88.486 L
527.91 90.866 L
526.2 95.637 L
524.49 98.404 L
522.78 100.219 L
521.07 100.542 L
519.36 106.98 L
517.65 106.187 L
515.94 109.659 L
514.23 113.589 L
512.52 121.121 L
510.81 125.043 L
509.1 129.071 L
507.39 132.639 L
505.68 141.224 L
503.97 147.71 L
502.26 148.828 L
500.55 151.66 L
498.84 157.941 L
497.13 163.381 L
495.42 168.4 L
493.71 177 L
cp
f
GR
GS
[0.75035 0 0 0.74955 0 0.0945] CT
1 0.549 0.549 RC
1 LJ
0.667 LW
N
492 177 M
493.71 177 L
493.722 177.021 L
S
GR
GS
[0.75035 0 0 0.74955 0 0.0945] CT
1 0.549 0.549 RC
1 LJ
0.667 LW
N
498.885 177.021 M
500.55 167.867 L
502.26 153.544 L
503.97 150.203 L
505.68 150.797 L
507.39 147.478 L
509.1 145.711 L
510.81 142.534 L
512.52 142.714 L
514.23 138.142 L
515.94 132.998 L
517.65 131.294 L
519.36 126.045 L
521.07 123.007 L
522.78 120.027 L
524.49 112.332 L
526.2 108.334 L
527.91 103.193 L
529.62 103.423 L
531.33 98.466 L
533.04 95.062 L
534.75 90.345 L
536.46 85.934 L
538.17 75.425 L
539.88 73.46 L
541.59 69.53 L
543.3 67.637 L
545.01 66.334 L
546.72 64.489 L
548.43 61.292 L
550.14 58.257 L
551.85 56.184 L
553.56 55.086 L
555.27 55.605 L
556.98 52.16 L
558.69 51.731 L
560.4 48.284 L
562.11 48.265 L
563.82 48.265 L
565.53 48.265 L
567.24 48.049 L
568.95 45.885 L
570.66 44.616 L
572.37 41.111 L
574.08 38.038 L
575.79 38.038 L
577.5 31.161 L
579.21 31.161 L
580.92 28.742 L
582.63 28.742 L
584.34 27.699 L
586.05 27.699 L
587.76 27.699 L
589.47 27.552 L
591.18 25.217 L
592.89 25.152 L
594.6 24.569 L
596.31 24.541 L
598.02 24.349 L
599.73 24.349 L
601.44 22.028 L
603.15 22.402 L
604.86 22.402 L
606.57 22.163 L
608.28 22.163 L
609.99 22 L
611.7 22 L
613.41 19.859 L
615.12 19.859 L
616.83 17.898 L
618.54 17.782 L
620.25 17.782 L
621.96 17.782 L
623.67 15.936 L
625.38 15.789 L
627.09 15.789 L
628.8 15.789 L
630.51 15.986 L
632.22 15.986 L
633.93 15.986 L
635.64 15.986 L
637.35 15.986 L
639.06 15.986 L
640.77 15.986 L
642.48 15.799 L
644.19 15.799 L
645.9 15.799 L
647.61 15.799 L
649.32 15.799 L
651.03 15.799 L
652.74 13.621 L
654.45 11.666 L
656.16 10.292 L
657.87 10.292 L
659.58 10.292 L
661.29 10.056 L
663 5 L
S
GR
GS
[0.75035 0 0 0.74955 0 0.0945] CT
1 0.549 0.549 RC
1 LJ
0.667 LW
N
492 177 M
493.71 177 L
495.42 168.4 L
497.13 163.381 L
498.84 157.941 L
500.55 151.66 L
502.26 148.828 L
503.97 147.71 L
505.68 141.224 L
507.39 132.639 L
509.1 129.071 L
510.81 125.043 L
512.52 121.121 L
514.23 113.589 L
515.94 109.659 L
517.65 106.187 L
519.36 106.98 L
521.07 100.542 L
522.78 100.219 L
524.49 98.404 L
526.2 95.637 L
527.91 90.866 L
529.62 88.486 L
531.33 86.397 L
533.04 78.892 L
534.75 74.694 L
536.46 73.057 L
538.17 70.908 L
539.88 68.694 L
541.59 63.588 L
543.3 62.178 L
545.01 51.855 L
546.72 49.68 L
548.43 45.392 L
550.14 41.382 L
551.85 40.868 L
553.56 35.797 L
555.27 30.978 L
556.98 30.96 L
558.69 29.956 L
560.4 27.078 L
562.11 22.798 L
563.82 22.798 L
565.53 22.798 L
567.24 22.296 L
568.95 17.851 L
570.66 16.534 L
572.37 15.143 L
574.08 14.754 L
575.79 14.754 L
577.5 16.854 L
579.21 16.854 L
580.92 16.964 L
582.63 16.964 L
584.34 15.42 L
586.05 15.42 L
587.76 15.42 L
589.47 14.851 L
591.18 15.593 L
592.89 14.941 L
594.6 13.654 L
596.31 11.813 L
598.02 11.288 L
599.73 11.288 L
601.44 12.017 L
603.15 9.773 L
604.86 9.773 L
606.57 9.295 L
608.28 9.295 L
609.99 8.742 L
611.7 8.742 L
613.41 9.29 L
615.12 9.29 L
616.83 9.658 L
618.54 9.058 L
620.25 9.058 L
621.96 9.058 L
623.67 8.037 L
625.38 7.468 L
627.09 7.468 L
628.8 7.468 L
630.51 5.401 L
632.22 5.401 L
633.93 5.401 L
635.64 5.401 L
637.35 5.401 L
639.06 5.401 L
640.77 5.401 L
642.131 4.979 L
S
GR
GS
[0.75035 0 0 0.74955 0 0.0945] CT
1 0.549 0.549 RC
1 LJ
0.667 LW
N
651.346 4.979 M
652.74 5.457 L
654.45 5.819 L
656.16 5.6 L
657.87 5.6 L
659.58 5.6 L
661.29 5.119 L
663 5 L
S
GR
GS
[0.75035 0 0 0.74955 0 0.0945] CT
1 0 0 RC
[10 6] 0 setdash
2 LJ
1.333 LW
N
492 177 M
493.71 177 L
495.42 174.133 L
497.13 171.049 L
498.84 167.605 L
500.55 159.764 L
502.26 151.186 L
503.97 148.957 L
505.68 146.01 L
507.39 140.059 L
509.1 137.391 L
510.81 133.789 L
512.52 131.918 L
514.23 125.866 L
515.94 121.329 L
517.65 118.741 L
519.36 116.513 L
521.07 111.775 L
522.78 110.123 L
524.49 105.368 L
526.2 101.985 L
527.91 97.029 L
529.62 95.954 L
531.33 92.432 L
533.04 86.977 L
534.75 82.519 L
536.46 79.495 L
538.17 73.166 L
539.88 71.077 L
541.59 66.559 L
543.3 64.907 L
545.01 59.094 L
546.72 57.085 L
548.43 53.342 L
550.14 49.819 L
551.85 48.526 L
553.56 45.441 L
555.27 43.291 L
556.98 41.56 L
558.69 40.844 L
560.4 37.681 L
562.11 35.531 L
563.82 35.531 L
565.53 35.531 L
567.24 35.173 L
568.95 31.868 L
570.66 30.575 L
572.37 28.127 L
574.08 26.396 L
575.79 26.396 L
577.5 24.007 L
579.21 24.007 L
580.92 22.853 L
582.63 22.853 L
584.34 21.559 L
586.05 21.559 L
587.76 21.559 L
589.47 21.201 L
591.18 20.405 L
592.89 20.047 L
594.6 19.112 L
596.31 18.177 L
598.02 17.819 L
599.73 17.819 L
601.44 17.022 L
603.15 16.088 L
604.86 16.088 L
606.57 15.729 L
608.28 15.729 L
609.99 15.371 L
611.7 15.371 L
613.41 14.575 L
615.12 14.575 L
616.83 13.778 L
618.54 13.42 L
620.25 13.42 L
621.96 13.42 L
623.67 11.987 L
625.38 11.628 L
627.09 11.628 L
628.8 11.628 L
630.51 10.694 L
632.22 10.694 L
633.93 10.694 L
635.64 10.694 L
637.35 10.694 L
639.06 10.694 L
640.77 10.694 L
642.48 10.335 L
644.19 10.335 L
645.9 10.335 L
647.61 10.335 L
649.32 10.335 L
651.03 10.335 L
652.74 9.539 L
654.45 8.743 L
656.16 7.946 L
657.87 7.946 L
659.58 7.946 L
661.29 7.588 L
663 5 L
S
GR
GS
[0.75035 0 0 0.74955 0 0.0945] CT
0.851 0.851 1 RC
N
495.42 160.882 M
493.71 177 L
493.718 177.021 L
493.745 177.021 L
499.865 177.021 L
500.55 175.019 L
502.26 150.208 L
503.97 132.59 L
505.68 122.958 L
507.39 111.406 L
509.1 102.582 L
510.81 98.498 L
512.52 97.418 L
514.23 94.79 L
515.94 88.042 L
517.65 85.758 L
519.36 76.662 L
521.07 72.495 L
522.78 72.576 L
524.49 70.93 L
526.2 69.437 L
527.91 67.468 L
529.62 66.495 L
531.33 64.758 L
533.04 64.135 L
534.75 60.676 L
536.46 56.282 L
538.17 55.313 L
539.88 52.141 L
541.59 51.113 L
543.3 46.561 L
545.01 44.295 L
546.72 42.346 L
548.43 40.109 L
550.14 39.918 L
551.85 37.881 L
553.56 36.357 L
555.27 36.917 L
556.98 36.588 L
558.69 35.16 L
560.4 35.16 L
562.11 33.468 L
563.82 32.154 L
565.53 30.372 L
567.24 30.372 L
568.95 30.372 L
570.66 28.393 L
572.37 27.145 L
574.08 27.145 L
575.79 27.145 L
577.5 25.519 L
579.21 22.788 L
580.92 22.788 L
582.63 23.186 L
584.34 23.186 L
586.05 22.248 L
587.76 20.655 L
589.47 20.655 L
591.18 17.832 L
592.89 17.832 L
594.6 17.832 L
596.31 16.931 L
598.02 14.461 L
599.73 14.461 L
601.44 14.461 L
603.15 14.461 L
604.86 14.461 L
606.57 14.461 L
608.28 14.461 L
609.99 14.715 L
611.7 12.932 L
613.41 12.837 L
615.12 10.247 L
616.83 10.247 L
618.54 10.247 L
620.25 10.247 L
621.96 10.247 L
623.67 10.247 L
625.38 10.247 L
627.09 10.247 L
628.8 10.247 L
630.51 10.247 L
632.22 10.247 L
633.93 10.247 L
635.64 10.247 L
637.35 10.247 L
639.06 10.231 L
640.77 10.231 L
642.48 10.231 L
644.19 10.231 L
645.9 8.947 L
647.61 8.947 L
649.32 8.351 L
651.03 8.351 L
652.74 8.351 L
654.45 8.351 L
656.16 8.351 L
657.87 8.351 L
659.58 8.351 L
661.29 6.675 L
663 5 L
662.937 4.979 L
661.29 4.979 L
660.251 4.979 L
659.58 4.979 L
658.29 4.979 L
657.87 4.979 L
656.58 4.979 L
656.16 4.979 L
654.87 4.979 L
654.45 4.979 L
653.16 4.979 L
652.74 4.979 L
651.45 4.979 L
651.03 4.979 L
649.74 4.979 L
649.32 4.979 L
647.787 4.979 L
647.61 4.979 L
646.053 4.979 L
645.9 4.979 L
644.336 4.979 L
644.19 4.979 L
642.593 4.979 L
642.48 4.979 L
640.883 4.979 L
640.77 4.979 L
639.173 4.979 L
639.06 4.979 L
638.141 4.979 L
637.35 5.298 L
635.64 5.298 L
633.93 5.298 L
632.22 5.298 L
630.51 5.298 L
628.8 5.298 L
627.09 5.298 L
625.38 5.298 L
623.67 5.298 L
621.96 5.298 L
620.25 5.298 L
618.54 5.298 L
616.83 5.298 L
615.12 5.298 L
613.41 5.127 L
611.7 5.738 L
609.99 5.963 L
608.28 8.676 L
606.57 8.676 L
604.86 8.676 L
603.15 8.676 L
601.44 8.676 L
599.73 8.676 L
598.02 8.676 L
596.31 8.627 L
594.6 8.842 L
592.89 8.842 L
591.18 8.842 L
589.47 9.849 L
587.76 9.849 L
586.05 9.559 L
584.34 9.738 L
582.63 9.738 L
580.92 11.891 L
579.21 11.891 L
577.5 12.99 L
575.79 12.667 L
574.08 12.667 L
572.37 12.667 L
570.66 13.946 L
568.95 17.365 L
567.24 17.365 L
565.53 17.365 L
563.82 18.11 L
562.11 17.913 L
560.4 18.043 L
558.69 18.043 L
556.98 17.731 L
555.27 18.108 L
553.56 20.422 L
551.85 20.015 L
550.14 22.858 L
548.43 25.833 L
546.72 26.122 L
545.01 25.995 L
543.3 26.854 L
541.59 27.407 L
539.88 28.494 L
538.17 27.556 L
536.46 29.3 L
534.75 29.254 L
533.04 31.792 L
531.33 33.177 L
529.62 35.017 L
527.91 39.815 L
526.2 43.165 L
524.49 44.384 L
522.78 50.079 L
521.07 52.62 L
519.36 53.558 L
517.65 55.22 L
515.94 59.119 L
514.23 60.348 L
512.52 63.451 L
510.81 70.004 L
509.1 75.069 L
507.39 78.412 L
505.68 82.364 L
503.97 87.76 L
502.26 96.816 L
500.55 106.113 L
498.84 116.793 L
497.13 136.901 L
cp
f
GR
GS
[0.75035 0 0 0.74955 0 0.0945] CT
0.549 0.549 1 RC
1 LJ
0.667 LW
N
492 177 M
493.71 177 L
493.718 177.021 L
S
GR
GS
[0.75035 0 0 0.74955 0 0.0945] CT
0.549 0.549 1 RC
1 LJ
0.667 LW
N
499.865 177.021 M
500.55 175.019 L
502.26 150.208 L
503.97 132.59 L
505.68 122.958 L
507.39 111.406 L
509.1 102.582 L
510.81 98.498 L
512.52 97.418 L
514.23 94.79 L
515.94 88.042 L
517.65 85.758 L
519.36 76.662 L
521.07 72.495 L
522.78 72.576 L
524.49 70.93 L
526.2 69.437 L
527.91 67.468 L
529.62 66.495 L
531.33 64.758 L
533.04 64.135 L
534.75 60.676 L
536.46 56.282 L
538.17 55.313 L
539.88 52.141 L
541.59 51.113 L
543.3 46.561 L
545.01 44.295 L
546.72 42.346 L
548.43 40.109 L
550.14 39.918 L
551.85 37.881 L
553.56 36.357 L
555.27 36.917 L
556.98 36.588 L
558.69 35.16 L
560.4 35.16 L
562.11 33.468 L
563.82 32.154 L
565.53 30.372 L
567.24 30.372 L
568.95 30.372 L
570.66 28.393 L
572.37 27.145 L
574.08 27.145 L
575.79 27.145 L
577.5 25.519 L
579.21 22.788 L
580.92 22.788 L
582.63 23.186 L
584.34 23.186 L
586.05 22.248 L
587.76 20.655 L
589.47 20.655 L
591.18 17.832 L
592.89 17.832 L
594.6 17.832 L
596.31 16.931 L
598.02 14.461 L
599.73 14.461 L
601.44 14.461 L
603.15 14.461 L
604.86 14.461 L
606.57 14.461 L
608.28 14.461 L
609.99 14.715 L
611.7 12.932 L
613.41 12.837 L
615.12 10.247 L
616.83 10.247 L
618.54 10.247 L
620.25 10.247 L
621.96 10.247 L
623.67 10.247 L
625.38 10.247 L
627.09 10.247 L
628.8 10.247 L
630.51 10.247 L
632.22 10.247 L
633.93 10.247 L
635.64 10.247 L
637.35 10.247 L
639.06 10.231 L
640.77 10.231 L
642.48 10.231 L
644.19 10.231 L
645.9 8.947 L
647.61 8.947 L
649.32 8.351 L
651.03 8.351 L
652.74 8.351 L
654.45 8.351 L
656.16 8.351 L
657.87 8.351 L
659.58 8.351 L
661.29 6.675 L
663 5 L
S
GR
GS
[0.75035 0 0 0.74955 0 0.0945] CT
0.549 0.549 1 RC
1 LJ
0.667 LW
N
492 177 M
493.71 177 L
495.42 160.882 L
497.13 136.901 L
498.84 116.793 L
500.55 106.113 L
502.26 96.816 L
503.97 87.76 L
505.68 82.364 L
507.39 78.412 L
509.1 75.069 L
510.81 70.004 L
512.52 63.451 L
514.23 60.348 L
515.94 59.119 L
517.65 55.22 L
519.36 53.558 L
521.07 52.62 L
522.78 50.079 L
524.49 44.384 L
526.2 43.165 L
527.91 39.815 L
529.62 35.017 L
531.33 33.177 L
533.04 31.792 L
534.75 29.254 L
536.46 29.3 L
538.17 27.556 L
539.88 28.494 L
541.59 27.407 L
543.3 26.854 L
545.01 25.995 L
546.72 26.122 L
548.43 25.833 L
550.14 22.858 L
551.85 20.015 L
553.56 20.422 L
555.27 18.108 L
556.98 17.731 L
558.69 18.043 L
560.4 18.043 L
562.11 17.913 L
563.82 18.11 L
565.53 17.365 L
567.24 17.365 L
568.95 17.365 L
570.66 13.946 L
572.37 12.667 L
574.08 12.667 L
575.79 12.667 L
577.5 12.99 L
579.21 11.891 L
580.92 11.891 L
582.63 9.738 L
584.34 9.738 L
586.05 9.559 L
587.76 9.849 L
589.47 9.849 L
591.18 8.842 L
592.89 8.842 L
594.6 8.842 L
596.31 8.627 L
598.02 8.676 L
599.73 8.676 L
601.44 8.676 L
603.15 8.676 L
604.86 8.676 L
606.57 8.676 L
608.28 8.676 L
609.99 5.963 L
611.7 5.738 L
613.41 5.127 L
615.12 5.298 L
616.83 5.298 L
618.54 5.298 L
620.25 5.298 L
621.96 5.298 L
623.67 5.298 L
625.38 5.298 L
627.09 5.298 L
628.8 5.298 L
630.51 5.298 L
632.22 5.298 L
633.93 5.298 L
635.64 5.298 L
637.35 5.298 L
638.141 4.979 L
S
GR
GS
[0.75035 0 0 0.74955 0 0.0945] CT
0.549 0.549 1 RC
1 LJ
0.667 LW
N
662.937 4.979 M
663 5 L
S
GR
GS
[0.75035 0 0 0.74955 0 0.0945] CT
0 0 1 RC
[10 6] 0 setdash
2 LJ
1.333 LW
N
492 177 M
493.71 177 L
495.42 171.03 L
497.13 162.427 L
498.84 148.405 L
500.55 140.566 L
502.26 123.512 L
503.97 110.175 L
505.68 102.661 L
507.39 94.909 L
509.1 88.826 L
510.81 84.251 L
512.52 80.435 L
514.23 77.569 L
515.94 73.58 L
517.65 70.489 L
519.36 65.11 L
521.07 62.557 L
522.78 61.327 L
524.49 57.657 L
526.2 56.301 L
527.91 53.642 L
529.62 50.756 L
531.33 48.968 L
533.04 47.964 L
534.75 44.965 L
536.46 42.791 L
538.17 41.434 L
539.88 40.318 L
541.59 39.26 L
543.3 36.707 L
545.01 35.145 L
546.72 34.234 L
548.43 32.971 L
550.14 31.388 L
551.85 28.948 L
553.56 28.39 L
555.27 27.512 L
556.98 27.16 L
558.69 26.601 L
560.4 26.601 L
562.11 25.69 L
563.82 25.132 L
565.53 23.869 L
567.24 23.869 L
568.95 23.869 L
570.66 21.169 L
572.37 19.906 L
574.08 19.906 L
575.79 19.906 L
577.5 19.254 L
579.21 17.34 L
580.92 17.34 L
582.63 16.462 L
584.34 16.462 L
586.05 15.904 L
587.76 15.252 L
589.47 15.252 L
591.18 13.337 L
592.89 13.337 L
594.6 13.337 L
596.31 12.779 L
598.02 11.569 L
599.73 11.569 L
601.44 11.569 L
603.15 11.569 L
604.86 11.569 L
606.57 11.569 L
608.28 11.569 L
609.99 10.339 L
611.7 9.335 L
613.41 8.982 L
615.12 7.772 L
616.83 7.772 L
618.54 7.772 L
620.25 7.772 L
621.96 7.772 L
623.67 7.772 L
625.38 7.772 L
627.09 7.772 L
628.8 7.772 L
630.51 7.772 L
632.22 7.772 L
633.93 7.772 L
635.64 7.772 L
637.35 7.772 L
639.06 7.42 L
640.77 7.42 L
642.48 7.42 L
644.19 7.42 L
645.9 6.768 L
647.61 6.768 L
649.32 6.117 L
651.03 6.117 L
652.74 6.117 L
654.45 6.117 L
656.16 6.117 L
657.87 6.117 L
659.58 6.117 L
661.29 5.558 L
663 5 L
S
GR
GS
[0.75035 0 0 0.74955 0 0.0945] CT
0.851 GC
[2 2] 0 setdash
2 LJ
2.667 LW
N
492 177 M
492 5 L
S
GR
GS
[0.75035 0 0 0.74955 0 0.0945] CT
0.851 GC
[2 2] 0 setdash
2 LJ
2.667 LW
N
526.2 177 M
526.2 5 L
S
GR
GS
[0.75035 0 0 0.74955 0 0.0945] CT
0.851 GC
[2 2] 0 setdash
2 LJ
2.667 LW
N
560.4 177 M
560.4 5 L
S
GR
GS
[0.75035 0 0 0.74955 0 0.0945] CT
0.851 GC
[2 2] 0 setdash
2 LJ
2.667 LW
N
594.6 177 M
594.6 5 L
S
GR
GS
[0.75035 0 0 0.74955 0 0.0945] CT
0.851 GC
[2 2] 0 setdash
2 LJ
2.667 LW
N
628.8 177 M
628.8 5 L
S
GR
GS
[0.75035 0 0 0.74955 0 0.0945] CT
0.851 GC
[2 2] 0 setdash
2 LJ
2.667 LW
N
663 177 M
663 5 L
S
GR
GS
[0.75035 0 0 0.74955 0 0.0945] CT
0.851 GC
[2 2] 0 setdash
2 LJ
2.667 LW
N
663 177 M
492 177 L
S
GR
GS
[0.75035 0 0 0.74955 0 0.0945] CT
0.851 GC
[2 2] 0 setdash
2 LJ
2.667 LW
N
663 142.6 M
492 142.6 L
S
GR
GS
[0.75035 0 0 0.74955 0 0.0945] CT
0.851 GC
[2 2] 0 setdash
2 LJ
2.667 LW
N
663 108.2 M
492 108.2 L
S
GR
GS
[0.75035 0 0 0.74955 0 0.0945] CT
0.851 GC
[2 2] 0 setdash
2 LJ
2.667 LW
N
663 73.8 M
492 73.8 L
S
GR
GS
[0.75035 0 0 0.74955 0 0.0945] CT
0.851 GC
[2 2] 0 setdash
2 LJ
2.667 LW
N
663 39.4 M
492 39.4 L
S
GR
GS
[0.75035 0 0 0.74955 0 0.0945] CT
0.851 GC
[2 2] 0 setdash
2 LJ
2.667 LW
N
663 5 M
492 5 L
S
GR
GS
[0.75035 0 0 0.74955 0 0.0945] CT
2 setlinecap
1 LJ
2.667 LW
N
492 177 M
663 177 L
S
GR
GS
[0.75035 0 0 0.74955 0 0.0945] CT
2 setlinecap
1 LJ
2.667 LW
N
492 5 M
663 5 L
S
GR
GS
[0.75035 0 0 0.74955 0 0.0945] CT
2 setlinecap
1 LJ
2.667 LW
N
492 177 M
492 175.28 L
S
GR
GS
[0.75035 0 0 0.74955 0 0.0945] CT
2 setlinecap
1 LJ
2.667 LW
N
526.2 177 M
526.2 175.28 L
S
GR
GS
[0.75035 0 0 0.74955 0 0.0945] CT
2 setlinecap
1 LJ
2.667 LW
N
560.4 177 M
560.4 175.28 L
S
GR
GS
[0.75035 0 0 0.74955 0 0.0945] CT
2 setlinecap
1 LJ
2.667 LW
N
594.6 177 M
594.6 175.28 L
S
GR
GS
[0.75035 0 0 0.74955 0 0.0945] CT
2 setlinecap
1 LJ
2.667 LW
N
628.8 177 M
628.8 175.28 L
S
GR
GS
[0.75035 0 0 0.74955 0 0.0945] CT
2 setlinecap
1 LJ
2.667 LW
N
663 177 M
663 175.28 L
S
GR
GS
[0.75035 0 0 0.74955 0 0.0945] CT
2 setlinecap
1 LJ
2.667 LW
N
492 5 M
492 6.72 L
S
GR
GS
[0.75035 0 0 0.74955 0 0.0945] CT
2 setlinecap
1 LJ
2.667 LW
N
526.2 5 M
526.2 6.72 L
S
GR
GS
[0.75035 0 0 0.74955 0 0.0945] CT
2 setlinecap
1 LJ
2.667 LW
N
560.4 5 M
560.4 6.72 L
S
GR
GS
[0.75035 0 0 0.74955 0 0.0945] CT
2 setlinecap
1 LJ
2.667 LW
N
594.6 5 M
594.6 6.72 L
S
GR
GS
[0.75035 0 0 0.74955 0 0.0945] CT
2 setlinecap
1 LJ
2.667 LW
N
628.8 5 M
628.8 6.72 L
S
GR
GS
[0.75035 0 0 0.74955 0 0.0945] CT
2 setlinecap
1 LJ
2.667 LW
N
663 5 M
663 6.72 L
S
GR
GS
[0.75035 0 0 0.74955 369.1709 134.36311] CT
/Helvetica-Bold 10.667 F
GS
[1 0 0 1 0 0] CT
-3 10 moveto 
1 -1 scale
(0) t 
GR
GR
GS
[0.75035 0 0 0.74955 394.83279 134.36311] CT
/Helvetica-Bold 10.667 F
GS
[1 0 0 1 0 0] CT
-7.5 10 moveto 
1 -1 scale
(0.2) t 
GR
GR
GS
[0.75035 0 0 0.74955 420.49468 134.36311] CT
/Helvetica-Bold 10.667 F
GS
[1 0 0 1 0 0] CT
-7.5 10 moveto 
1 -1 scale
(0.4) t 
GR
GR
GS
[0.75035 0 0 0.74955 446.15652 134.36311] CT
/Helvetica-Bold 10.667 F
GS
[1 0 0 1 0 0] CT
-7.5 10 moveto 
1 -1 scale
(0.6) t 
GR
GR
GS
[0.75035 0 0 0.74955 471.81841 134.36311] CT
/Helvetica-Bold 10.667 F
GS
[1 0 0 1 0 0] CT
-7.5 10 moveto 
1 -1 scale
(0.8) t 
GR
GR
GS
[0.75035 0 0 0.74955 497.4803 134.36311] CT
/Helvetica-Bold 10.667 F
GS
[1 0 0 1 0 0] CT
-3 10 moveto 
1 -1 scale
(1) t 
GR
GR
GS
[0.75035 0 0 0.74955 379.67577 152.25227] CT
/Helvetica-Bold 11.733 F
GS
[1 0 0 1 0 0] CT
0 0 moveto 
1 -1 scale
(Normalized P) t 
GR
GR
GS
[0.75035 0 0 0.74955 435.95182 156] CT
/Helvetica-Bold 9.387 F
GS
[1 0 0 1 0 0] CT
0 0 moveto 
1 -1 scale
(sigV) t 
GR
GR
GS
[0.75035 0 0 0.74955 450.95876 152.25227] CT
/Helvetica-Bold 11.733 F
GS
[1 0 0 1 0 0] CT
0 0 moveto 
1 -1 scale
(-YFP\(au\)) t 
GR
GR
GS
[0.75035 0 0 0.74955 0 0.0945] CT
2 setlinecap
1 LJ
2.667 LW
N
492 177 M
492 5 L
S
GR
GS
[0.75035 0 0 0.74955 0 0.0945] CT
2 setlinecap
1 LJ
2.667 LW
N
663 177 M
663 5 L
S
GR
GS
[0.75035 0 0 0.74955 0 0.0945] CT
2 setlinecap
1 LJ
2.667 LW
N
492 177 M
493.72 177 L
S
GR
GS
[0.75035 0 0 0.74955 0 0.0945] CT
2 setlinecap
1 LJ
2.667 LW
N
492 142.6 M
493.72 142.6 L
S
GR
GS
[0.75035 0 0 0.74955 0 0.0945] CT
2 setlinecap
1 LJ
2.667 LW
N
492 108.2 M
493.72 108.2 L
S
GR
GS
[0.75035 0 0 0.74955 0 0.0945] CT
2 setlinecap
1 LJ
2.667 LW
N
492 73.8 M
493.72 73.8 L
S
GR
GS
[0.75035 0 0 0.74955 0 0.0945] CT
2 setlinecap
1 LJ
2.667 LW
N
492 39.4 M
493.72 39.4 L
S
GR
GS
[0.75035 0 0 0.74955 0 0.0945] CT
2 setlinecap
1 LJ
2.667 LW
N
492 5 M
493.72 5 L
S
GR
GS
[0.75035 0 0 0.74955 0 0.0945] CT
2 setlinecap
1 LJ
2.667 LW
N
663 177 M
661.28 177 L
S
GR
GS
[0.75035 0 0 0.74955 0 0.0945] CT
2 setlinecap
1 LJ
2.667 LW
N
663 142.6 M
661.28 142.6 L
S
GR
GS
[0.75035 0 0 0.74955 0 0.0945] CT
2 setlinecap
1 LJ
2.667 LW
N
663 108.2 M
661.28 108.2 L
S
GR
GS
[0.75035 0 0 0.74955 0 0.0945] CT
2 setlinecap
1 LJ
2.667 LW
N
663 73.8 M
661.28 73.8 L
S
GR
GS
[0.75035 0 0 0.74955 0 0.0945] CT
2 setlinecap
1 LJ
2.667 LW
N
663 39.4 M
661.28 39.4 L
S
GR
GS
[0.75035 0 0 0.74955 0 0.0945] CT
2 setlinecap
1 LJ
2.667 LW
N
663 5 M
661.28 5 L
S
GR
GS
[0.75035 0 0 0.74955 367.57016 132.76408] CT
/Helvetica-Bold 10.667 F
GS
[1 0 0 1 0 0] CT
-6 3.5 moveto 
1 -1 scale
(0) t 
GR
GR
GS
[0.75035 0 0 0.74955 367.57016 106.97972] CT
/Helvetica-Bold 10.667 F
GS
[1 0 0 1 0 0] CT
-15 3.5 moveto 
1 -1 scale
(0.2) t 
GR
GR
GS
[0.75035 0 0 0.74955 367.57016 81.19534] CT
/Helvetica-Bold 10.667 F
GS
[1 0 0 1 0 0] CT
-15 3.5 moveto 
1 -1 scale
(0.4) t 
GR
GR
GS
[0.75035 0 0 0.74955 367.57016 55.41097] CT
/Helvetica-Bold 10.667 F
GS
[1 0 0 1 0 0] CT
-15 3.5 moveto 
1 -1 scale
(0.6) t 
GR
GR
GS
[0.75035 0 0 0.74955 367.57016 29.6266] CT
/Helvetica-Bold 10.667 F
GS
[1 0 0 1 0 0] CT
-15 3.5 moveto 
1 -1 scale
(0.8) t 
GR
GR
GS
[0.75035 0 0 0.74955 367.57016 3.84223] CT
/Helvetica-Bold 10.667 F
GS
[1 0 0 1 0 0] CT
-6 3.5 moveto 
1 -1 scale
(1) t 
GR
GR
GS
[0 -0.74955 0.75035 0 355.31448 68.30309] CT
/Helvetica-Bold 11.733 F
GS
[1 0 0 1 0 0] CT
-69 -3 moveto 
1 -1 scale
(Cumulative Fraction \(au\)) t 
GR
GR
GS
[0.75035 0 0 0.74955 0 0.0945] CT
1 GC
N
656 169 M
656 123 L
545 123 L
545 169 L
cp
f
GR
GS
[0.75035 0 0 0.74955 444.20564 97.59309] CT
/Helvetica-Bold 8 F
GS
[1 0 0 1 0 0] CT
0 3 moveto 
1 -1 scale
(Survivors) t 
GR
GR
GS
[0.75035 0 0 0.74955 0 0.0945] CT
0 0 1 RC
1 LJ
0.667 LW
N
549 130.077 M
589 130.077 L
S
GR
GS
[0.75035 0 0 0.74955 444.20564 105.54981] CT
/Helvetica-Bold 8 F
GS
[1 0 0 1 0 0] CT
0 3 moveto 
1 -1 scale
(Mean Survivors) t 
GR
GR
GS
[0.75035 0 0 0.74955 0 0.0945] CT
0 0 1 RC
[10 6] 0 setdash
2 LJ
1.333 LW
N
549 140.692 M
589 140.692 L
S
GR
GS
[0.75035 0 0 0.74955 444.20564 113.50653] CT
/Helvetica-Bold 8 F
GS
[1 0 0 1 0 0] CT
0 3 moveto 
1 -1 scale
(Perishers) t 
GR
GR
GS
[0.75035 0 0 0.74955 0 0.0945] CT
1 0 0 RC
1 LJ
0.667 LW
N
549 151.308 M
589 151.308 L
S
GR
GS
[0.75035 0 0 0.74955 444.20564 121.46324] CT
/Helvetica-Bold 8 F
GS
[1 0 0 1 0 0] CT
0 3 moveto 
1 -1 scale
(MeanPerishers) t 
GR
GR
GS
[0.75035 0 0 0.74955 0 0.0945] CT
1 0 0 RC
[10 6] 0 setdash
2 LJ
1.333 LW
N
549 161.923 M
589 161.923 L
S
GR
GS
[0.75035 0 0 0.74955 0 0.0945] CT
10.0 ML
2.667 LW
N
545 169 M
545 123 L
656 123 L
656 169 L
cp
S
GR
%%Trailer
%%Pages: 1
%%EOF
