<?xml version="1.0" encoding="utf-8"?>
<svg xmlns="http://www.w3.org/2000/svg" xmlns:xlink="http://www.w3.org/1999/xlink" width="600" height="450" viewBox="0 0 2400 1800">
<defs>
  <clipPath id="clip420">
    <rect x="0" y="0" width="2400" height="1800"/>
  </clipPath>
</defs>
<path clip-path="url(#clip420)" d="
M0 1800 L2400 1800 L2400 0 L0 0  Z
  " fill="#ffffff" fill-rule="evenodd" fill-opacity="1"/>
<defs>
  <clipPath id="clip421">
    <rect x="480" y="0" width="1681" height="1681"/>
  </clipPath>
</defs>
<path clip-path="url(#clip420)" d="
M158.369 1666.31 L2352.76 1666.31 L2352.76 47.2441 L158.369 47.2441  Z
  " fill="#ffffff" fill-rule="evenodd" fill-opacity="1"/>
<defs>
  <clipPath id="clip422">
    <rect x="158" y="47" width="2195" height="1620"/>
  </clipPath>
</defs>
<polyline clip-path="url(#clip420)" style="stroke:#000000; stroke-linecap:butt; stroke-linejoin:round; stroke-width:4; stroke-opacity:1; fill:none" points="
  158.369,1666.31 2352.76,1666.31 
  "/>
<polyline clip-path="url(#clip420)" style="stroke:#000000; stroke-linecap:butt; stroke-linejoin:round; stroke-width:4; stroke-opacity:1; fill:none" points="
  158.369,47.2441 2352.76,47.2441 
  "/>
<polyline clip-path="url(#clip420)" style="stroke:#000000; stroke-linecap:butt; stroke-linejoin:round; stroke-width:4; stroke-opacity:1; fill:none" points="
  158.369,1666.31 158.369,1647.41 
  "/>
<polyline clip-path="url(#clip420)" style="stroke:#000000; stroke-linecap:butt; stroke-linejoin:round; stroke-width:4; stroke-opacity:1; fill:none" points="
  889.831,1666.31 889.831,1647.41 
  "/>
<polyline clip-path="url(#clip420)" style="stroke:#000000; stroke-linecap:butt; stroke-linejoin:round; stroke-width:4; stroke-opacity:1; fill:none" points="
  1621.29,1666.31 1621.29,1647.41 
  "/>
<polyline clip-path="url(#clip420)" style="stroke:#000000; stroke-linecap:butt; stroke-linejoin:round; stroke-width:4; stroke-opacity:1; fill:none" points="
  2352.76,1666.31 2352.76,1647.41 
  "/>
<path clip-path="url(#clip420)" d="M108.484 1740.43 L116.123 1740.43 L116.123 1714.07 L107.813 1715.74 L107.813 1711.48 L116.077 1709.81 L120.753 1709.81 L120.753 1740.43 L128.392 1740.43 L128.392 1744.37 L108.484 1744.37 L108.484 1740.43 Z" fill="#000000" fill-rule="evenodd" fill-opacity="1" /><path clip-path="url(#clip420)" d="M147.836 1712.89 Q144.225 1712.89 142.396 1716.45 Q140.591 1719.99 140.591 1727.12 Q140.591 1734.23 142.396 1737.8 Q144.225 1741.34 147.836 1741.34 Q151.47 1741.34 153.276 1737.8 Q155.104 1734.23 155.104 1727.12 Q155.104 1719.99 153.276 1716.45 Q151.47 1712.89 147.836 1712.89 M147.836 1709.18 Q153.646 1709.18 156.702 1713.79 Q159.78 1718.37 159.78 1727.12 Q159.78 1735.85 156.702 1740.46 Q153.646 1745.04 147.836 1745.04 Q142.026 1745.04 138.947 1740.46 Q135.892 1735.85 135.892 1727.12 Q135.892 1718.37 138.947 1713.79 Q142.026 1709.18 147.836 1709.18 Z" fill="#000000" fill-rule="evenodd" fill-opacity="1" /><path clip-path="url(#clip420)" d="M159.78 1703.29 L183.892 1703.29 L183.892 1706.48 L159.78 1706.48 L159.78 1703.29 Z" fill="#000000" fill-rule="evenodd" fill-opacity="1" /><path clip-path="url(#clip420)" d="M192.75 1713.76 L198.957 1713.76 L198.957 1692.34 L192.205 1693.69 L192.205 1690.23 L198.919 1688.88 L202.719 1688.88 L202.719 1713.76 L208.925 1713.76 L208.925 1716.96 L192.75 1716.96 L192.75 1713.76 Z" fill="#000000" fill-rule="evenodd" fill-opacity="1" /><path clip-path="url(#clip420)" d="M854.814 1740.43 L862.453 1740.43 L862.453 1714.07 L854.143 1715.74 L854.143 1711.48 L862.407 1709.81 L867.083 1709.81 L867.083 1740.43 L874.721 1740.43 L874.721 1744.37 L854.814 1744.37 L854.814 1740.43 Z" fill="#000000" fill-rule="evenodd" fill-opacity="1" /><path clip-path="url(#clip420)" d="M894.166 1712.89 Q890.555 1712.89 888.726 1716.45 Q886.92 1719.99 886.92 1727.12 Q886.92 1734.23 888.726 1737.8 Q890.555 1741.34 894.166 1741.34 Q897.8 1741.34 899.606 1737.8 Q901.434 1734.23 901.434 1727.12 Q901.434 1719.99 899.606 1716.45 Q897.8 1712.89 894.166 1712.89 M894.166 1709.18 Q899.976 1709.18 903.032 1713.79 Q906.11 1718.37 906.11 1727.12 Q906.11 1735.85 903.032 1740.46 Q899.976 1745.04 894.166 1745.04 Q888.356 1745.04 885.277 1740.46 Q882.221 1735.85 882.221 1727.12 Q882.221 1718.37 885.277 1713.79 Q888.356 1709.18 894.166 1709.18 Z" fill="#000000" fill-rule="evenodd" fill-opacity="1" /><path clip-path="url(#clip420)" d="M915.815 1691.38 Q912.881 1691.38 911.395 1694.28 Q909.928 1697.15 909.928 1702.95 Q909.928 1708.72 911.395 1711.62 Q912.881 1714.5 915.815 1714.5 Q918.768 1714.5 920.235 1711.62 Q921.721 1708.72 921.721 1702.95 Q921.721 1697.15 920.235 1694.28 Q918.768 1691.38 915.815 1691.38 M915.815 1688.37 Q920.536 1688.37 923.018 1692.11 Q925.52 1695.84 925.52 1702.95 Q925.52 1710.04 923.018 1713.78 Q920.536 1717.5 915.815 1717.5 Q911.094 1717.5 908.593 1713.78 Q906.11 1710.04 906.11 1702.95 Q906.11 1695.84 908.593 1692.11 Q911.094 1688.37 915.815 1688.37 Z" fill="#000000" fill-rule="evenodd" fill-opacity="1" /><path clip-path="url(#clip420)" d="M1587.62 1740.43 L1595.26 1740.43 L1595.26 1714.07 L1586.95 1715.74 L1586.95 1711.48 L1595.21 1709.81 L1599.89 1709.81 L1599.89 1740.43 L1607.53 1740.43 L1607.53 1744.37 L1587.62 1744.37 L1587.62 1740.43 Z" fill="#000000" fill-rule="evenodd" fill-opacity="1" /><path clip-path="url(#clip420)" d="M1626.97 1712.89 Q1623.36 1712.89 1621.53 1716.45 Q1619.73 1719.99 1619.73 1727.12 Q1619.73 1734.23 1621.53 1737.8 Q1623.36 1741.34 1626.97 1741.34 Q1630.61 1741.34 1632.41 1737.8 Q1634.24 1734.23 1634.24 1727.12 Q1634.24 1719.99 1632.41 1716.45 Q1630.61 1712.89 1626.97 1712.89 M1626.97 1709.18 Q1632.78 1709.18 1635.84 1713.79 Q1638.92 1718.37 1638.92 1727.12 Q1638.92 1735.85 1635.84 1740.46 Q1632.78 1745.04 1626.97 1745.04 Q1621.16 1745.04 1618.08 1740.46 Q1615.03 1735.85 1615.03 1727.12 Q1615.03 1718.37 1618.08 1713.79 Q1621.16 1709.18 1626.97 1709.18 Z" fill="#000000" fill-rule="evenodd" fill-opacity="1" /><path clip-path="url(#clip420)" d="M1639.46 1713.76 L1645.67 1713.76 L1645.67 1692.34 L1638.92 1693.69 L1638.92 1690.23 L1645.63 1688.88 L1649.43 1688.88 L1649.43 1713.76 L1655.64 1713.76 L1655.64 1716.96 L1639.46 1716.96 L1639.46 1713.76 Z" fill="#000000" fill-rule="evenodd" fill-opacity="1" /><path clip-path="url(#clip420)" d="M2318.53 1740.43 L2326.17 1740.43 L2326.17 1714.07 L2317.86 1715.74 L2317.86 1711.48 L2326.12 1709.81 L2330.8 1709.81 L2330.8 1740.43 L2338.44 1740.43 L2338.44 1744.37 L2318.53 1744.37 L2318.53 1740.43 Z" fill="#000000" fill-rule="evenodd" fill-opacity="1" /><path clip-path="url(#clip420)" d="M2357.88 1712.89 Q2354.27 1712.89 2352.44 1716.45 Q2350.63 1719.99 2350.63 1727.12 Q2350.63 1734.23 2352.44 1737.8 Q2354.27 1741.34 2357.88 1741.34 Q2361.51 1741.34 2363.32 1737.8 Q2365.15 1734.23 2365.15 1727.12 Q2365.15 1719.99 2363.32 1716.45 Q2361.51 1712.89 2357.88 1712.89 M2357.88 1709.18 Q2363.69 1709.18 2366.75 1713.79 Q2369.82 1718.37 2369.82 1727.12 Q2369.82 1735.85 2366.75 1740.46 Q2363.69 1745.04 2357.88 1745.04 Q2352.07 1745.04 2348.99 1740.46 Q2345.94 1735.85 2345.94 1727.12 Q2345.94 1718.37 2348.99 1713.79 Q2352.07 1709.18 2357.88 1709.18 Z" fill="#000000" fill-rule="evenodd" fill-opacity="1" /><path clip-path="url(#clip420)" d="M2374.39 1713.76 L2387.65 1713.76 L2387.65 1716.96 L2369.82 1716.96 L2369.82 1713.76 Q2371.99 1711.52 2375.71 1707.76 Q2379.45 1703.98 2380.41 1702.89 Q2382.24 1700.84 2382.95 1699.43 Q2383.69 1698 2383.69 1696.63 Q2383.69 1694.39 2382.11 1692.98 Q2380.55 1691.57 2378.02 1691.57 Q2376.24 1691.57 2374.24 1692.19 Q2372.27 1692.81 2370.01 1694.07 L2370.01 1690.23 Q2372.31 1689.31 2374.3 1688.84 Q2376.29 1688.37 2377.95 1688.37 Q2382.31 1688.37 2384.91 1690.55 Q2387.5 1692.73 2387.5 1696.38 Q2387.5 1698.11 2386.85 1699.67 Q2386.21 1701.22 2384.49 1703.32 Q2384.02 1703.87 2381.5 1706.48 Q2378.98 1709.08 2374.39 1713.76 Z" fill="#000000" fill-rule="evenodd" fill-opacity="1" /><polyline clip-path="url(#clip420)" style="stroke:#000000; stroke-linecap:butt; stroke-linejoin:round; stroke-width:4; stroke-opacity:1; fill:none" points="
  158.369,1666.31 158.369,47.2441 
  "/>
<polyline clip-path="url(#clip420)" style="stroke:#000000; stroke-linecap:butt; stroke-linejoin:round; stroke-width:4; stroke-opacity:1; fill:none" points="
  2352.76,1666.31 2352.76,47.2441 
  "/>
<polyline clip-path="url(#clip420)" style="stroke:#000000; stroke-linecap:butt; stroke-linejoin:round; stroke-width:4; stroke-opacity:1; fill:none" points="
  158.369,1666.31 177.267,1666.31 
  "/>
<polyline clip-path="url(#clip420)" style="stroke:#000000; stroke-linecap:butt; stroke-linejoin:round; stroke-width:4; stroke-opacity:1; fill:none" points="
  158.369,856.777 177.267,856.777 
  "/>
<polyline clip-path="url(#clip420)" style="stroke:#000000; stroke-linecap:butt; stroke-linejoin:round; stroke-width:4; stroke-opacity:1; fill:none" points="
  158.369,47.2441 177.267,47.2441 
  "/>
<path clip-path="url(#clip420)" d="M51.6634 1686.1 L59.3023 1686.1 L59.3023 1659.74 L50.9921 1661.4 L50.9921 1657.14 L59.256 1655.48 L63.9319 1655.48 L63.9319 1686.1 L71.5707 1686.1 L71.5707 1690.04 L51.6634 1690.04 L51.6634 1686.1 Z" fill="#000000" fill-rule="evenodd" fill-opacity="1" /><path clip-path="url(#clip420)" d="M91.0151 1658.56 Q87.404 1658.56 85.5753 1662.12 Q83.7697 1665.66 83.7697 1672.79 Q83.7697 1679.9 85.5753 1683.46 Q87.404 1687 91.0151 1687 Q94.6493 1687 96.4548 1683.46 Q98.2835 1679.9 98.2835 1672.79 Q98.2835 1665.66 96.4548 1662.12 Q94.6493 1658.56 91.0151 1658.56 M91.0151 1654.85 Q96.8252 1654.85 99.8808 1659.46 Q102.959 1664.04 102.959 1672.79 Q102.959 1681.52 99.8808 1686.12 Q96.8252 1690.71 91.0151 1690.71 Q85.2049 1690.71 82.1262 1686.12 Q79.0707 1681.52 79.0707 1672.79 Q79.0707 1664.04 82.1262 1659.46 Q85.2049 1654.85 91.0151 1654.85 Z" fill="#000000" fill-rule="evenodd" fill-opacity="1" /><path clip-path="url(#clip420)" d="M112.664 1637.05 Q109.73 1637.05 108.244 1639.94 Q106.777 1642.82 106.777 1648.61 Q106.777 1654.39 108.244 1657.29 Q109.73 1660.16 112.664 1660.16 Q115.617 1660.16 117.084 1657.29 Q118.57 1654.39 118.57 1648.61 Q118.57 1642.82 117.084 1639.94 Q115.617 1637.05 112.664 1637.05 M112.664 1634.04 Q117.385 1634.04 119.868 1637.78 Q122.369 1641.51 122.369 1648.61 Q122.369 1655.71 119.868 1659.45 Q117.385 1663.17 112.664 1663.17 Q107.943 1663.17 105.442 1659.45 Q102.959 1655.71 102.959 1648.61 Q102.959 1641.51 105.442 1637.78 Q107.943 1634.04 112.664 1634.04 Z" fill="#000000" fill-rule="evenodd" fill-opacity="1" /><path clip-path="url(#clip420)" d="M54.3529 876.569 L61.9918 876.569 L61.9918 850.204 L53.6816 851.87 L53.6816 847.611 L61.9455 845.944 L66.6214 845.944 L66.6214 876.569 L74.2602 876.569 L74.2602 880.504 L54.3529 880.504 L54.3529 876.569 Z" fill="#000000" fill-rule="evenodd" fill-opacity="1" /><path clip-path="url(#clip420)" d="M93.7046 849.023 Q90.0935 849.023 88.2648 852.588 Q86.4592 856.129 86.4592 863.259 Q86.4592 870.365 88.2648 873.93 Q90.0935 877.472 93.7046 877.472 Q97.3388 877.472 99.1444 873.93 Q100.973 870.365 100.973 863.259 Q100.973 856.129 99.1444 852.588 Q97.3388 849.023 93.7046 849.023 M93.7046 845.319 Q99.5147 845.319 102.57 849.926 Q105.649 854.509 105.649 863.259 Q105.649 871.986 102.57 876.592 Q99.5147 881.176 93.7046 881.176 Q87.8944 881.176 84.8157 876.592 Q81.7602 871.986 81.7602 863.259 Q81.7602 854.509 84.8157 849.926 Q87.8944 845.319 93.7046 845.319 Z" fill="#000000" fill-rule="evenodd" fill-opacity="1" /><path clip-path="url(#clip420)" d="M106.194 849.897 L112.401 849.897 L112.401 828.475 L105.649 829.829 L105.649 826.368 L112.363 825.014 L116.162 825.014 L116.162 849.897 L122.369 849.897 L122.369 853.094 L106.194 853.094 L106.194 849.897 Z" fill="#000000" fill-rule="evenodd" fill-opacity="1" /><path clip-path="url(#clip420)" d="M53.2433 67.0365 L60.8821 67.0365 L60.8821 40.6709 L52.572 42.3376 L52.572 38.0784 L60.8358 36.4117 L65.5117 36.4117 L65.5117 67.0365 L73.1506 67.0365 L73.1506 70.9717 L53.2433 70.9717 L53.2433 67.0365 Z" fill="#000000" fill-rule="evenodd" fill-opacity="1" /><path clip-path="url(#clip420)" d="M92.5949 39.4904 Q88.9838 39.4904 87.1551 43.0552 Q85.3496 46.5968 85.3496 53.7264 Q85.3496 60.8329 87.1551 64.3977 Q88.9838 67.9393 92.5949 67.9393 Q96.2292 67.9393 98.0347 64.3977 Q99.8634 60.8329 99.8634 53.7264 Q99.8634 46.5968 98.0347 43.0552 Q96.2292 39.4904 92.5949 39.4904 M92.5949 35.7867 Q98.4051 35.7867 101.461 40.3932 Q104.539 44.9765 104.539 53.7264 Q104.539 62.4532 101.461 67.0597 Q98.4051 71.643 92.5949 71.643 Q86.7848 71.643 83.7061 67.0597 Q80.6505 62.4532 80.6505 53.7264 Q80.6505 44.9765 83.7061 40.3932 Q86.7848 35.7867 92.5949 35.7867 Z" fill="#000000" fill-rule="evenodd" fill-opacity="1" /><path clip-path="url(#clip420)" d="M109.11 40.364 L122.369 40.364 L122.369 43.5613 L104.539 43.5613 L104.539 40.364 Q106.702 38.1258 110.426 34.3643 Q114.169 30.5839 115.128 29.4931 Q116.952 27.443 117.667 26.0325 Q118.401 24.6031 118.401 23.2301 Q118.401 20.992 116.821 19.5814 Q115.26 18.1708 112.739 18.1708 Q110.953 18.1708 108.959 18.7915 Q106.984 19.4121 104.727 20.6722 L104.727 16.8355 Q107.022 15.9139 109.016 15.4437 Q111.009 14.9735 112.664 14.9735 Q117.028 14.9735 119.623 17.1552 Q122.219 19.3369 122.219 22.9856 Q122.219 24.7159 121.56 26.277 Q120.921 27.8192 119.209 29.9257 Q118.739 30.4711 116.219 33.0854 Q113.699 35.6808 109.11 40.364 Z" fill="#000000" fill-rule="evenodd" fill-opacity="1" /><polyline clip-path="url(#clip422)" style="stroke:#ffff00; stroke-linecap:butt; stroke-linejoin:round; stroke-width:24; stroke-opacity:0.7; fill:none" points="
  1197.26,1359.15 1252.28,1336.54 1245.13,1339.39 1237.33,1342.54 1238.8,1331.84 1231.23,1332.75 1223.46,1333.6 1215.51,1334.4 1207.36,1335.15 1198.98,1335.86 
  1190.39,1336.53 1181.55,1337.16 1172.45,1337.75 1163.09,1338.3 1153.45,1338.82 1143.5,1339.31 1133.23,1339.76 1122.61,1340.18 1111.63,1340.58 1100.26,1340.94 
  1088.46,1341.28 1076.21,1341.6 1063.47,1341.89 1050.19,1342.15 1036.33,1342.4 1021.85,1342.62 1006.67,1342.82 990.723,1343.01 973.937,1343.17 956.214,1343.32 
  937.444,1343.45 917.495,1343.57 896.209,1343.67 873.392,1343.76 848.81,1343.84 822.164,1343.9 793.077,1343.96 761.056,1344 725.441,1344.04 685.323,1344.07 
  639.396,1344.09 585.689,1344.1 535.23,1344.11 494.275,1344.12 461.972,1344.12 437.135,1344.12 418.444,1344.12 404.983,1344.12 395.428,1344.12 388.718,1344.13 
  384.041,1344.13 380.8,1344.13 378.561,1344.13 376.307,1344.13 372.985,1344.13 368.069,1344.13 360.748,1344.13 349.74,1344.13 332.943,1344.13 
  306.689,1344.13 263.959,1344.13 188.947,1344.13 158.369,1344.13 
  "/>
<polyline clip-path="url(#clip422)" style="stroke:#ffff00; stroke-linecap:butt; stroke-linejoin:round; stroke-width:24; stroke-opacity:0.7; fill:none" points="
  1197.26,1359.15 1188.76,1362.71 1180.04,1366.37 1171.06,1370.13 1161.85,1373.97 1152.37,1377.91 1142.6,1381.95 1132.54,1386.07 1122.15,1390.29 1111.43,1394.6 
  1100.34,1398.99 1088.85,1403.47 1076.95,1408.03 1064.6,1412.66 1051.75,1417.37 1038.38,1422.13 1024.13,1427.05 1009.53,1431.9 994.235,1436.79 977.93,1441.75 
  960.998,1446.62 943.107,1451.45 924.018,1456.24 903.81,1460.9 882.181,1465.41 858.475,1469.8 833.271,1473.87 805.817,1477.64 775.651,1481.07 742.19,1484.09 
  704.187,1486.72 661.399,1488.85 611.804,1490.52 559.106,1491.66 516.186,1492.26 481.191,1492.6 453.305,1492.8 431.58,1492.92 415.375,1493 403.47,1493.05 
  394.831,1493.09 388.617,1493.11 384.04,1493.12 380.799,1493.14 378.561,1493.14 376.307,1493.15 372.986,1493.16 368.071,1493.17 360.751,1493.19 
  350.033,1493.22 334.128,1493.26 310.018,1493.3 272.212,1493.36 209.214,1493.41 158.369,1493.44 
  "/>
<polyline clip-path="url(#clip422)" style="stroke:#ff0000; stroke-linecap:butt; stroke-linejoin:round; stroke-width:24; stroke-opacity:0.7; fill:none" points="
  2352.76,416.17 2352.6,416.342 2352.38,416.588 2352.16,416.834 2351.93,417.081 2351.71,417.328 2351.49,417.574 2351.26,417.821 2351.04,418.069 2350.82,418.316 
  2350.59,418.564 2350.37,418.811 2350.14,419.059 2349.92,419.307 2349.7,419.556 2349.47,419.804 2349.25,420.053 2349.02,420.302 2348.8,420.55 2348.57,420.8 
  2348.35,421.049 2348.12,421.298 2347.89,421.548 2347.67,421.798 2347.44,422.048 2347.22,422.298 2346.99,422.549 2346.76,422.799 2346.54,423.05 2346.31,423.301 
  2346.08,423.552 2345.86,423.803 2345.63,424.055 2345.4,424.306 2345.17,424.558 2344.94,424.81 2344.72,425.062 2344.49,425.315 2344.26,425.567 2344.03,425.82 
  2343.8,426.073 2343.57,426.326 2343.35,426.579 2343.12,426.833 2342.89,427.086 2342.66,427.34 2342.43,427.594 2342.2,427.848 2341.97,428.103 2341.74,428.357 
  2341.51,428.612 2341.28,428.867 2341.05,429.122 2340.82,429.377 2340.58,429.633 2340.35,429.888 2340.12,430.144 2339.89,430.4 2339.66,430.657 2339.43,430.913 
  2339.2,431.17 2338.96,431.426 2338.73,431.683 2338.5,431.941 2338.27,432.198 2338.03,432.455 2337.8,432.713 2337.57,432.971 2337.33,433.229 2337.1,433.487 
  2336.87,433.746 2336.63,434.005 2336.4,434.263 2336.16,434.522 2335.93,434.782 2335.7,435.041 2335.46,435.301 2335.23,435.561 2334.99,435.821 2334.76,436.081 
  2334.52,436.341 2334.28,436.602 2334.05,436.863 2333.81,437.124 2333.58,437.385 2333.34,437.646 2333.1,437.908 2332.87,438.169 2332.63,438.431 2332.39,438.693 
  2332.16,438.956 2331.92,439.218 2331.68,439.481 2331.44,439.744 2331.21,440.007 2330.97,440.27 2330.73,440.534 2330.49,440.798 2330.25,441.061 2330.01,441.326 
  2329.77,441.59 2329.54,441.854 2329.3,442.119 2329.06,442.384 2328.82,442.649 2328.58,442.914 2328.34,443.18 2328.1,443.446 2327.86,443.711 2327.62,443.978 
  2327.37,444.244 2327.13,444.51 2326.89,444.777 2326.65,445.044 2326.41,445.311 2326.17,445.578 2325.93,445.846 2325.68,446.114 2325.44,446.382 2325.2,446.65 
  2324.96,446.918 2324.71,447.187 2324.47,447.455 2324.23,447.724 2323.98,447.993 2323.74,448.263 2323.5,448.532 2323.25,448.802 2323.01,449.072 2322.77,449.342 
  2322.52,449.613 2322.28,449.883 2322.03,450.154 2321.79,450.425 2321.54,450.696 2321.3,450.968 2321.05,451.239 2320.8,451.511 2320.56,451.783 2320.31,452.056 
  2320.07,452.328 2319.82,452.601 2319.57,452.874 2319.33,453.147 2319.08,453.42 2318.83,453.694 2318.58,453.967 2318.34,454.241 2318.09,454.516 2317.84,454.79 
  2317.59,455.065 2317.34,455.339 2317.09,455.614 2316.85,455.89 2316.6,456.165 2316.35,456.441 2316.1,456.717 2315.85,456.993 2315.6,457.269 2315.35,457.546 
  2315.1,457.823 2314.85,458.099 2314.6,458.377 2314.35,458.654 2314.09,458.932 2313.84,459.21 2313.59,459.488 2313.34,459.766 2313.09,460.045 2312.84,460.323 
  2312.58,460.602 2312.33,460.881 2312.08,461.161 2311.83,461.44 2311.57,461.72 2311.32,462 2311.07,462.281 2310.81,462.561 2310.56,462.842 2310.3,463.123 
  2310.05,463.404 2309.8,463.685 2309.54,463.967 2309.29,464.249 2309.03,464.531 2308.78,464.813 2308.52,465.096 2308.26,465.379 2308.01,465.662 2307.75,465.945 
  2307.5,466.228 2307.24,466.512 2306.98,466.796 2306.73,467.08 2306.47,467.365 2306.21,467.649 2305.95,467.934 2305.7,468.219 2305.44,468.504 2305.18,468.79 
  2304.92,469.076 2304.66,469.362 2304.4,469.648 2304.15,469.934 2303.89,470.221 2303.63,470.508 2303.37,470.795 2303.11,471.082 2302.85,471.37 2302.59,471.658 
  2302.33,471.946 2302.07,472.234 2301.8,472.523 2301.54,472.812 2301.28,473.101 2301.02,473.39 2300.76,473.679 2300.5,473.969 2300.23,474.259 2299.97,474.549 
  2299.71,474.84 2299.45,475.131 2299.18,475.422 2298.92,475.713 2298.66,476.004 2298.39,476.296 2298.13,476.588 2297.86,476.88 2297.6,477.172 2297.34,477.465 
  2297.07,477.758 2296.81,478.051 2296.54,478.344 2296.27,478.638 2296.01,478.932 2295.74,479.226 2295.48,479.52 2295.21,479.815 2294.94,480.11 2294.68,480.405 
  2294.41,480.7 2294.14,480.996 2293.87,481.292 2293.61,481.588 2293.34,481.884 2293.07,482.181 2292.8,482.477 2292.53,482.775 2292.26,483.072 2292,483.369 
  2291.73,483.667 2291.46,483.965 2291.19,484.264 2290.92,484.562 2290.65,484.861 2290.38,485.16 2290.11,485.46 2289.83,485.759 2289.56,486.059 2289.29,486.359 
  2289.02,486.66 2288.75,486.96 2288.48,487.261 2288.2,487.562 2287.93,487.864 2287.66,488.165 2287.39,488.467 2287.11,488.769 2286.84,489.072 2286.56,489.375 
  2286.29,489.678 2286.02,489.981 2285.74,490.284 2285.47,490.588 2285.19,490.892 2284.92,491.196 2284.64,491.501 2284.37,491.806 2284.09,492.111 2283.81,492.416 
  2283.54,492.722 2283.26,493.027 2282.98,493.334 2282.71,493.64 2282.43,493.947 2282.15,494.254 2281.87,494.561 2281.6,494.868 2281.32,495.176 2281.04,495.484 
  2280.76,495.792 2280.48,496.101 2280.2,496.41 2279.92,496.719 2279.64,497.028 2279.36,497.338 2279.08,497.647 2278.8,497.958 2278.52,498.268 2278.24,498.579 
  2277.96,498.89 2277.68,499.201 2277.4,499.513 2277.11,499.824 2276.83,500.136 2276.55,500.449 2276.27,500.761 2275.98,501.074 2275.7,501.388 2275.42,501.701 
  2275.13,502.015 2274.85,502.329 2274.56,502.643 2274.28,502.958 2273.99,503.273 2273.71,503.588 2273.42,503.903 2273.14,504.219 2272.85,504.535 2272.57,504.851 
  2272.28,505.168 2271.99,505.485 2271.71,505.802 2271.42,506.119 2271.13,506.437 2270.84,506.755 2270.56,507.073 2270.27,507.392 2269.98,507.711 2269.69,508.03 
  2269.4,508.349 2269.11,508.669 2268.82,508.989 2268.53,509.309 2268.24,509.63 2267.95,509.951 2267.66,510.272 2267.37,510.594 2267.08,510.915 2266.79,511.237 
  2266.5,511.56 2266.21,511.882 2265.91,512.205 2265.62,512.529 2265.33,512.852 2265.04,513.176 2264.74,513.5 2264.45,513.825 2264.16,514.149 2263.86,514.474 
  2263.57,514.8 2263.27,515.125 2262.98,515.451 2262.68,515.778 2262.39,516.104 2262.09,516.431 2261.8,516.758 2261.5,517.086 2261.2,517.413 2260.91,517.742 
  2260.61,518.07 2260.31,518.399 2260.01,518.728 2259.72,519.057 2259.42,519.386 2259.12,519.716 2258.82,520.047 2258.52,520.377 2258.22,520.708 2257.92,521.039 
  2257.62,521.371 2257.32,521.702 2257.02,522.034 2256.72,522.367 2256.42,522.7 2256.12,523.033 2255.82,523.366 2255.52,523.7 2255.21,524.034 2254.91,524.368 
  2254.61,524.703 2254.31,525.037 2254,525.373 2253.7,525.708 2253.4,526.044 2253.09,526.38 2252.79,526.717 2252.48,527.054 2252.18,527.391 2251.87,527.728 
  2251.57,528.066 2251.26,528.404 2250.95,528.743 2250.65,529.082 2250.34,529.421 2250.03,529.76 2249.73,530.1 2249.42,530.44 2249.11,530.781 2248.8,531.121 
  2248.49,531.462 2248.18,531.804 2247.87,532.146 2247.57,532.488 2247.26,532.83 2246.95,533.173 2246.64,533.516 2246.32,533.859 2246.01,534.203 2245.7,534.547 
  2245.39,534.892 2245.08,535.236 2244.77,535.581 2244.45,535.927 2244.14,536.273 2243.83,536.619 2243.51,536.965 2243.2,537.312 2242.89,537.659 2242.57,538.007 
  2242.26,538.354 2241.94,538.703 2241.63,539.051 2241.31,539.4 2240.99,539.749 2240.68,540.099 2240.36,540.448 2240.05,540.799 2239.73,541.149 2239.41,541.5 
  2239.09,541.852 2238.77,542.203 2238.46,542.555 2238.14,542.907 2237.82,543.26 2237.5,543.613 2237.18,543.967 2236.86,544.32 2236.54,544.674 2236.22,545.029 
  2235.9,545.384 2235.57,545.739 2235.25,546.094 2234.93,546.45 2234.61,546.807 2234.29,547.163 2233.96,547.52 2233.64,547.878 2233.32,548.235 2232.99,548.593 
  2232.67,548.952 2232.34,549.311 2232.02,549.67 2231.69,550.029 2231.37,550.389 2231.04,550.749 2230.71,551.11 2230.39,551.471 2230.06,551.832 2229.73,552.194 
  2229.41,552.556 2229.08,552.919 2228.75,553.281 2228.42,553.645 2228.09,554.008 2227.76,554.372 2227.43,554.737 2227.1,555.101 2226.77,555.466 2226.44,555.832 
  2226.11,556.198 2225.78,556.564 2225.45,556.931 2225.11,557.298 2224.78,557.665 2224.45,558.033 2224.12,558.401 2223.78,558.77 2223.45,559.138 2223.11,559.508 
  2222.78,559.877 2222.44,560.248 2222.11,560.618 2221.77,560.989 2221.44,561.36 2221.1,561.732 2220.76,562.104 2220.43,562.476 2220.09,562.849 2219.75,563.222 
  2219.41,563.596 2219.07,563.97 2218.74,564.344 2218.4,564.719 2218.06,565.094 2217.72,565.47 2217.38,565.846 2217.04,566.222 2216.69,566.599 2216.35,566.976 
  2216.01,567.354 2215.67,567.732 2215.33,568.11 2214.98,568.489 2214.64,568.868 2214.3,569.248 2213.95,569.628 2213.61,570.009 2213.26,570.389 2212.92,570.771 
  2212.57,571.152 2212.23,571.535 2211.88,571.917 2211.53,572.3 2211.19,572.683 2210.84,573.067 2210.49,573.451 2210.14,573.836 2209.8,574.221 2209.45,574.606 
  2209.1,574.992 2208.75,575.379 2208.4,575.765 2208.05,576.152 2207.7,576.54 2207.34,576.928 2206.99,577.316 2206.64,577.705 2206.29,578.095 2205.94,578.484 
  2205.58,578.874 2205.23,579.265 2204.87,579.656 2204.52,580.047 2204.17,580.439 2203.81,580.832 2203.45,581.224 2203.1,581.617 2202.74,582.011 2202.39,582.405 
  2202.03,582.8 2201.67,583.195 2201.31,583.59 2200.95,583.986 2200.6,584.382 2200.24,584.779 2199.88,585.176 2199.52,585.573 2199.16,585.972 2198.8,586.37 
  2198.43,586.769 2198.07,587.168 2197.71,587.568 2197.35,587.969 2196.99,588.369 2196.62,588.771 2196.26,589.172 2195.89,589.574 2195.53,589.977 2195.16,590.38 
  2194.8,590.783 2194.43,591.187 2194.07,591.592 2193.7,591.997 2193.33,592.402 2192.97,592.808 2192.6,593.214 2192.23,593.621 2191.86,594.028 2191.49,594.436 
  2191.12,594.844 2190.75,595.253 2190.38,595.662 2190.01,596.072 2189.64,596.482 2189.27,596.892 2188.89,597.303 2188.52,597.715 2188.15,598.127 2187.77,598.539 
  2187.4,598.952 2187.03,599.365 2186.65,599.779 2186.28,600.194 2185.9,600.609 2185.52,601.024 2185.15,601.44 2184.77,601.856 2184.39,602.273 2184.01,602.69 
  2183.64,603.108 2183.26,603.527 2182.88,603.945 2182.5,604.365 2182.12,604.785 2181.74,605.205 2181.36,605.626 2180.97,606.047 2180.59,606.469 2180.21,606.891 
  2179.83,607.314 2179.44,607.737 2179.06,608.161 2178.67,608.586 2178.29,609.01 2177.9,609.436 2177.52,609.862 2177.13,610.288 2176.75,610.715 2176.36,611.142 
  2175.97,611.57 2175.58,611.999 2175.19,612.428 2174.8,612.857 2174.42,613.287 2174.03,613.718 2173.63,614.149 2173.24,614.581 2172.85,615.013 2172.46,615.445 
  2172.07,615.879 2171.67,616.312 2171.28,616.747 2170.89,617.181 2170.49,617.617 2170.1,618.053 2169.7,618.489 2169.31,618.926 2168.91,619.363 2168.51,619.802 
  2168.12,620.24 2167.72,620.679 2167.32,621.119 2166.92,621.559 2166.52,622 2166.12,622.441 2165.72,622.883 2165.32,623.325 2164.92,623.768 2164.52,624.212 
  2164.11,624.656 2163.71,625.101 2163.31,625.546 2162.9,625.992 2162.5,626.438 2162.09,626.885 2161.69,627.332 2161.28,627.78 2160.88,628.229 2160.47,628.678 
  2160.06,629.128 2159.65,629.578 2159.24,630.029 2158.83,630.48 2158.43,630.932 2158.02,631.385 2157.6,631.838 2157.19,632.292 2156.78,632.746 2156.37,633.201 
  2155.96,633.657 2155.54,634.113 2155.13,634.57 2154.71,635.027 2154.3,635.485 2153.88,635.943 2153.47,636.402 2153.05,636.862 2152.63,637.322 2152.22,637.783 
  2151.8,638.244 2151.38,638.707 2150.96,639.169 2150.54,639.632 2150.12,640.096 2149.7,640.561 2149.28,641.026 2148.85,641.492 2148.43,641.958 2148.01,642.425 
  2147.58,642.892 2147.16,643.361 2146.73,643.829 2146.31,644.299 2145.88,644.769 2145.45,645.24 2145.03,645.711 2144.6,646.183 2144.17,646.655 2143.74,647.128 
  2143.31,647.602 2142.88,648.077 2142.45,648.552 2142.02,649.028 2141.59,649.504 2141.15,649.981 2140.72,650.459 2140.29,650.937 2139.85,651.416 2139.42,651.895 
  2138.98,652.376 2138.55,652.856 2138.11,653.338 2137.67,653.82 2137.23,654.303 2136.8,654.787 2136.36,655.271 2135.92,655.756 2135.48,656.241 2135.04,656.727 
  2134.59,657.214 2134.15,657.702 2133.71,658.19 2133.27,658.679 2132.82,659.168 2132.38,659.658 2131.93,660.149 2131.49,660.641 2131.04,661.133 2130.59,661.626 
  2130.14,662.12 2129.7,662.614 2129.25,663.109 2128.8,663.605 2128.35,664.101 2127.9,664.598 2127.44,665.096 2126.99,665.594 2126.54,666.093 2126.08,666.593 
  2125.63,667.094 2125.18,667.595 2124.72,668.097 2124.26,668.6 2123.81,669.103 2123.35,669.608 2122.89,670.112 2122.43,670.618 2121.97,671.124 2121.51,671.631 
  2121.05,672.139 2120.59,672.648 2120.13,673.157 2119.67,673.667 2119.2,674.177 2118.74,674.689 2118.27,675.201 2117.81,675.714 2117.34,676.228 2116.87,676.742 
  2116.41,677.257 2115.94,677.773 2115.47,678.29 2115,678.807 2114.53,679.325 2114.06,679.844 2113.59,680.364 2113.11,680.884 2112.64,681.405 2112.17,681.927 
  2111.69,682.45 2111.22,682.973 2110.74,683.498 2110.26,684.023 2109.79,684.548 2109.31,685.075 2108.83,685.602 2108.35,686.131 2107.87,686.66 2107.39,687.189 
  2106.91,687.72 2106.42,688.251 2105.94,688.783 2105.46,689.316 2104.97,689.85 2104.49,690.384 2104,690.92 2103.51,691.456 2103.03,691.993 2102.54,692.531 
  2102.05,693.069 2101.56,693.609 2101.07,694.149 2100.58,694.69 2100.08,695.232 2099.59,695.774 2099.1,696.318 2098.6,696.862 2098.11,697.407 2097.61,697.953 
  2097.11,698.5 2096.62,699.048 2096.12,699.597 2095.62,700.146 2095.12,700.696 2094.62,701.247 2094.12,701.799 2093.61,702.352 2093.11,702.906 2092.61,703.46 
  2092.1,704.016 2091.6,704.572 2091.09,705.129 2090.58,705.687 2090.07,706.246 2089.57,706.806 2089.06,707.366 2088.55,707.928 2088.03,708.49 2087.52,709.054 
  2087.01,709.618 2086.5,710.183 2085.98,710.749 2085.47,711.316 2084.95,711.884 2084.43,712.452 2083.91,713.022 2083.39,713.593 2082.88,714.164 2082.35,714.736 
  2081.83,715.31 2081.31,715.884 2080.79,716.459 2080.26,717.035 2079.74,717.612 2079.21,718.19 2078.69,718.769 2078.16,719.349 2077.63,719.93 2077.1,720.511 
  2076.57,721.094 2076.04,721.678 2075.51,722.262 2074.98,722.848 2074.44,723.434 2073.91,724.022 2073.37,724.61 2072.84,725.2 2072.3,725.79 2071.76,726.381 
  2071.22,726.974 2070.68,727.567 2070.14,728.161 2069.6,728.757 2069.06,729.353 2068.51,729.95 2067.97,730.549 2067.42,731.148 2066.88,731.748 2066.33,732.35 
  2065.78,732.952 2065.23,733.555 2064.68,734.16 2064.13,734.765 2063.58,735.372 2063.02,735.979 2062.47,736.588 2061.92,737.197 2061.36,737.808 2060.8,738.42 
  2060.24,739.032 2059.69,739.646 2059.13,740.261 2058.56,740.877 2058,741.494 2057.44,742.112 2056.88,742.731 2056.31,743.351 2055.74,743.972 2055.18,744.594 
  2054.61,745.218 2054.04,745.842 2053.47,746.468 2052.9,747.095 2052.33,747.722 2051.75,748.351 2051.18,748.981 2050.61,749.612 2050.03,750.245 2049.45,750.878 
  2048.87,751.512 2048.29,752.148 2047.71,752.785 2047.13,753.422 2046.55,754.061 2045.97,754.702 2045.38,755.343 2044.8,755.985 2044.21,756.629 2043.62,757.274 
  2043.03,757.919 2042.44,758.567 2041.85,759.215 2041.26,759.864 2040.66,760.515 2040.07,761.167 2039.47,761.82 2038.88,762.474 2038.28,763.129 2037.68,763.786 
  2037.08,764.443 2036.48,765.102 2035.88,765.763 2035.27,766.424 2034.67,767.087 2034.06,767.75 2033.46,768.416 2032.85,769.082 2032.24,769.749 2031.63,770.418 
  2031.02,771.088 2030.4,771.76 2029.79,772.432 2029.17,773.106 2028.56,773.781 2027.94,774.457 2027.32,775.135 2026.7,775.814 2026.08,776.494 2025.46,777.176 
  2024.83,777.858 2024.21,778.543 2023.58,779.228 2022.95,779.915 2022.32,780.603 2021.69,781.292 2021.06,781.983 2020.43,782.675 2019.8,783.368 2019.16,784.063 
  2018.53,784.759 2017.89,785.456 2017.25,786.155 2016.61,786.855 2015.97,787.556 2015.33,788.259 2014.68,788.963 2014.04,789.669 2013.39,790.376 2012.74,791.084 
  2012.09,791.794 2011.44,792.505 2010.79,793.217 2010.14,793.931 2009.48,794.647 2008.83,795.363 2008.17,796.082 2007.51,796.801 2006.85,797.522 2006.19,798.245 
  2005.53,798.969 2004.86,799.694 2004.2,800.421 2003.53,801.15 2002.86,801.879 2002.19,802.611 2001.52,803.344 2000.85,804.078 2000.17,804.814 1999.5,805.551 
  1998.82,806.29 1998.14,807.03 1997.46,807.772 1996.78,808.515 1996.1,809.26 1995.41,810.006 1994.73,810.754 1994.04,811.504 1993.35,812.255 1992.66,813.007 
  1991.97,813.762 1991.28,814.517 1990.58,815.275 1989.89,816.034 1989.19,816.794 1988.49,817.556 1987.79,818.32 1987.09,819.085 1986.38,819.852 1985.68,820.621 
  1984.97,821.391 1984.26,822.163 1983.55,822.936 1982.84,823.711 1982.12,824.488 1981.41,825.267 1980.69,826.047 1979.97,826.829 1979.25,827.612 1978.53,828.397 
  1977.81,829.184 1977.08,829.973 1976.36,830.763 1975.63,831.555 1974.9,832.349 1974.17,833.144 1973.44,833.942 1972.7,834.741 1971.96,835.541 1971.23,836.344 
  1970.49,837.148 1969.74,837.954 1969,838.762 1968.25,839.571 1967.51,840.383 1966.76,841.196 1966.01,842.011 1965.26,842.828 1964.5,843.647 1963.75,844.467 
  1962.99,845.29 1962.23,846.114 1961.47,846.94 1960.7,847.768 1959.94,848.598 1959.17,849.429 1958.4,850.263 1957.63,851.098 1956.86,851.936 1956.09,852.775 
  1955.31,853.617 1954.53,854.46 1953.75,855.305 1952.97,856.152 1952.19,857.001 1951.4,857.852 1950.61,858.705 1949.82,859.56 1949.03,860.417 1948.24,861.276 
  1947.44,862.137 1946.64,863 1945.84,863.865 1945.04,864.732 1944.24,865.601 1943.43,866.472 1942.62,867.346 1941.81,868.221 1941,869.098 1940.19,869.978 
  1939.37,870.859 1938.55,871.743 1937.73,872.629 1936.91,873.517 1936.09,874.407 1935.26,875.299 1934.43,876.193 1933.6,877.09 1932.76,877.989 1931.93,878.889 
  1931.09,879.793 1930.25,880.698 1929.41,881.605 1928.57,882.515 1927.72,883.427 1926.87,884.341 1926.02,885.258 1925.16,886.177 1924.31,887.098 1923.45,888.021 
  1922.59,888.946 1921.73,889.874 1920.86,890.805 1919.99,891.737 1919.12,892.672 1918.25,893.609 1917.38,894.549 1916.5,895.491 1915.62,896.435 1914.74,897.382 
  1913.85,898.331 1912.97,899.282 1912.08,900.236 1911.19,901.193 1910.29,902.152 1909.4,903.113 1908.5,904.077 1907.59,905.043 1906.69,906.012 1905.78,906.983 
  1904.87,907.957 1903.96,908.933 1903.04,909.912 1902.13,910.893 1901.21,911.877 1900.28,912.863 1899.36,913.852 1898.43,914.844 1897.5,915.838 1896.56,916.835 
  1895.63,917.835 1894.69,918.837 1893.75,919.842 1892.8,920.849 1891.85,921.86 1890.9,922.872 1889.95,923.888 1888.99,924.906 1888.03,925.927 1887.07,926.951 
  1886.11,927.978 1885.14,929.007 1884.17,930.039 1883.19,931.074 1882.22,932.111 1881.23,933.152 1880.25,934.195 1879.27,935.241 1878.28,936.29 1877.28,937.342 
  1876.29,938.397 1875.29,939.455 1874.29,940.515 1873.28,941.579 1872.28,942.645 1871.26,943.715 1870.25,944.787 1869.23,945.863 1868.21,946.941 1867.19,948.022 
  1866.16,949.107 1865.13,950.194 1864.09,951.285 1863.06,952.378 1862.01,953.475 1860.97,954.575 1859.92,955.677 1858.87,956.783 1857.81,957.892 1856.76,959.005 
  1855.69,960.12 1854.63,961.239 1853.56,962.36 1852.49,963.485 1851.41,964.614 1850.33,965.745 1849.25,966.88 1848.16,968.018 1847.07,969.159 1845.97,970.304 
  1844.87,971.451 1843.77,972.603 1842.66,973.757 1841.55,974.915 1840.44,976.076 1839.32,977.241 1838.2,978.409 1837.07,979.581 1835.94,980.755 1834.81,981.934 
  1833.67,983.116 1832.52,984.301 1831.38,985.49 1830.23,986.682 1829.07,987.878 1827.91,989.077 1826.75,990.28 1825.58,991.486 1824.41,992.696 1823.23,993.91 
  1822.05,995.127 1820.87,996.348 1819.68,997.573 1818.48,998.801 1817.28,1000.03 1816.08,1001.27 1814.87,1002.51 1813.66,1003.75 1812.44,1005 1811.22,1006.25 
  1810,1007.5 1808.76,1008.76 1807.53,1010.02 1806.29,1011.29 1805.04,1012.56 1803.79,1013.83 1802.53,1015.11 1801.27,1016.39 1800.01,1017.67 1798.74,1018.96 
  1797.46,1020.26 1796.18,1021.55 1794.89,1022.85 1793.6,1024.16 1792.31,1025.47 1791,1026.78 1789.7,1028.09 1788.38,1029.42 1787.06,1030.74 1785.74,1032.07 
  1784.41,1033.4 1783.08,1034.74 1781.74,1036.08 1780.39,1037.42 1779.04,1038.77 1777.68,1040.13 1776.31,1041.48 1774.94,1042.84 1773.57,1044.21 1772.19,1045.58 
  1770.8,1046.95 1769.41,1048.33 1768.01,1049.71 1766.6,1051.1 1765.19,1052.49 1763.77,1053.88 1762.34,1055.28 1760.91,1056.69 1759.47,1058.09 1758.03,1059.51 
  1756.58,1060.92 1755.12,1062.34 1753.65,1063.77 1752.18,1065.2 1750.7,1066.63 1749.22,1068.07 1747.73,1069.51 1746.23,1070.96 1744.72,1072.41 1743.2,1073.86 
  1741.68,1075.32 1740.16,1076.78 1738.62,1078.25 1737.08,1079.72 1735.52,1081.2 1733.97,1082.68 1732.4,1084.17 1730.83,1085.65 1729.24,1087.15 1727.65,1088.65 
  1726.06,1090.15 1724.45,1091.66 1722.83,1093.17 1721.21,1094.68 1719.58,1096.2 1717.94,1097.73 1716.29,1099.25 1714.64,1100.79 1712.97,1102.32 1711.3,1103.86 
  1709.61,1105.41 1707.92,1106.96 1706.22,1108.51 1704.51,1110.07 1702.79,1111.63 1701.06,1113.2 1699.32,1114.77 1697.57,1116.34 1695.82,1117.92 1694.05,1119.51 
  1692.27,1121.09 1690.48,1122.68 1688.68,1124.28 1686.88,1125.88 1685.06,1127.48 1683.23,1129.09 1681.39,1130.7 1679.54,1132.31 1677.68,1133.93 1675.8,1135.55 
  1673.92,1137.18 1672.02,1138.81 1670.12,1140.44 1668.2,1142.08 1666.27,1143.72 1664.33,1145.36 1662.37,1147.01 1660.41,1148.66 1658.43,1150.32 1656.44,1151.97 
  1654.43,1153.63 1652.42,1155.3 1650.39,1156.97 1648.35,1158.64 1646.29,1160.31 1644.22,1161.99 1642.14,1163.67 1640.04,1165.35 1637.93,1167.03 1635.81,1168.72 
  1633.67,1170.41 1631.52,1172.1 1629.35,1173.79 1627.16,1175.49 1625.36,1176.88 1624.1,1177.86 1623.2,1178.55 1622.57,1179.03 1622.14,1179.36 1621.84,1179.59 
  1621.64,1179.74 1621.5,1179.85 1621.4,1179.92 1621.34,1179.97 1621.29,1180.01 1621.25,1180.04 1621.18,1180.09 1621.09,1180.16 1620.95,1180.27 
  1620.75,1180.42 1620.45,1180.65 1620.01,1180.98 1619.38,1181.47 1618.44,1182.17 1617.11,1183.18 1615.2,1184.61 1612.92,1186.32 1610.62,1188.03 1608.3,1189.75 
  1605.97,1191.46 1603.62,1193.17 1601.25,1194.89 1598.86,1196.6 1596.45,1198.32 1594.03,1200.04 1591.59,1201.76 1589.12,1203.48 1586.64,1205.2 1584.14,1206.91 
  1581.62,1208.63 1579.08,1210.35 1576.52,1212.07 1573.93,1213.79 1571.33,1215.51 1568.7,1217.22 1566.05,1218.94 1563.38,1220.65 1560.69,1222.36 1557.97,1224.07 
  1555.23,1225.78 1552.47,1227.49 1549.68,1229.2 1546.87,1230.9 1544.03,1232.6 1541.16,1234.3 1538.27,1235.99 1535.36,1237.69 1532.41,1239.37 1529.44,1241.06 
  1526.44,1242.74 1523.41,1244.42 1520.35,1246.09 1517.26,1247.76 1514.14,1249.43 1510.99,1251.09 1507.81,1252.74 1504.59,1254.39 1501.35,1256.04 1498.07,1257.67 
  1494.75,1259.31 1491.4,1260.93 1488.01,1262.56 1484.59,1264.17 1481.13,1265.78 1477.63,1267.38 1474.09,1268.97 1470.51,1270.56 1466.89,1272.14 1463.23,1273.71 
  1459.53,1275.27 1455.78,1276.82 1451.98,1278.37 1448.14,1279.91 1444.26,1281.43 1440.32,1282.95 1436.34,1284.46 1432.3,1285.96 1428.22,1287.45 1424.08,1288.93 
  1419.88,1290.4 1415.63,1291.87 1411.32,1293.32 1406.95,1294.75 1402.52,1296.18 1398.03,1297.6 1393.47,1299.01 1388.84,1300.4 1384.15,1301.79 1379.39,1303.16 
  1374.55,1304.52 1369.64,1305.87 1364.65,1307.2 1359.59,1308.53 1354.44,1309.84 1349.2,1311.14 1343.88,1312.43 1338.47,1313.7 1332.96,1314.97 1327.36,1316.22 
  1321.65,1317.45 1315.85,1318.68 1309.93,1319.89 1303.9,1321.09 1297.76,1322.28 1291.5,1323.45 1285.12,1324.61 1278.61,1325.76 1271.98,1326.89 1265.23,1328.01 
  1258.53,1329.08 
  "/>
<polyline clip-path="url(#clip422)" style="stroke:#ff0000; stroke-linecap:butt; stroke-linejoin:round; stroke-width:24; stroke-opacity:0.7; fill:none" points="
  2352.76,-40.7269 2352.69,-40.6485 2352.49,-40.4282 2352.29,-40.2078 2352.09,-39.9872 2351.89,-39.7665 2351.69,-39.5456 2351.49,-39.3247 2351.29,-39.1035 2351.09,-38.8823 
  2350.89,-38.6609 2350.69,-38.4393 2350.49,-38.2176 2350.29,-37.9958 2350.09,-37.7739 2349.89,-37.5518 2349.69,-37.3295 2349.49,-37.1071 2349.28,-36.8846 2349.08,-36.662 
  2348.88,-36.4392 2348.68,-36.2162 2348.48,-35.9931 2348.28,-35.7699 2348.08,-35.5465 2347.87,-35.323 2347.67,-35.0994 2347.47,-34.8756 2347.27,-34.6516 2347.06,-34.4275 
  2346.86,-34.2033 2346.66,-33.9789 2346.46,-33.7544 2346.25,-33.5298 2346.05,-33.305 2345.85,-33.08 2345.64,-32.855 2345.44,-32.6297 2345.24,-32.4044 2345.03,-32.1788 
  2344.83,-31.9532 2344.62,-31.7274 2344.42,-31.5014 2344.22,-31.2753 2344.01,-31.0491 2343.81,-30.8227 2343.6,-30.5961 2343.4,-30.3694 2343.19,-30.1426 2342.99,-29.9156 
  2342.78,-29.6885 2342.58,-29.4613 2342.37,-29.2338 2342.17,-29.0063 2341.96,-28.7786 2341.75,-28.5507 2341.55,-28.3227 2341.34,-28.0945 2341.14,-27.8662 2340.93,-27.6378 
  2340.72,-27.4092 2340.52,-27.1804 2340.31,-26.9516 2340.1,-26.7225 2339.89,-26.4933 2339.69,-26.264 2339.48,-26.0345 2339.27,-25.8048 2339.07,-25.575 2338.86,-25.3451 
  2338.65,-25.115 2338.44,-24.8848 2338.23,-24.6544 2338.03,-24.4238 2337.82,-24.1931 2337.61,-23.9623 2337.4,-23.7313 2337.19,-23.5001 2336.98,-23.2688 2336.77,-23.0373 
  2336.56,-22.8057 2336.35,-22.574 2336.14,-22.342 2335.93,-22.11 2335.72,-21.8778 2335.51,-21.6454 2335.3,-21.4129 2335.09,-21.1802 2334.88,-20.9473 2334.67,-20.7143 
  2334.46,-20.4812 2334.25,-20.2479 2334.04,-20.0144 2333.83,-19.7808 2333.62,-19.5471 2333.41,-19.3131 2333.2,-19.0791 2332.98,-18.8448 2332.77,-18.6104 2332.56,-18.3759 
  2332.35,-18.1412 2332.14,-17.9063 2331.92,-17.6713 2331.71,-17.4361 2331.5,-17.2008 2331.29,-16.9653 2331.07,-16.7297 2330.86,-16.4939 2330.65,-16.2579 2330.43,-16.0218 
  2330.22,-15.7855 2330.01,-15.5491 2329.79,-15.3125 2329.58,-15.0757 2329.36,-14.8388 2329.15,-14.6017 2328.94,-14.3645 2328.72,-14.1271 2328.51,-13.8895 2328.29,-13.6518 
  2328.08,-13.4139 2327.86,-13.1759 2327.65,-12.9377 2327.43,-12.6993 2327.22,-12.4608 2327,-12.2221 2326.78,-11.9833 2326.57,-11.7442 2326.35,-11.5051 2326.14,-11.2657 
  2325.92,-11.0262 2325.7,-10.7866 2325.49,-10.5467 2325.27,-10.3068 2325.05,-10.0666 2324.84,-9.82628 2324.62,-9.5858 2324.4,-9.34515 2324.18,-9.10434 2323.97,-8.86336 
  2323.75,-8.62222 2323.53,-8.38091 2323.31,-8.13944 2323.09,-7.8978 2322.87,-7.656 2322.66,-7.41402 2322.44,-7.17188 2322.22,-6.92958 2322,-6.68711 2321.78,-6.44447 
  2321.56,-6.20166 2321.34,-5.95868 2321.12,-5.71554 2320.9,-5.47223 2320.68,-5.22875 2320.46,-4.9851 2320.24,-4.74128 2320.02,-4.49729 2319.8,-4.25314 2319.58,-4.00881 
  2319.36,-3.76432 2319.14,-3.51965 2318.92,-3.27481 2318.69,-3.02981 2318.47,-2.78463 2318.25,-2.53928 2318.03,-2.29376 2317.81,-2.04807 2317.58,-1.8022 2317.36,-1.55617 
  2317.14,-1.30996 2316.92,-1.06358 2316.69,-0.817023 2316.47,-0.570296 2316.25,-0.323396 2316.03,-0.0763228 2315.8,0.170924 2315.58,0.418346 2315.35,0.665941 2315.13,0.913711 
  2314.91,1.16166 2314.68,1.40978 2314.46,1.65807 2314.23,1.90654 2314.01,2.15519 2313.78,2.40401 2313.56,2.65301 2313.33,2.90218 2313.11,3.15153 2312.88,3.40106 
  2312.66,3.65077 2312.43,3.90065 2312.21,4.15071 2311.98,4.40095 2311.75,4.65137 2311.53,4.90196 2311.3,5.15274 2311.07,5.40369 2310.85,5.65482 2310.62,5.90614 
  2310.39,6.15763 2310.17,6.4093 2309.94,6.66115 2309.71,6.91318 2309.48,7.1654 2309.25,7.41779 2309.03,7.67037 2308.8,7.92313 2308.57,8.17607 2308.34,8.42919 
  2308.11,8.68249 2307.88,8.93598 2307.65,9.18965 2307.42,9.4435 2307.19,9.69753 2306.96,9.95175 2306.73,10.2062 2306.5,10.4607 2306.27,10.7155 2306.04,10.9705 
  2305.81,11.2256 2305.58,11.4809 2305.35,11.7365 2305.12,11.9922 2304.89,12.248 2304.66,12.5041 2304.43,12.7604 2304.2,13.0168 2303.96,13.2734 2303.73,13.5303 
  2303.5,13.7873 2303.27,14.0445 2303.03,14.3019 2302.8,14.5594 2302.57,14.8172 2302.34,15.0751 2302.1,15.3333 2301.87,15.5916 2301.64,15.8501 2301.4,16.1088 
  2301.17,16.3677 2300.93,16.6268 2300.7,16.8861 2300.46,17.1456 2300.23,17.4052 2300,17.6651 2299.76,17.9251 2299.52,18.1854 2299.29,18.4458 2299.05,18.7065 
  2298.82,18.9673 2298.58,19.2283 2298.35,19.4895 2298.11,19.7509 2297.87,20.0125 2297.64,20.2743 2297.4,20.5363 2297.16,20.7985 2296.93,21.0608 2296.69,21.3234 
  2296.45,21.5862 2296.21,21.8491 2295.98,22.1123 2295.74,22.3757 2295.5,22.6392 2295.26,22.903 2295.02,23.1669 2294.79,23.4311 2294.55,23.6954 2294.31,23.96 
  2294.07,24.2247 2293.83,24.4897 2293.59,24.7548 2293.35,25.0202 2293.11,25.2857 2292.87,25.5515 2292.63,25.8174 2292.39,26.0836 2292.15,26.3499 2291.91,26.6165 
  2291.67,26.8832 2291.42,27.1502 2291.18,27.4174 2290.94,27.6847 2290.7,27.9523 2290.46,28.2201 2290.22,28.488 2289.97,28.7562 2289.73,29.0246 2289.49,29.2932 
  2289.25,29.562 2289,29.831 2288.76,30.1002 2288.52,30.3696 2288.27,30.6393 2288.03,30.9091 2287.78,31.1791 2287.54,31.4494 2287.3,31.7198 2287.05,31.9905 
  2286.81,32.2613 2286.56,32.5324 2286.32,32.8037 2286.07,33.0752 2285.83,33.3469 2285.58,33.6188 2285.33,33.8909 2285.09,34.1633 2284.84,34.4358 2284.6,34.7086 
  2284.35,34.9816 2284.1,35.2547 2283.85,35.5281 2283.61,35.8017 2283.36,36.0756 2283.11,36.3496 2282.86,36.6238 2282.62,36.8983 2282.37,37.173 2282.12,37.4479 
  2281.87,37.723 2281.62,37.9983 2281.37,38.2738 2281.12,38.5496 2280.88,38.8256 2280.63,39.1018 2280.38,39.3782 2280.13,39.6548 2279.88,39.9316 2279.63,40.2087 
  2279.37,40.486 2279.12,40.7635 2278.87,41.0412 2278.62,41.3191 2278.37,41.5973 2278.12,41.8756 2277.87,42.1542 2277.62,42.433 2277.36,42.7121 2277.11,42.9913 
  2276.86,43.2708 2276.61,43.5505 2276.35,43.8304 2276.1,44.1106 2275.85,44.391 2275.59,44.6716 2275.34,44.9524 2275.09,45.2334 2274.83,45.5147 2274.58,45.7962 
  2274.32,46.0779 2274.07,46.3599 2273.81,46.642 2273.56,46.9244 2273.3,47.2071 2273.05,47.4899 2272.79,47.773 2272.53,48.0563 2272.28,48.3398 2272.02,48.6236 
  2271.77,48.9076 2271.51,49.1918 2271.25,49.4763 2270.99,49.761 2270.74,50.0459 2270.48,50.331 2270.22,50.6164 2269.96,50.902 2269.71,51.1879 2269.45,51.4739 
  2269.19,51.7602 2268.93,52.0468 2268.67,52.3336 2268.41,52.6206 2268.15,52.9078 2267.89,53.1953 2267.63,53.483 2267.37,53.771 2267.11,54.0591 2266.85,54.3476 
  2266.59,54.6362 2266.33,54.9251 2266.07,55.2143 2265.81,55.5036 2265.54,55.7932 2265.28,56.0831 2265.02,56.3732 2264.76,56.6635 2264.49,56.9541 2264.23,57.2449 
  2263.97,57.5359 2263.71,57.8272 2263.44,58.1188 2263.18,58.4105 2262.92,58.7025 2262.65,58.9948 2262.39,59.2873 2262.12,59.58 2261.86,59.873 2261.59,60.1663 
  2261.33,60.4597 2261.06,60.7535 2260.8,61.0474 2260.53,61.3417 2260.26,61.6361 2260,61.9308 2259.73,62.2258 2259.46,62.521 2259.2,62.8164 2258.93,63.1121 
  2258.66,63.4081 2258.4,63.7043 2258.13,64.0007 2257.86,64.2974 2257.59,64.5944 2257.32,64.8916 2257.05,65.189 2256.79,65.4867 2256.52,65.7847 2256.25,66.0829 
  2255.98,66.3814 2255.71,66.6801 2255.44,66.979 2255.17,67.2783 2254.9,67.5777 2254.62,67.8775 2254.35,68.1775 2254.08,68.4777 2253.81,68.7782 2253.54,69.079 
  2253.27,69.38 2253,69.6813 2252.72,69.9828 2252.45,70.2846 2252.18,70.5866 2251.9,70.8889 2251.63,71.1915 2251.36,71.4944 2251.08,71.7974 2250.81,72.1008 
  2250.53,72.4044 2250.26,72.7083 2249.99,73.0124 2249.71,73.3168 2249.43,73.6215 2249.16,73.9264 2248.88,74.2316 2248.61,74.5371 2248.33,74.8428 2248.05,75.1488 
  2247.78,75.4551 2247.5,75.7616 2247.22,76.0684 2246.95,76.3755 2246.67,76.6828 2246.39,76.9904 2246.11,77.2983 2245.83,77.6064 2245.56,77.9148 2245.28,78.2235 
  2245,78.5325 2244.72,78.8417 2244.44,79.1512 2244.16,79.4609 2243.88,79.771 2243.6,80.0813 2243.32,80.3919 2243.04,80.7028 2242.76,81.0139 2242.47,81.3253 
  2242.19,81.637 2241.91,81.949 2241.63,82.2612 2241.35,82.5737 2241.06,82.8865 2240.78,83.1996 2240.5,83.513 2240.21,83.8266 2239.93,84.1405 2239.65,84.4547 
  2239.36,84.7692 2239.08,85.084 2238.79,85.399 2238.51,85.7143 2238.22,86.0299 2237.94,86.3458 2237.65,86.662 2237.37,86.9785 2237.08,87.2952 2236.79,87.6123 
  2236.51,87.9296 2236.22,88.2472 2235.93,88.5651 2235.64,88.8832 2235.36,89.2017 2235.07,89.5205 2234.78,89.8395 2234.49,90.1589 2234.2,90.4785 2233.91,90.7984 
  2233.63,91.1186 2233.34,91.4391 2233.05,91.7599 2232.76,92.081 2232.47,92.4024 2232.17,92.724 2231.88,93.046 2231.59,93.3683 2231.3,93.6908 2231.01,94.0137 
  2230.72,94.3368 2230.43,94.6603 2230.13,94.984 2229.84,95.3081 2229.55,95.6324 2229.25,95.957 2228.96,96.282 2228.67,96.6072 2228.37,96.9328 2228.08,97.2586 
  2227.78,97.5848 2227.49,97.9112 2227.19,98.238 2226.9,98.565 2226.6,98.8924 2226.3,99.2201 2226.01,99.548 2225.71,99.8763 2225.42,100.205 2225.12,100.534 
  2224.82,100.863 2224.52,101.193 2224.22,101.522 2223.93,101.852 2223.63,102.183 2223.33,102.514 2223.03,102.845 2222.73,103.176 2222.43,103.508 2222.13,103.84 
  2221.83,104.172 2221.53,104.505 2221.23,104.838 2220.93,105.171 2220.63,105.505 2220.32,105.838 2220.02,106.173 2219.72,106.507 2219.42,106.842 2219.12,107.177 
  2218.81,107.513 2218.51,107.848 2218.2,108.185 2217.9,108.521 2217.6,108.858 2217.29,109.195 2216.99,109.532 2216.68,109.87 2216.38,110.208 2216.07,110.546 
  2215.76,110.885 2215.46,111.224 2215.15,111.564 2214.84,111.903 2214.54,112.243 2214.23,112.584 2213.92,112.924 2213.61,113.265 2213.31,113.607 2213,113.948 
  2212.69,114.29 2212.38,114.633 2212.07,114.975 2211.76,115.318 2211.45,115.662 2211.14,116.006 2210.83,116.35 2210.52,116.694 2210.2,117.039 2209.89,117.384 
  2209.58,117.729 2209.27,118.075 2208.96,118.421 2208.64,118.767 2208.33,119.114 2208.02,119.461 2207.7,119.808 2207.39,120.156 2207.07,120.504 2206.76,120.853 
  2206.44,121.202 2206.13,121.551 2205.81,121.9 2205.5,122.25 2205.18,122.6 2204.86,122.951 2204.55,123.302 2204.23,123.653 2203.91,124.004 2203.59,124.356 
  2203.27,124.709 2202.96,125.061 2202.64,125.414 2202.32,125.768 2202,126.121 2201.68,126.475 2201.36,126.83 2201.04,127.185 2200.72,127.54 2200.39,127.895 
  2200.07,128.251 2199.75,128.607 2199.43,128.964 2199.11,129.321 2198.78,129.678 2198.46,130.036 2198.14,130.394 2197.81,130.752 2197.49,131.111 2197.16,131.47 
  2196.84,131.83 2196.51,132.19 2196.19,132.55 2195.86,132.91 2195.54,133.271 2195.21,133.633 2194.88,133.994 2194.56,134.357 2194.23,134.719 2193.9,135.082 
  2193.57,135.445 2193.24,135.809 2192.92,136.173 2192.59,136.537 2192.26,136.902 2191.93,137.267 2191.6,137.632 2191.27,137.998 2190.94,138.364 2190.6,138.731 
  2190.27,139.098 2189.94,139.465 2189.61,139.833 2189.28,140.201 2188.94,140.57 2188.61,140.939 2188.28,141.308 2187.94,141.678 2187.61,142.048 2187.27,142.418 
  2186.94,142.789 2186.6,143.16 2186.27,143.532 2185.93,143.904 2185.59,144.277 2185.26,144.649 2184.92,145.023 2184.58,145.396 2184.24,145.77 2183.91,146.145 
  2183.57,146.52 2183.23,146.895 2182.89,147.271 2182.55,147.647 2182.21,148.023 2181.87,148.4 2181.53,148.777 2181.19,149.155 2180.84,149.533 2180.5,149.911 
  2180.16,150.29 2179.82,150.669 2179.47,151.049 2179.13,151.429 2178.79,151.81 2178.44,152.191 2178.1,152.572 2177.75,152.954 2177.41,153.336 2177.06,153.718 
  2176.72,154.101 2176.37,154.485 2176.02,154.869 2175.68,155.253 2175.33,155.638 2174.98,156.023 2174.63,156.408 2174.28,156.794 2173.93,157.18 2173.58,157.567 
  2173.23,157.954 2172.88,158.342 2172.53,158.73 2172.18,159.119 2171.83,159.508 2171.48,159.897 2171.13,160.287 2170.77,160.677 2170.42,161.068 2170.07,161.459 
  2169.71,161.85 2169.36,162.242 2169.01,162.635 2168.65,163.027 2168.3,163.421 2167.94,163.814 2167.58,164.209 2167.23,164.603 2166.87,164.998 2166.51,165.394 
  2166.15,165.79 2165.8,166.186 2165.44,166.583 2165.08,166.98 2164.72,167.378 2164.36,167.776 2164,168.175 2163.64,168.574 2163.28,168.973 2162.92,169.373 
  2162.56,169.774 2162.19,170.175 2161.83,170.576 2161.47,170.978 2161.1,171.38 2160.74,171.783 2160.38,172.186 2160.01,172.59 2159.65,172.994 2159.28,173.398 
  2158.91,173.803 2158.55,174.209 2158.18,174.615 2157.81,175.021 2157.45,175.428 2157.08,175.836 2156.71,176.244 2156.34,176.652 2155.97,177.061 2155.6,177.47 
  2155.23,177.88 2154.86,178.29 2154.49,178.701 2154.12,179.112 2153.75,179.524 2153.37,179.936 2153,180.349 2152.63,180.762 2152.25,181.175 2151.88,181.59 
  2151.5,182.004 2151.13,182.419 2150.75,182.835 2150.38,183.251 2150,183.668 2149.62,184.085 2149.25,184.502 2148.87,184.92 2148.49,185.339 2148.11,185.758 
  2147.73,186.177 2147.35,186.598 2146.97,187.018 2146.59,187.439 2146.21,187.861 2145.83,188.283 2145.45,188.705 2145.07,189.128 2144.68,189.552 2144.3,189.976 
  2143.92,190.401 2143.53,190.826 2143.15,191.252 2142.76,191.678 2142.38,192.104 2141.99,192.532 2141.61,192.959 2141.22,193.388 2140.83,193.816 2140.44,194.246 
  2140.05,194.676 2139.67,195.106 2139.28,195.537 2138.89,195.968 2138.5,196.4 2138.11,196.833 2137.71,197.266 2137.32,197.699 2136.93,198.133 2136.54,198.568 
  2136.14,199.003 2135.75,199.439 2135.36,199.875 2134.96,200.312 2134.57,200.749 2134.17,201.187 2133.78,201.625 2133.38,202.064 2132.98,202.503 2132.58,202.944 
  2132.19,203.384 2131.79,203.825 2131.39,204.267 2130.99,204.709 2130.59,205.152 2130.19,205.595 2129.79,206.039 2129.38,206.484 2128.98,206.929 2128.58,207.374 
  2128.18,207.821 2127.77,208.267 2127.37,208.715 2126.96,209.163 2126.56,209.611 2126.15,210.06 2125.75,210.51 2125.34,210.96 2124.93,211.411 2124.53,211.862 
  2124.12,212.314 2123.71,212.766 2123.3,213.219 2122.89,213.673 2122.48,214.127 2122.07,214.582 2121.66,215.038 2121.24,215.494 2120.83,215.95 2120.42,216.408 
  2120,216.865 2119.59,217.324 2119.18,217.783 2118.76,218.242 2118.34,218.703 2117.93,219.163 2117.51,219.625 2117.09,220.087 2116.68,220.549 2116.26,221.013 
  2115.84,221.476 2115.42,221.941 2115,222.406 2114.58,222.872 2114.16,223.338 2113.73,223.805 2113.31,224.272 2112.89,224.741 2112.47,225.209 2112.04,225.679 
  2111.62,226.149 2111.19,226.619 2110.77,227.091 2110.34,227.563 2109.91,228.035 2109.48,228.509 2109.06,228.982 2108.63,229.457 2108.2,229.932 2107.77,230.408 
  2107.34,230.884 2106.91,231.361 2106.47,231.839 2106.04,232.317 2105.61,232.796 2105.18,233.276 2104.74,233.756 2104.31,234.237 2103.87,234.719 2103.44,235.201 
  2103,235.684 2102.56,236.168 2102.13,236.652 2101.69,237.137 2101.25,237.623 2100.81,238.109 2100.37,238.596 2099.93,239.084 2099.49,239.572 2099.05,240.061 
  2098.6,240.551 2098.16,241.041 2097.72,241.532 2097.27,242.024 2096.83,242.516 2096.38,243.009 2095.94,243.503 2095.49,243.998 2095.04,244.493 2094.59,244.989 
  2094.14,245.485 2093.69,245.983 2093.24,246.481 2092.79,246.979 2092.34,247.479 2091.89,247.979 2091.44,248.48 2090.99,248.981 2090.53,249.483 2090.08,249.986 
  2089.62,250.49 2089.17,250.995 2088.71,251.5 2088.25,252.006 2087.79,252.512 2087.34,253.02 2086.88,253.528 2086.42,254.037 2085.96,254.546 2085.5,255.056 
  2085.03,255.567 2084.57,256.079 2084.11,256.592 2083.64,257.105 2083.18,257.619 2082.72,258.134 2082.25,258.649 2081.78,259.166 2081.32,259.683 2080.85,260.2 
  2080.38,260.719 2079.91,261.238 2079.44,261.759 2078.97,262.279 2078.5,262.801 2078.03,263.323 2077.55,263.847 2077.08,264.371 2076.61,264.895 2076.13,265.421 
  2075.66,265.947 2075.18,266.474 2074.7,267.002 2074.22,267.531 2073.75,268.061 2073.27,268.591 2072.79,269.122 2072.31,269.654 2071.82,270.187 2071.34,270.72 
  2070.86,271.254 2070.38,271.79 2069.89,272.326 2069.41,272.862 2068.92,273.4 2068.43,273.938 2067.95,274.478 2067.46,275.018 2066.97,275.559 2066.48,276.1 
  2065.99,276.643 2065.5,277.186 2065.01,277.731 2064.52,278.276 2064.02,278.822 2063.53,279.369 2063.03,279.916 2062.54,280.465 2062.04,281.014 2061.54,281.564 
  2061.05,282.115 2060.55,282.667 2060.05,283.22 2059.55,283.774 2059.05,284.328 2058.54,284.884 2058.04,285.44 2057.54,285.997 2057.03,286.555 2056.53,287.114 
  2056.02,287.674 2055.52,288.235 2055.01,288.797 2054.5,289.359 2053.99,289.923 2053.48,290.487 2052.97,291.052 2052.46,291.618 2051.95,292.186 2051.43,292.754 
  2050.92,293.322 2050.4,293.892 2049.89,294.463 2049.37,295.035 2048.86,295.607 2048.34,296.181 2047.82,296.755 2047.3,297.331 2046.78,297.907 2046.26,298.485 
  2045.73,299.063 2045.21,299.642 2044.69,300.222 2044.16,300.803 2043.63,301.386 2043.11,301.969 2042.58,302.553 2042.05,303.138 2041.52,303.724 2040.99,304.311 
  2040.46,304.899 2039.93,305.488 2039.39,306.077 2038.86,306.668 2038.33,307.26 2037.79,307.853 2037.25,308.447 2036.72,309.042 2036.18,309.638 2035.64,310.235 
  2035.1,310.833 2034.56,311.432 2034.01,312.032 2033.47,312.633 2032.93,313.235 2032.38,313.838 2031.84,314.442 2031.29,315.047 2030.74,315.653 2030.19,316.261 
  2029.64,316.869 2029.09,317.478 2028.54,318.089 2027.99,318.7 2027.44,319.313 2026.88,319.926 2026.33,320.541 2025.77,321.157 2025.21,321.774 2024.65,322.391 
  2024.09,323.01 2023.53,323.631 2022.97,324.252 2022.41,324.874 2021.85,325.497 2021.28,326.122 2020.72,326.748 2020.15,327.374 2019.58,328.002 2019.02,328.631 
  2018.45,329.261 2017.88,329.892 2017.3,330.525 2016.73,331.158 2016.16,331.793 2015.58,332.429 2015.01,333.066 2014.43,333.704 2013.85,334.343 2013.28,334.983 
  2012.7,335.625 2012.11,336.268 2011.53,336.912 2010.95,337.557 2010.37,338.203 2009.78,338.851 2009.19,339.499 2008.61,340.149 2008.02,340.8 2007.43,341.453 
  2006.84,342.106 2006.25,342.761 2005.66,343.417 2005.06,344.074 2004.47,344.733 2003.87,345.392 2003.27,346.053 2002.67,346.715 2002.08,347.379 2001.47,348.043 
  2000.87,348.709 2000.27,349.376 1999.67,350.045 1999.06,350.714 1998.45,351.385 1997.85,352.058 1997.24,352.731 1996.63,353.406 1996.02,354.082 1995.41,354.76 
  1994.79,355.438 1994.18,356.119 1993.56,356.8 1992.95,357.483 1992.33,358.167 1991.71,358.852 1991.09,359.539 1990.47,360.227 1989.84,360.916 1989.22,361.607 
  1988.59,362.299 1987.97,362.993 1987.34,363.687 1986.71,364.384 1986.08,365.081 1985.45,365.78 1984.81,366.481 1984.18,367.182 1983.55,367.886 1982.91,368.59 
  1982.27,369.296 1981.63,370.004 1980.99,370.712 1980.35,371.423 1979.71,372.134 1979.06,372.848 1978.42,373.562 1977.77,374.278 1977.12,374.996 1976.47,375.715 
  1975.82,376.435 1975.17,377.157 1974.51,377.881 1973.86,378.606 1973.2,379.332 1972.54,380.06 1971.89,380.79 1971.22,381.521 1970.56,382.253 1969.9,382.987 
  1969.24,383.723 1968.57,384.46 1967.9,385.198 1967.23,385.938 1966.56,386.68 1965.89,387.424 1965.22,388.168 1964.54,388.915 1963.87,389.663 1963.19,390.413 
  1962.51,391.164 1961.83,391.917 1961.15,392.671 1960.47,393.427 1959.78,394.185 1959.09,394.945 1958.41,395.706 1957.72,396.468 1957.03,397.233 1956.34,397.999 
  1955.64,398.766 1954.95,399.536 1954.25,400.307 1953.55,401.079 1952.85,401.854 1952.15,402.63 1951.45,403.408 1950.74,404.187 1950.04,404.969 1949.33,405.752 
  1948.62,406.537 1947.91,407.323 1947.2,408.112 1946.48,408.902 1945.77,409.693 1945.05,410.487 1944.33,411.283 1943.61,412.08 1942.89,412.879 1942.17,413.68 
  1941.44,414.483 1940.71,415.287 1939.98,416.094 1939.25,416.902 1938.52,417.712 1937.79,418.524 1937.05,419.338 1936.32,420.154 1935.58,420.971 1934.84,421.791 
  1934.09,422.612 1933.35,423.436 1932.6,424.261 1931.86,425.088 1931.11,425.917 1930.36,426.749 1929.6,427.582 1928.85,428.417 1928.09,429.254 1927.33,430.093 
  1926.57,430.934 1925.81,431.777 1925.05,432.623 1924.28,433.47 1923.52,434.319 1922.75,435.17 1921.97,436.024 1921.2,436.879 1920.43,437.737 1919.65,438.596 
  1918.87,439.458 1918.09,440.322 1917.31,441.188 1916.52,442.056 1915.74,442.926 1914.95,443.799 1914.16,444.673 1913.37,445.55 1912.57,446.429 1911.78,447.31 
  1910.98,448.194 1910.18,449.079 1909.38,449.967 1908.57,450.857 1907.76,451.75 1906.96,452.644 1906.15,453.541 1905.33,454.441 1904.52,455.342 1903.7,456.246 
  1902.88,457.152 1902.06,458.061 1901.24,458.971 1900.41,459.885 1899.59,460.8 1898.76,461.718 1897.92,462.639 1897.09,463.561 1896.25,464.487 1895.42,465.414 
  1894.58,466.344 1893.73,467.277 1892.89,468.212 1892.04,469.15 1891.19,470.09 1890.34,471.032 1889.49,471.977 1888.63,472.925 1887.77,473.875 1886.91,474.828 
  1886.05,475.784 1885.18,476.742 1884.31,477.702 1883.44,478.665 1882.57,479.631 1881.69,480.6 1880.82,481.571 1879.94,482.545 1879.05,483.522 1878.17,484.501 
  1877.28,485.483 1876.39,486.468 1875.5,487.456 1874.6,488.446 1873.71,489.439 1872.81,490.435 1871.9,491.434 1871,492.436 1870.09,493.44 1869.18,494.448 
  1868.27,495.458 1867.35,496.471 1866.43,497.487 1865.51,498.506 1864.59,499.528 1863.66,500.553 1862.73,501.581 1861.8,502.613 1860.87,503.647 1859.93,504.684 
  1858.99,505.724 1858.05,506.767 1857.1,507.814 1856.15,508.863 1855.2,509.916 1854.25,510.971 1853.29,512.03 1852.33,513.093 1851.37,514.158 1850.4,515.227 
  1849.43,516.299 1848.46,517.374 1847.49,518.452 1846.51,519.534 1845.53,520.619 1844.55,521.708 1843.56,522.799 1842.57,523.895 1841.58,524.993 1840.58,526.096 
  1839.58,527.201 1838.58,528.31 1837.57,529.423 1836.57,530.539 1835.55,531.659 1834.54,532.782 1833.52,533.909 1832.5,535.039 1831.47,536.173 1830.45,537.311 
  1829.41,538.453 1828.38,539.598 1827.34,540.747 1826.3,541.899 1825.25,543.056 1824.2,544.216 1823.15,545.38 1822.1,546.548 1821.04,547.72 1819.98,548.896 
  1818.91,550.076 1817.84,551.26 1816.77,552.447 1815.69,553.639 1814.61,554.835 1813.52,556.035 1812.44,557.239 1811.34,558.447 1810.25,559.659 1809.15,560.876 
  1808.05,562.097 1806.94,563.322 1805.83,564.551 1804.71,565.784 1803.59,567.022 1802.47,568.265 1801.34,569.511 1800.21,570.762 1799.08,572.018 1797.94,573.278 
  1796.8,574.543 1795.65,575.812 1794.5,577.086 1793.34,578.364 1792.18,579.647 1791.02,580.935 1789.85,582.227 1788.68,583.525 1787.5,584.827 1786.32,586.134 
  1785.14,587.446 1783.95,588.762 1782.75,590.084 1781.55,591.411 1780.35,592.742 1779.14,594.079 1777.93,595.421 1776.71,596.768 1775.49,598.12 1774.26,599.477 
  1773.03,600.84 1771.79,602.208 1770.55,603.581 1769.31,604.959 1768.06,606.344 1766.8,607.733 1765.54,609.128 1764.27,610.529 1763,611.935 1761.73,613.347 
  1760.44,614.764 1759.16,616.187 1757.87,617.617 1756.57,619.051 1755.27,620.492 1753.96,621.939 1752.65,623.391 1751.33,624.85 1750,626.315 1748.67,627.786 
  1747.34,629.263 1746,630.746 1744.65,632.236 1743.3,633.731 1741.94,635.234 1740.58,636.742 1739.21,638.258 1737.83,639.779 1736.45,641.308 1735.06,642.843 
  1733.67,644.385 1732.27,645.933 1730.86,647.489 1729.45,649.051 1728.03,650.62 1726.61,652.196 1725.18,653.78 1723.74,655.37 1722.3,656.968 1720.84,658.573 
  1719.39,660.186 1717.92,661.806 1716.45,663.433 1714.97,665.068 1713.49,666.71 1712,668.361 1710.5,670.019 1708.99,671.684 1707.48,673.358 1705.96,675.04 
  1704.43,676.73 1702.89,678.428 1701.35,680.134 1699.8,681.849 1698.24,683.572 1696.68,685.303 1695.11,687.043 1693.52,688.792 1691.94,690.549 1690.34,692.315 
  1688.73,694.091 1687.12,695.875 1685.5,697.668 1683.87,699.47 1682.23,701.282 1680.59,703.103 1678.93,704.933 1677.27,706.773 1675.59,708.623 1673.91,710.483 
  1672.22,712.352 1670.52,714.231 1668.81,716.121 1667.1,718.021 1665.37,719.931 1663.63,721.851 1661.89,723.782 1660.13,725.723 1658.36,727.676 1656.59,729.639 
  1654.8,731.613 1653.01,733.599 1651.2,735.595 1649.39,737.603 1647.56,739.623 1645.72,741.654 1643.88,743.697 1642.02,745.752 1640.15,747.819 1638.27,749.898 
  1636.37,751.989 1634.47,754.093 1632.56,756.21 1630.63,758.339 1628.69,760.482 1626.74,762.637 1625.01,764.556 1623.81,765.875 1622.99,766.782 1622.43,767.403 
  1622.05,767.829 1621.78,768.121 1621.6,768.321 1621.48,768.458 1621.39,768.552 1621.33,768.617 1621.29,768.66 1621.25,768.704 1621.2,768.769 
  1621.11,768.863 1620.99,769 1620.81,769.2 1620.54,769.494 1620.15,769.922 1619.58,770.55 1618.75,771.468 1617.54,772.813 1615.75,774.788 1613.72,777.034 
  1611.67,779.293 1609.62,781.567 1607.55,783.856 1605.46,786.16 1603.36,788.479 1601.25,790.813 1599.12,793.163 1596.98,795.529 1594.83,797.911 1592.66,800.309 
  1590.47,802.723 1588.27,805.154 1586.06,807.602 1583.82,810.067 1581.58,812.549 1579.31,815.049 1577.04,817.567 1574.74,820.103 1572.43,822.657 1570.1,825.23 
  1567.75,827.822 1565.39,830.433 1563.01,833.063 1560.61,835.713 1558.19,838.384 1555.75,841.074 1553.3,843.786 1550.82,846.518 1548.33,849.271 1545.81,852.047 
  1543.28,854.844 1540.72,857.664 1538.15,860.506 1535.55,863.371 1532.94,866.26 1530.3,869.173 1527.63,872.11 1524.95,875.071 1522.24,878.058 1519.51,881.07 
  1516.76,884.107 1513.98,887.172 1511.18,890.263 1508.35,893.381 1505.5,896.527 1502.62,899.701 1499.71,902.904 1496.78,906.136 1493.82,909.398 1490.83,912.691 
  1487.82,916.014 1484.77,919.369 1481.7,922.756 1478.6,926.175 1475.46,929.628 1472.29,933.115 1469.1,936.637 1465.86,940.194 1462.6,943.787 1459.3,947.416 
  1455.97,951.084 1452.6,954.789 1449.2,958.534 1445.75,962.318 1442.28,966.143 1438.76,970.01 1435.2,973.92 1431.6,977.872 1427.96,981.87 1424.28,985.912 
  1420.56,990.001 1416.79,994.138 1412.97,998.323 1409.11,1002.56 1405.2,1006.84 1401.24,1011.18 1397.24,1015.57 1393.18,1020.02 1389.06,1024.52 1384.9,1029.08 
  1380.68,1033.7 1376.4,1038.37 1372.06,1043.11 1367.66,1047.92 1363.2,1052.78 1358.68,1057.72 1354.09,1062.72 1349.43,1067.8 1344.7,1072.94 1339.9,1078.16 
  1335.03,1083.46 1330.08,1088.83 1325.05,1094.29 1319.94,1099.83 1314.74,1105.45 1309.46,1111.17 1304.08,1116.97 1298.62,1122.87 1293.05,1128.86 1287.39,1134.95 
  1281.62,1141.15 1275.75,1147.44 1269.76,1153.85 1263.65,1160.37 1257.43,1167.01 1251.07,1173.76 1244.59,1180.64 1237.97,1187.64 1231.2,1194.77 1224.28,1202.04 
  1217.21,1209.45 1209.97,1217 1202.55,1224.69 1194.96,1232.54 1187.17,1240.55 1179.18,1248.71 1170.98,1257.04 1162.55,1265.53 1153.89,1274.2 1144.97,1283.04 
  1135.78,1292.05 1126.3,1301.24 1116.51,1310.6 1106.39,1320.14 1095.92,1329.84 1085.07,1339.71 1073.8,1349.72 1062.09,1359.86 1049.88,1370.1 1037.15,1380.41 
  1023.82,1390.74 1009.85,1401.03 995.159,1411.2 979.68,1421.16 963.321,1430.77 945.989,1439.9 927.584,1448.38 908.011,1456.03 887.215,1462.68 865.317,1468.18 
  844.042,1472.2 800.638,1478.28 
  "/>
</svg>
