<?xml version="1.0" encoding="UTF-8" standalone="no"?>
<svg
   xmlns:dc="http://purl.org/dc/elements/1.1/"
   xmlns:cc="http://creativecommons.org/ns#"
   xmlns:rdf="http://www.w3.org/1999/02/22-rdf-syntax-ns#"
   xmlns:svg="http://www.w3.org/2000/svg"
   xmlns="http://www.w3.org/2000/svg"
   xmlns:sodipodi="http://sodipodi.sourceforge.net/DTD/sodipodi-0.dtd"
   xmlns:inkscape="http://www.inkscape.org/namespaces/inkscape"
   width="1640mm"
   height="1250mm"
   viewBox="0 0 1640 1250"
   version="1.1"
   id="svg8"
   inkscape:version="1.0.2 (1.0.2+r75+1)"
   sodipodi:docname="classification_grid.svg">
  <defs
     id="defs2" />
  <sodipodi:namedview
     id="base"
     pagecolor="#ffffff"
     bordercolor="#666666"
     borderopacity="1.0"
     inkscape:pageopacity="0.0"
     inkscape:pageshadow="2"
     inkscape:zoom="0.175"
     inkscape:cx="3758.6528"
     inkscape:cy="2554.5956"
     inkscape:document-units="mm"
     inkscape:current-layer="layer1"
     showgrid="false"
     inkscape:window-width="3840"
     inkscape:window-height="2132"
     inkscape:window-x="2560"
     inkscape:window-y="0"
     inkscape:window-maximized="1"
     inkscape:document-rotation="0" />
  <metadata
     id="metadata5">
    <rdf:RDF>
      <cc:Work
         rdf:about="">
        <dc:format>image/svg+xml</dc:format>
        <dc:type
           rdf:resource="http://purl.org/dc/dcmitype/StillImage" />
        <dc:title />
      </cc:Work>
    </rdf:RDF>
  </metadata>
  <g
     inkscape:label="Layer 1"
     inkscape:groupmode="layer"
     id="layer1"
     transform="translate(0,953)">
    <rect
       style="fill:none;stroke:#000000;stroke-width:8.33367634;stroke-miterlimit:4;stroke-dasharray:none;stroke-opacity:1"
       id="rect837"
       width="343.64642"
       height="343.64642"
       x="191.82135"
       y="-761.888" />
    <path
       style="fill:none;stroke:#000000;stroke-width:5.95262623;stroke-linecap:butt;stroke-linejoin:miter;stroke-miterlimit:4;stroke-dasharray:35.71575838, 11.90525279;stroke-dashoffset:0;stroke-opacity:0.60784314"
       d="M 199.95488,-648.19175 H 521.76182"
       id="path839"
       inkscape:connector-curvature="0"
       sodipodi:nodetypes="cc" />
    <path
       sodipodi:nodetypes="cc"
       inkscape:connector-curvature="0"
       id="path853"
       d="M 199.95488,-533.64297 H 521.76182"
       style="fill:none;stroke:#000000;stroke-width:5.95262623;stroke-linecap:butt;stroke-linejoin:miter;stroke-miterlimit:4;stroke-dasharray:35.71575838, 11.90525279;stroke-dashoffset:0;stroke-opacity:0.60784314" />
    <g
       id="g880"
       transform="matrix(1.1905253,0,0,1.1905253,133.27417,455.11734)">
      <rect
         style="fill:none;stroke:#000000;stroke-width:7;stroke-miterlimit:4;stroke-dasharray:none;stroke-opacity:1"
         id="rect874"
         width="288.65109"
         height="288.65109"
         x="337.82867"
         y="-1022.2424" />
      <path
         style="fill:none;stroke:#000000;stroke-width:5;stroke-linecap:butt;stroke-linejoin:miter;stroke-miterlimit:4;stroke-dasharray:30.00000084, 10.00000028;stroke-dashoffset:0;stroke-opacity:0.60784314"
         d="M 344.66056,-926.74145 H 614.96724"
         id="path876"
         inkscape:connector-curvature="0"
         sodipodi:nodetypes="cc" />
      <path
         sodipodi:nodetypes="cc"
         inkscape:connector-curvature="0"
         id="path878"
         d="M 344.66056,-830.52443 H 614.96724"
         style="fill:none;stroke:#000000;stroke-width:5;stroke-linecap:butt;stroke-linejoin:miter;stroke-miterlimit:4;stroke-dasharray:30.00000084, 10.00000028;stroke-dashoffset:0;stroke-opacity:0.60784314" />
    </g>
    <g
       transform="matrix(1.1905253,0,0,1.1905253,476.92054,455.11734)"
       id="g888">
      <rect
         y="-1022.2424"
         x="337.82867"
         height="288.65109"
         width="288.65109"
         id="rect882"
         style="fill:none;stroke:#000000;stroke-width:7;stroke-miterlimit:4;stroke-dasharray:none;stroke-opacity:1" />
      <path
         sodipodi:nodetypes="cc"
         inkscape:connector-curvature="0"
         id="path884"
         d="M 344.66056,-926.74145 H 614.96724"
         style="fill:none;stroke:#000000;stroke-width:5;stroke-linecap:butt;stroke-linejoin:miter;stroke-miterlimit:4;stroke-dasharray:30.00000084, 10.00000028;stroke-dashoffset:0;stroke-opacity:0.60784314" />
      <path
         style="fill:none;stroke:#000000;stroke-width:5;stroke-linecap:butt;stroke-linejoin:miter;stroke-miterlimit:4;stroke-dasharray:30.00000084, 10.00000028;stroke-dashoffset:0;stroke-opacity:0.60784314"
         d="M 344.66056,-830.52443 H 614.96724"
         id="path886"
         inkscape:connector-curvature="0"
         sodipodi:nodetypes="cc" />
    </g>
    <g
       id="g896"
       transform="matrix(1.1905253,0,0,1.1905253,-210.37221,798.76371)">
      <rect
         style="fill:none;stroke:#000000;stroke-width:7;stroke-miterlimit:4;stroke-dasharray:none;stroke-opacity:1"
         id="rect890"
         width="288.65109"
         height="288.65109"
         x="337.82867"
         y="-1022.2424" />
      <path
         style="fill:none;stroke:#000000;stroke-width:5;stroke-linecap:butt;stroke-linejoin:miter;stroke-miterlimit:4;stroke-dasharray:30.00000084, 10.00000028;stroke-dashoffset:0;stroke-opacity:0.60784314"
         d="M 344.66056,-926.74145 H 614.96724"
         id="path892"
         inkscape:connector-curvature="0"
         sodipodi:nodetypes="cc" />
      <path
         sodipodi:nodetypes="cc"
         inkscape:connector-curvature="0"
         id="path894"
         d="M 344.66056,-830.52443 H 614.96724"
         style="fill:none;stroke:#000000;stroke-width:5;stroke-linecap:butt;stroke-linejoin:miter;stroke-miterlimit:4;stroke-dasharray:30.00000084, 10.00000028;stroke-dashoffset:0;stroke-opacity:0.60784314" />
    </g>
    <rect
       style="fill:none;stroke:#000000;stroke-width:8.33367634;stroke-miterlimit:4;stroke-dasharray:none;stroke-opacity:1"
       id="rect898"
       width="343.64642"
       height="343.64642"
       x="535.46771"
       y="-418.24164" />
    <g
       id="g912"
       transform="matrix(1.1905253,0,0,1.1905253,476.92054,798.76371)">
      <rect
         style="fill:none;stroke:#000000;stroke-width:7;stroke-miterlimit:4;stroke-dasharray:none;stroke-opacity:1"
         id="rect906"
         width="288.65109"
         height="288.65109"
         x="337.82867"
         y="-1022.2424" />
      <path
         style="fill:none;stroke:#000000;stroke-width:5;stroke-linecap:butt;stroke-linejoin:miter;stroke-miterlimit:4;stroke-dasharray:30.00000084, 10.00000028;stroke-dashoffset:0;stroke-opacity:0.60784314"
         d="M 344.66056,-926.74145 H 614.96724"
         id="path908"
         inkscape:connector-curvature="0"
         sodipodi:nodetypes="cc" />
      <path
         sodipodi:nodetypes="cc"
         inkscape:connector-curvature="0"
         id="path910"
         d="M 344.66056,-830.52443 H 614.96724"
         style="fill:none;stroke:#000000;stroke-width:5;stroke-linecap:butt;stroke-linejoin:miter;stroke-miterlimit:4;stroke-dasharray:30.00000084, 10.00000028;stroke-dashoffset:0;stroke-opacity:0.60784314" />
    </g>
    <rect
       style="fill:none;stroke:#000000;stroke-width:8.33367634;stroke-miterlimit:4;stroke-dasharray:none;stroke-opacity:1"
       id="rect914"
       width="343.64642"
       height="343.64642"
       x="191.82135"
       y="-74.595268" />
    <rect
       y="-74.595268"
       x="535.46771"
       height="343.64642"
       width="343.64642"
       id="rect922"
       style="fill:none;stroke:#000000;stroke-width:8.33367634;stroke-miterlimit:4;stroke-dasharray:none;stroke-opacity:1" />
    <rect
       style="fill:none;stroke:#000000;stroke-width:8.33367634;stroke-miterlimit:4;stroke-dasharray:none;stroke-opacity:1"
       id="rect930"
       width="343.64642"
       height="343.64642"
       x="879.11407"
       y="-74.595268" />
    <path
       style="fill:none;stroke:#000000;stroke-width:8.33367634;stroke-linecap:butt;stroke-linejoin:miter;stroke-miterlimit:4;stroke-dasharray:none;stroke-opacity:1"
       d="M 535.26155,-758.69446 V -836.9928"
       id="path941"
       inkscape:connector-curvature="0"
       sodipodi:nodetypes="cc" />
    <path
       sodipodi:nodetypes="cc"
       inkscape:connector-curvature="0"
       id="path947"
       d="m 191.77423,-758.69446 v -175.5395"
       style="fill:none;stroke:#000000;stroke-width:8.33367634;stroke-linecap:butt;stroke-linejoin:miter;stroke-miterlimit:4;stroke-dasharray:none;stroke-opacity:1" />
    <g
       id="g1013"
       transform="matrix(1.1905253,0,0,1.1905253,-210.37221,455.11734)">
      <path
         sodipodi:nodetypes="cc"
         inkscape:connector-curvature="0"
         id="path900"
         d="M 633.31162,-638.09039 H 903.6183"
         style="fill:none;stroke:#000000;stroke-width:5;stroke-linecap:butt;stroke-linejoin:miter;stroke-miterlimit:4;stroke-dasharray:30.00000084, 10.00000028;stroke-dashoffset:0;stroke-opacity:0.60784314" />
      <path
         style="fill:none;stroke:#000000;stroke-width:5;stroke-linecap:butt;stroke-linejoin:miter;stroke-miterlimit:4;stroke-dasharray:30.00000084, 10.00000028;stroke-dashoffset:0;stroke-opacity:0.60784314"
         d="M 633.31162,-541.87337 H 903.6183"
         id="path902"
         inkscape:connector-curvature="0"
         sodipodi:nodetypes="cc" />
      <flowRoot
         xml:space="preserve"
         id="flowRoot988"
         style="font-style:normal;font-weight:normal;font-size:93.3333px;line-height:1.25;font-family:sans-serif;letter-spacing:0px;word-spacing:0px;fill:#00ff00;fill-opacity:1;stroke:none"
         transform="matrix(0.34278774,0,0,0.34278774,-4.6791997,-684.70347)"><flowRegion
           id="flowRegion980"
           style="font-size:93.3333px;fill:#00ff00;fill-opacity:1"><rect
             id="rect978"
             width="2093.0361"
             height="743.47229"
             x="1212.1831"
             y="164.11572"
             style="font-size:93.33333588px;fill:#00ff00;fill-opacity:1" /></flowRegion><flowPara
           style="font-weight:bold;text-align:center;text-anchor:middle;fill:#00ff00;fill-opacity:1"
           id="flowPara986">Stochastic</flowPara><flowPara
           style="font-weight:bold;text-align:center;text-anchor:middle;fill:#00ff00;fill-opacity:1"
           id="flowPara2014">Switching</flowPara></flowRoot>
    </g>
    <flowRoot
       xml:space="preserve"
       id="flowRoot1029"
       style="font-style:normal;font-weight:normal;font-size:93.3333px;line-height:1.25;font-family:sans-serif;letter-spacing:0px;word-spacing:0px;fill:#c7c700;fill-opacity:1;stroke:none"
       transform="matrix(0.40809746,0,0,0.40809746,-215.94292,-703.6858)"><flowRegion
         id="flowRegion1021"
         style="font-size:93.3333px;fill:#c7c700;fill-opacity:1"><rect
           id="rect1019"
           width="2093.0361"
           height="743.47229"
           x="1212.1831"
           y="164.11572"
           style="font-size:93.33333588px;fill:#c7c700;fill-opacity:1" /></flowRegion><flowPara
         style="font-weight:bold;text-align:center;text-anchor:middle;fill:#c7c700;fill-opacity:1"
         id="flowPara1027">Stochastic</flowPara><flowPara
         style="font-weight:bold;text-align:center;text-anchor:middle;fill:#c7c700;fill-opacity:1"
         id="flowPara2054">Pulsing</flowPara></flowRoot>
    <flowRoot
       transform="matrix(0.40809746,0,0,0.40809746,-559.58929,-703.6858)"
       style="font-style:normal;font-weight:normal;font-size:93.3333px;line-height:1.25;font-family:sans-serif;letter-spacing:0px;word-spacing:0px;fill:#c7c700;fill-opacity:1;stroke:none"
       id="flowRoot1047"
       xml:space="preserve"><flowRegion
         style="font-size:93.3333px;fill:#c7c700;fill-opacity:1"
         id="flowRegion1039"><rect
           style="font-size:93.33333588px;fill:#c7c700;fill-opacity:1"
           y="164.11572"
           x="1212.1831"
           height="743.47229"
           width="2093.0361"
           id="rect1037" /></flowRegion><flowPara
         id="flowPara1045"
         style="font-weight:bold;text-align:center;text-anchor:middle;fill:#c7c700;fill-opacity:1">Stochastic</flowPara><flowPara
         style="font-weight:bold;text-align:center;text-anchor:middle;fill:#c7c700;fill-opacity:1"
         id="flowPara1448">Pulsing</flowPara></flowRoot>
    <flowRoot
       transform="matrix(0.38201009,0,0,0.38201009,-502.27308,-580.9514)"
       style="font-style:normal;font-weight:normal;font-size:93.3333px;line-height:1.25;font-family:sans-serif;letter-spacing:0px;word-spacing:0px;fill:#ffc4c4;fill-opacity:1;stroke:none;"
       id="flowRoot1083"
       xml:space="preserve"><flowRegion
         style="font-size:93.3333px;fill:#ffc4c4;fill-opacity:1;"
         id="flowRegion1075"><rect
           style="font-size:93.33333588px;fill:#ffc4c4;fill-opacity:1;"
           y="164.11572"
           x="1212.1831"
           height="743.47229"
           width="2093.0361"
           id="rect1073" /></flowRegion><flowPara
         id="flowPara1081"
         style="font-weight:bold;text-align:center;text-anchor:middle;fill:#ffc4c4;fill-opacity:1;">Single</flowPara><flowPara
         style="font-weight:bold;text-align:center;text-anchor:middle;fill:#ffc4c4;fill-opacity:1;"
         id="flowPara1455">Response Pulse</flowPara></flowRoot>
    <flowRoot
       xml:space="preserve"
       id="flowRoot1127"
       style="font-style:normal;font-weight:normal;font-size:93.3333px;line-height:1.25;font-family:sans-serif;letter-spacing:0px;word-spacing:0px;fill:#00ff00;fill-opacity:1;stroke:none"
       transform="matrix(0.40809746,0,0,0.40809746,-559.58929,-360.03943)"><flowRegion
         id="flowRegion1119"
         style="font-size:93.3333px;fill:#00ff00;fill-opacity:1"><rect
           id="rect1117"
           width="2093.0361"
           height="743.47229"
           x="1212.1831"
           y="164.11572"
           style="font-size:93.33333588px;fill:#00ff00;fill-opacity:1" /></flowRegion><flowPara
         style="font-weight:bold;text-align:center;text-anchor:middle;fill:#00ff00;fill-opacity:1"
         id="flowPara1125">Stochastic</flowPara><flowPara
         style="font-weight:bold;text-align:center;text-anchor:middle;fill:#00ff00;fill-opacity:1"
         id="flowPara1469">Switching</flowPara></flowRoot>
    <flowRoot
       transform="matrix(0.40809746,0,0,0.40809746,-559.58929,-474.58823)"
       style="font-style:normal;font-weight:normal;font-size:93.3333px;line-height:1.25;font-family:sans-serif;letter-spacing:0px;word-spacing:0px;fill:#a000c8;fill-opacity:1;stroke:none"
       id="flowRoot1145"
       xml:space="preserve"><flowRegion
         style="font-size:93.3333px;fill:#a000c8;fill-opacity:1"
         id="flowRegion1137"><rect
           style="font-size:93.33333588px;fill:#a000c8;fill-opacity:1"
           y="164.11572"
           x="1212.1831"
           height="743.47229"
           width="2093.0361"
           id="rect1135" /></flowRegion><flowPara
         id="flowPara1143"
         style="font-weight:bold;text-align:center;text-anchor:middle;fill:#a000c8;fill-opacity:1">Stochastic</flowPara><flowPara
         style="font-weight:bold;text-align:center;text-anchor:middle;fill:#a000c8;fill-opacity:1"
         id="flowPara1462">Anti-pulsing</flowPara></flowRoot>
    <flowRoot
       xml:space="preserve"
       id="flowRoot1163"
       style="font-style:normal;font-weight:normal;font-size:93.3333px;line-height:1.25;font-family:sans-serif;letter-spacing:0px;word-spacing:0px;fill:#000000;fill-opacity:0.481283;stroke:none"
       transform="matrix(0.35633228,0,0,0.35633228,-441.74043,-232.79134)"><flowRegion
         id="flowRegion1155"
         style="font-size:93.3333px;fill:#000000;fill-opacity:0.481283"><rect
           id="rect1153"
           width="2093.0361"
           height="743.47229"
           x="1212.1831"
           y="164.11572"
           style="font-size:93.33333588px;fill:#000000;fill-opacity:0.48128345" /></flowRegion><flowPara
         style="font-weight:bold;text-align:center;text-anchor:middle;fill:#000000;fill-opacity:1"
         id="flowPara1161">Single</flowPara><flowPara
         style="font-weight:bold;text-align:center;text-anchor:middle;fill:#000000;fill-opacity:1"
         id="flowPara1476">Response Period</flowPara></flowRoot>
    <flowRoot
       transform="matrix(0.40809746,0,0,0.40809746,-559.58929,-16.393053)"
       style="font-style:normal;font-weight:normal;font-size:93.3333px;line-height:1.25;font-family:sans-serif;letter-spacing:0px;word-spacing:0px;fill:#0000ff;fill-opacity:1;stroke:none"
       id="flowRoot1181"
       xml:space="preserve"><flowRegion
         style="font-size:93.3333px;fill:#0000ff;fill-opacity:1"
         id="flowRegion1173"><rect
           style="font-size:93.33333588px;fill:#0000ff;fill-opacity:1"
           y="164.11572"
           x="1212.1831"
           height="743.47229"
           width="2093.0361"
           id="rect1171" /></flowRegion><flowPara
         id="flowPara1179"
         style="font-weight:bold;text-align:center;text-anchor:middle;fill:#0000ff;fill-opacity:1">Homogeneous</flowPara><flowPara
         style="font-weight:bold;text-align:center;text-anchor:middle;fill:#0000ff;fill-opacity:1"
         id="flowPara1799">Activation</flowPara><flowPara
         style="font-weight:bold;text-align:center;text-anchor:middle;fill:#0000ff;fill-opacity:1"
         id="flowPara1801" /></flowRoot>
    <flowRoot
       transform="matrix(0.40809746,0,0,0.40809746,-566.78913,-793.03516)"
       style="font-style:normal;font-weight:normal;font-size:93.3333px;line-height:1.25;font-family:sans-serif;letter-spacing:0px;word-spacing:0px;fill:#ff0000;fill-opacity:1;stroke:none"
       id="flowRoot1439"
       xml:space="preserve"><flowRegion
         style="font-size:93.3333px;fill:#ff0000;fill-opacity:1"
         id="flowRegion1433"><rect
           style="font-size:93.33333588px;fill:#ff0000;fill-opacity:1"
           y="164.11572"
           x="1212.1831"
           height="743.47229"
           width="2093.0361"
           id="rect1431" /></flowRegion><flowPara
         id="flowPara1437"
         style="font-weight:bold;text-align:center;text-anchor:middle;fill:#ff0000;fill-opacity:1">Oscillation</flowPara></flowRoot>
    <flowRoot
       xml:space="preserve"
       id="flowRoot1500"
       style="font-style:normal;font-weight:normal;font-size:93.3333px;line-height:1.25;font-family:sans-serif;letter-spacing:0px;word-spacing:0px;fill:#000000;fill-opacity:0.454546;stroke:none"
       transform="matrix(0.40809746,0,0,0.40809746,120.50361,-220.99239)"><flowRegion
         id="flowRegion1496"
         style="font-size:93.3333px;fill:#000000;fill-opacity:0.454546"><rect
           id="rect1494"
           width="2093.0361"
           height="743.47229"
           x="1212.1831"
           y="164.11572"
           style="font-size:93.33333588px;fill:#000000;fill-opacity:0.4545455" /></flowRegion><flowPara
         style="font-weight:bold;text-align:center;text-anchor:middle;fill:#000000;fill-opacity:0.454546"
         id="flowPara1498">No Activation</flowPara></flowRoot>
    <flowRoot
       xml:space="preserve"
       id="flowRoot1524"
       style="font-style:normal;font-weight:normal;font-size:93.3333px;line-height:1.25;font-family:sans-serif;letter-spacing:0px;word-spacing:0px;fill:#000000;fill-opacity:0.454902;stroke:none"
       transform="matrix(0.40809746,0,0,0.40809746,120.50361,-564.63876)"><flowRegion
         id="flowRegion1520"
         style="font-size:93.3333px;fill:#000000;fill-opacity:0.454902"><rect
           id="rect1518"
           width="2093.0361"
           height="743.47229"
           x="1212.1831"
           y="164.11572"
           style="font-size:93.33333588px;fill:#000000;fill-opacity:0.45490196" /></flowRegion><flowPara
         style="font-weight:bold;text-align:center;text-anchor:middle;fill:#000000;fill-opacity:0.454902"
         id="flowPara1522">No Activation</flowPara></flowRoot>
    <flowRoot
       xml:space="preserve"
       id="flowRoot1536"
       style="font-style:normal;font-weight:normal;font-size:93.3333px;line-height:1.25;font-family:sans-serif;letter-spacing:0px;word-spacing:0px;fill:#000000;fill-opacity:1;stroke:none"
       transform="matrix(0.40809746,0,0,0.40809746,-559.58929,-893.3831)"><flowRegion
         id="flowRegion1532"
         style="font-size:93.3333px"><rect
           id="rect1530"
           width="2093.0361"
           height="743.47229"
           x="1212.1831"
           y="164.11572"
           style="font-size:93.33333588px" /></flowRegion><flowPara
         style="font-style:italic;font-weight:bold;text-align:center;text-anchor:middle"
         id="flowPara1534">Instantaneous</flowPara></flowRoot>
    <flowRoot
       transform="matrix(0.40809746,0,0,0.40809746,-216.10199,-893.3831)"
       style="font-style:normal;font-weight:normal;font-size:93.3333px;line-height:1.25;font-family:sans-serif;letter-spacing:0px;word-spacing:0px;fill:#000000;fill-opacity:1;stroke:none"
       id="flowRoot1556"
       xml:space="preserve"><flowRegion
         style="font-size:93.3333px"
         id="flowRegion1552"><rect
           style="font-size:93.33333588px"
           y="164.11572"
           x="1212.1831"
           height="743.47229"
           width="2093.0361"
           id="rect1550" /></flowRegion><flowPara
         id="flowPara1554"
         style="font-style:italic;font-weight:bold;text-align:center;text-anchor:middle">Heterogeneous</flowPara></flowRoot>
    <flowRoot
       xml:space="preserve"
       id="flowRoot1568"
       style="font-style:normal;font-weight:normal;font-size:93.3333px;line-height:1.25;font-family:sans-serif;letter-spacing:0px;word-spacing:0px;fill:#000000;fill-opacity:1;stroke:none"
       transform="matrix(0.40809746,0,0,0.40809746,127.69054,-893.3831)"><flowRegion
         id="flowRegion1564"
         style="font-size:93.3333px"><rect
           id="rect1562"
           width="2093.0361"
           height="743.47229"
           x="1212.1831"
           y="164.11572"
           style="font-size:93.33333588px" /></flowRegion><flowPara
         style="font-style:italic;font-weight:bold;text-align:center;text-anchor:middle"
         id="flowPara1566">Infinite</flowPara></flowRoot>
    <flowRoot
       xml:space="preserve"
       id="flowRoot1634"
       style="font-style:normal;font-weight:normal;font-size:93.3333px;line-height:1.25;font-family:sans-serif;letter-spacing:0px;word-spacing:0px;fill:#000000;fill-opacity:1;stroke:none"
       transform="matrix(0.40809746,0,0,0.40809746,120.50361,-793.03516)"><flowRegion
         id="flowRegion1630"
         style="font-size:93.3333px"><rect
           id="rect1628"
           width="2093.0361"
           height="743.47229"
           x="1212.1831"
           y="164.11572"
           style="font-size:93.33333588px" /></flowRegion><flowPara
         style="font-weight:bold;text-align:center;text-anchor:middle"
         id="flowPara1632">N/A</flowPara></flowRoot>
    <flowRoot
       transform="matrix(0.40809746,0,0,0.40809746,120.50361,-678.48638)"
       style="font-style:normal;font-weight:normal;font-size:93.3333px;line-height:1.25;font-family:sans-serif;letter-spacing:0px;word-spacing:0px;fill:#000000;fill-opacity:1;stroke:none"
       id="flowRoot1644"
       xml:space="preserve"><flowRegion
         style="font-size:93.3333px"
         id="flowRegion1640"><rect
           style="font-size:93.33333588px"
           y="164.11572"
           x="1212.1831"
           height="743.47229"
           width="2093.0361"
           id="rect1638" /></flowRegion><flowPara
         id="flowPara1642"
         style="font-weight:bold;text-align:center;text-anchor:middle">N/A</flowPara></flowRoot>
    <flowRoot
       xml:space="preserve"
       id="flowRoot1654"
       style="font-style:normal;font-weight:normal;font-size:93.3333px;line-height:1.25;font-family:sans-serif;letter-spacing:0px;word-spacing:0px;fill:#000000;fill-opacity:1;stroke:none"
       transform="matrix(0.40809746,0,0,0.40809746,120.50361,-449.38879)"><flowRegion
         id="flowRegion1650"
         style="font-size:93.3333px"><rect
           id="rect1648"
           width="2093.0361"
           height="743.47229"
           x="1212.1831"
           y="164.11572"
           style="font-size:93.33333588px" /></flowRegion><flowPara
         style="font-weight:bold;text-align:center;text-anchor:middle"
         id="flowPara1652">N/A</flowPara></flowRoot>
    <flowRoot
       transform="matrix(0.40809746,0,0,0.40809746,120.50361,-334.84)"
       style="font-style:normal;font-weight:normal;font-size:93.3333px;line-height:1.25;font-family:sans-serif;letter-spacing:0px;word-spacing:0px;fill:#000000;fill-opacity:1;stroke:none"
       id="flowRoot1664"
       xml:space="preserve"><flowRegion
         style="font-size:93.3333px"
         id="flowRegion1660"><rect
           style="font-size:93.33333588px"
           y="164.11572"
           x="1212.1831"
           height="743.47229"
           width="2093.0361"
           id="rect1658" /></flowRegion><flowPara
         id="flowPara1662"
         style="font-weight:bold;text-align:center;text-anchor:middle">N/A</flowPara></flowRoot>
    <flowRoot
       xml:space="preserve"
       id="flowRoot1714"
       style="font-style:normal;font-weight:normal;font-size:93.3333px;line-height:1.25;font-family:sans-serif;letter-spacing:0px;word-spacing:0px;fill:#000000;fill-opacity:1;stroke:none"
       transform="matrix(0.40809746,0,0,0.40809746,-223.14281,-449.38879)"><flowRegion
         id="flowRegion1710"
         style="font-size:93.3333px"><rect
           id="rect1708"
           width="2093.0361"
           height="743.47229"
           x="1212.1831"
           y="164.11572"
           style="font-size:93.33333588px" /></flowRegion><flowPara
         style="font-weight:bold;text-align:center;text-anchor:middle"
         id="flowPara1712">N/A</flowPara></flowRoot>
    <flowRoot
       transform="matrix(0.40809746,0,0,0.40809746,-223.14281,-793.03516)"
       style="font-style:normal;font-weight:normal;font-size:93.3333px;line-height:1.25;font-family:sans-serif;letter-spacing:0px;word-spacing:0px;fill:#000000;fill-opacity:1;stroke:none"
       id="flowRoot1724"
       xml:space="preserve"><flowRegion
         style="font-size:93.3333px"
         id="flowRegion1720"><rect
           style="font-size:93.33333588px"
           y="164.11572"
           x="1212.1831"
           height="743.47229"
           width="2093.0361"
           id="rect1718" /></flowRegion><flowPara
         id="flowPara1722"
         style="font-weight:bold;text-align:center;text-anchor:middle">N/A</flowPara></flowRoot>
    <flowRoot
       xml:space="preserve"
       id="flowRoot1734"
       style="font-style:normal;font-weight:normal;font-size:93.3333px;line-height:1.25;font-family:sans-serif;letter-spacing:0px;word-spacing:0px;fill:#000000;fill-opacity:1;stroke:none"
       transform="matrix(0.40809746,0,0,0.40809746,-223.14281,-564.44015)"><flowRegion
         id="flowRegion1730"
         style="font-size:93.3333px"><rect
           id="rect1728"
           width="2093.0361"
           height="743.47229"
           x="1212.1831"
           y="164.11572"
           style="font-size:93.33333588px" /></flowRegion><flowPara
         style="font-weight:bold;text-align:center;text-anchor:middle"
         id="flowPara1732">N/A</flowPara></flowRoot>
    <flowRoot
       transform="matrix(0.40809746,0,0,0.40809746,-223.14281,-220.64763)"
       style="font-style:normal;font-weight:normal;font-size:93.3333px;line-height:1.25;font-family:sans-serif;letter-spacing:0px;word-spacing:0px;fill:#000000;fill-opacity:1;stroke:none"
       id="flowRoot1744"
       xml:space="preserve"><flowRegion
         style="font-size:93.3333px"
         id="flowRegion1740"><rect
           style="font-size:93.33333588px"
           y="164.11572"
           x="1212.1831"
           height="743.47229"
           width="2093.0361"
           id="rect1738" /></flowRegion><flowPara
         id="flowPara1742"
         style="font-weight:bold;text-align:center;text-anchor:middle">N/A</flowPara></flowRoot>
    <flowRoot
       xml:space="preserve"
       id="flowRoot1766"
       style="font-style:normal;font-weight:normal;font-size:93.3333px;line-height:1.25;font-family:sans-serif;letter-spacing:0px;word-spacing:0px;fill:#00d5ff;fill-opacity:1;stroke:none"
       transform="matrix(0.40809746,0,0,0.40809746,-215.94292,-16.393053)"><flowRegion
         id="flowRegion1758"
         style="font-size:93.3333px;fill:#00d5ff;fill-opacity:1"><rect
           id="rect1756"
           width="2093.0361"
           height="743.47229"
           x="1212.1831"
           y="164.11572"
           style="font-size:93.33333588px;fill:#00d5ff;fill-opacity:1" /></flowRegion><flowPara
         id="flowPara1760"
         style="font-weight:bold;text-align:center;text-anchor:middle;fill:#00d5ff;fill-opacity:1">Heterogeneous</flowPara><flowPara
         style="font-weight:bold;text-align:center;text-anchor:middle;fill:#00d5ff;fill-opacity:1"
         id="flowPara1762">Activation</flowPara><flowPara
         style="font-weight:bold;text-align:center;text-anchor:middle;fill:#00d5ff;fill-opacity:1"
         id="flowPara1764" /></flowRoot>
    <flowRoot
       transform="matrix(0.40809746,0,0,0.40809746,127.70346,-16.393053)"
       style="font-style:normal;font-weight:normal;font-size:93.3333px;line-height:1.25;font-family:sans-serif;letter-spacing:0px;word-spacing:0px;fill:#005e00;fill-opacity:1;stroke:none"
       id="flowRoot1782"
       xml:space="preserve"><flowRegion
         style="font-size:93.3333px;fill:#005e00;fill-opacity:1"
         id="flowRegion1774"><rect
           style="font-size:93.33333588px;fill:#005e00;fill-opacity:1"
           y="164.11572"
           x="1212.1831"
           height="743.47229"
           width="2093.0361"
           id="rect1772" /></flowRegion><flowPara
         id="flowPara1780"
         style="font-weight:bold;text-align:center;text-anchor:middle;fill:#005e00;fill-opacity:1">Stable</flowPara><flowPara
         style="font-weight:bold;text-align:center;text-anchor:middle;fill:#005e00;fill-opacity:1"
         id="flowPara1789">Bistability</flowPara></flowRoot>
    <flowRoot
       xml:space="preserve"
       id="flowRoot1821"
       style="font-style:normal;font-weight:normal;font-size:93.3333px;line-height:1.25;font-family:sans-serif;letter-spacing:0px;word-spacing:0px;fill:#000000;fill-opacity:1;stroke:none"
       transform="matrix(0.49679275,0,0,0.49679275,-409.17832,-1008.0584)"><flowRegion
         id="flowRegion1817"
         style="font-size:93.3333px"><rect
           id="rect1815"
           width="2093.0361"
           height="743.47229"
           x="1212.1831"
           y="164.11572"
           style="font-size:93.33333588px" /></flowRegion><flowPara
         style="font-weight:bold;text-align:center;text-anchor:middle"
         id="flowPara1819">Initial Activation Time</flowPara></flowRoot>
    <path
       sodipodi:nodetypes="cc"
       inkscape:connector-curvature="0"
       id="path1823"
       d="M 879.15389,-758.69446 V -836.9928"
       style="fill:none;stroke:#000000;stroke-width:8.33367634;stroke-linecap:butt;stroke-linejoin:miter;stroke-miterlimit:4;stroke-dasharray:none;stroke-opacity:1" />
    <path
       sodipodi:nodetypes="cc"
       inkscape:connector-curvature="0"
       id="path1825"
       d="M 1206.0107,-845.45221 H 211.34069"
       style="fill:none;stroke:#000000;stroke-width:5.95262623;stroke-linecap:butt;stroke-linejoin:miter;stroke-miterlimit:4;stroke-dasharray:35.71575838, 11.90525279;stroke-dashoffset:0;stroke-opacity:0.60784314" />
    <path
       sodipodi:nodetypes="cc"
       inkscape:connector-curvature="0"
       id="path1889"
       d="M 195.32145,-74.406539 H 117.0231"
       style="fill:none;stroke:#000000;stroke-width:8.33367634;stroke-linecap:butt;stroke-linejoin:miter;stroke-miterlimit:4;stroke-dasharray:none;stroke-opacity:1" />
    <flowRoot
       transform="matrix(0,-0.40809746,0.40809746,0,60.632802,1020.4443)"
       style="font-style:normal;font-weight:normal;font-size:93.3333px;line-height:1.25;font-family:sans-serif;letter-spacing:0px;word-spacing:0px;fill:#000000;fill-opacity:1;stroke:none"
       id="flowRoot1899"
       xml:space="preserve"><flowRegion
         style="font-size:93.3333px"
         id="flowRegion1895"><rect
           style="font-size:93.33333588px"
           y="164.11572"
           x="1212.1831"
           height="743.47229"
           width="2093.0361"
           id="rect1893" /></flowRegion><flowPara
         id="flowPara1897"
         style="font-style:italic;font-weight:bold;text-align:center;text-anchor:middle">Infinite</flowPara></flowRoot>
    <flowRoot
       xml:space="preserve"
       id="flowRoot1907"
       style="font-style:normal;font-weight:normal;font-size:93.3333px;line-height:1.25;font-family:sans-serif;letter-spacing:0px;word-spacing:0px;fill:#000000;fill-opacity:1;stroke:none"
       transform="matrix(0,-0.40809746,0.40809746,0,60.632802,676.95698)"><flowRegion
         id="flowRegion1903"
         style="font-size:93.3333px"><rect
           id="rect1901"
           width="2093.0361"
           height="743.47229"
           x="1212.1831"
           y="164.11572"
           style="font-size:93.33333588px" /></flowRegion><flowPara
         style="font-style:italic;font-weight:bold;text-align:center;text-anchor:middle"
         id="flowPara1905">Heterogeneous</flowPara></flowRoot>
    <flowRoot
       transform="matrix(0,-0.40809746,0.40809746,0,60.632802,333.16447)"
       style="font-style:normal;font-weight:normal;font-size:93.3333px;line-height:1.25;font-family:sans-serif;letter-spacing:0px;word-spacing:0px;fill:#000000;fill-opacity:1;stroke:none"
       id="flowRoot1915"
       xml:space="preserve"><flowRegion
         style="font-size:93.3333px"
         id="flowRegion1911"><rect
           style="font-size:93.33333588px"
           y="164.11572"
           x="1212.1831"
           height="743.47229"
           width="2093.0361"
           id="rect1909" /></flowRegion><flowPara
         id="flowPara1913"
         style="font-style:italic;font-weight:bold;text-align:center;text-anchor:middle">Instantaneous</flowPara></flowRoot>
    <path
       style="fill:none;stroke:#000000;stroke-width:8.33367634;stroke-linecap:butt;stroke-linejoin:miter;stroke-miterlimit:4;stroke-dasharray:none;stroke-opacity:1"
       d="M 195.32145,-418.29894 H 117.0231"
       id="path1925"
       inkscape:connector-curvature="0"
       sodipodi:nodetypes="cc" />
    <path
       style="fill:none;stroke:#000000;stroke-width:5.95262623;stroke-linecap:butt;stroke-linejoin:miter;stroke-miterlimit:4;stroke-dasharray:35.71575838, 11.90525279;stroke-dashoffset:0;stroke-opacity:0.60784314"
       d="M 108.56371,-745.15569 V 249.51432"
       id="path1927"
       inkscape:connector-curvature="0"
       sodipodi:nodetypes="cc" />
    <rect
       y="-763.88983"
       x="1255.3055"
       height="350.95932"
       width="350.95932"
       id="rect1931"
       style="fill:none;stroke:#000000;stroke-width:8.51101971;stroke-miterlimit:4;stroke-dasharray:none;stroke-opacity:1" />
    <path
       sodipodi:nodetypes="cc"
       inkscape:connector-curvature="0"
       id="path1933"
       d="m 1263.6119,-647.77395 h 328.655"
       style="fill:none;stroke:#000000;stroke-width:6.07929993;stroke-linecap:butt;stroke-linejoin:miter;stroke-miterlimit:4;stroke-dasharray:36.47579883, 12.15859961;stroke-dashoffset:0;stroke-opacity:0.60784314" />
    <path
       style="fill:none;stroke:#000000;stroke-width:6.07929993;stroke-linecap:butt;stroke-linejoin:miter;stroke-miterlimit:4;stroke-dasharray:36.47579883, 12.15859961;stroke-dashoffset:0;stroke-opacity:0.60784314"
       d="m 1263.6119,-530.78753 h 328.655"
       id="path1935"
       inkscape:connector-curvature="0"
       sodipodi:nodetypes="cc" />
    <path
       sodipodi:nodetypes="cc"
       inkscape:connector-curvature="0"
       id="path1937"
       d="m 1606.0539,-760.62823 v -79.96449"
       style="fill:none;stroke:#000000;stroke-width:5.95262623;stroke-linecap:butt;stroke-linejoin:miter;stroke-miterlimit:4;stroke-dasharray:35.71575738, 11.90525246;stroke-dashoffset:0;stroke-opacity:0.60784314" />
    <flowRoot
       xml:space="preserve"
       id="flowRoot1965"
       style="font-style:normal;font-weight:normal;font-size:93.3333px;line-height:1.25;font-family:sans-serif;letter-spacing:0px;word-spacing:0px;fill:#000000;fill-opacity:1;stroke:none"
       transform="matrix(0.40809746,0,0,0.40809746,506.50583,-793.03516)"><flowRegion
         id="flowRegion1961"
         style="font-size:93.3333px"><rect
           id="rect1959"
           width="2093.0361"
           height="743.47229"
           x="1212.1831"
           y="164.11572"
           style="font-size:93.33333588px" /></flowRegion><flowPara
         style="font-style:italic;font-weight:bold;text-align:center;text-anchor:middle"
         id="flowPara1963">Instantaneous</flowPara></flowRoot>
    <flowRoot
       transform="matrix(0.35523672,0,0,0.35523672,629.38933,-880.27293)"
       style="font-style:normal;font-weight:normal;font-size:93.3333px;line-height:1.25;font-family:sans-serif;letter-spacing:0px;word-spacing:0px;fill:#000000;fill-opacity:1;stroke:none"
       id="flowRoot1973"
       xml:space="preserve"><flowRegion
         style="font-size:93.3333px"
         id="flowRegion1969"><rect
           style="font-size:93.33333588px"
           y="164.11572"
           x="1212.1831"
           height="743.47229"
           width="2093.0361"
           id="rect1967" /></flowRegion><flowPara
         id="flowPara1971"
         style="font-weight:bold;text-align:center;text-anchor:middle">Reactivation Time</flowPara></flowRoot>
    <path
       style="fill:none;stroke:#000000;stroke-width:5.95262623;stroke-linecap:butt;stroke-linejoin:miter;stroke-miterlimit:4;stroke-dasharray:35.71575738, 11.90525246;stroke-dashoffset:0;stroke-opacity:0.60784314"
       d="m 1255.2959,-760.62823 v -79.96449"
       id="path1975"
       inkscape:connector-curvature="0"
       sodipodi:nodetypes="cc" />
    <flowRoot
       transform="matrix(0.40809746,0,0,0.40809746,506.50583,-676.04873)"
       style="font-style:normal;font-weight:normal;font-size:93.3333px;line-height:1.25;font-family:sans-serif;letter-spacing:0px;word-spacing:0px;fill:#000000;fill-opacity:1;stroke:none"
       id="flowRoot1995"
       xml:space="preserve"><flowRegion
         style="font-size:93.3333px"
         id="flowRegion1991"><rect
           style="font-size:93.33333588px"
           y="164.11572"
           x="1212.1831"
           height="743.47229"
           width="2093.0361"
           id="rect1989" /></flowRegion><flowPara
         id="flowPara1993"
         style="font-style:italic;font-weight:bold;text-align:center;text-anchor:middle">Heterogeneous</flowPara></flowRoot>
    <flowRoot
       xml:space="preserve"
       id="flowRoot2005"
       style="font-style:normal;font-weight:normal;font-size:93.3333px;line-height:1.25;font-family:sans-serif;letter-spacing:0px;word-spacing:0px;fill:#000000;fill-opacity:1;stroke:none"
       transform="matrix(0.40809746,0,0,0.40809746,506.50583,-559.05128)"><flowRegion
         id="flowRegion2001"
         style="font-size:93.3333px"><rect
           id="rect1999"
           width="2093.0361"
           height="743.47229"
           x="1212.1831"
           y="164.11572"
           style="font-size:93.33333588px" /></flowRegion><flowPara
         style="font-style:italic;font-weight:bold;text-align:center;text-anchor:middle"
         id="flowPara2003">Infinite</flowPara></flowRoot>
    <path
       style="fill:none;stroke:#000000;stroke-width:6.07929993;stroke-linecap:butt;stroke-linejoin:miter;stroke-miterlimit:4;stroke-dasharray:36.47579883, 12.15859961;stroke-dashoffset:0;stroke-opacity:0.60784314"
       d="m 1263.6119,-837.57498 h 328.655"
       id="path2007"
       inkscape:connector-curvature="0"
       sodipodi:nodetypes="cc" />
    <path
       style="fill:none;stroke:#000000;stroke-width:8.33367634;stroke-linecap:butt;stroke-linejoin:miter;stroke-miterlimit:4;stroke-dasharray:none;stroke-opacity:1"
       d="m 1222.7516,-758.69446 v -175.5395"
       id="path2016"
       inkscape:connector-curvature="0"
       sodipodi:nodetypes="cc" />
    <path
       style="fill:none;stroke:#000000;stroke-width:8.33367634;stroke-linecap:butt;stroke-linejoin:miter;stroke-miterlimit:4;stroke-dasharray:none;stroke-opacity:1"
       d="M 196.09766,269.08941 H 20.558153"
       id="path2018"
       inkscape:connector-curvature="0"
       sodipodi:nodetypes="cc" />
    <flowRoot
       transform="matrix(0,-0.49679275,0.49679275,0,-53.266247,870.04196)"
       style="font-style:normal;font-weight:normal;font-size:93.3333px;line-height:1.25;font-family:sans-serif;letter-spacing:0px;word-spacing:0px;fill:#000000;fill-opacity:1;stroke:none"
       id="flowRoot2026"
       xml:space="preserve"><flowRegion
         style="font-size:93.3333px"
         id="flowRegion2022"><rect
           style="font-size:93.33333588px"
           y="164.11572"
           x="1212.1831"
           height="743.47229"
           width="2093.0361"
           id="rect2020" /></flowRegion><flowPara
         id="flowPara2024"
         style="font-weight:bold;text-align:center;text-anchor:middle">Deactivation Time</flowPara></flowRoot>
    <path
       sodipodi:nodetypes="cc"
       inkscape:connector-curvature="0"
       id="path2028"
       d="M 196.09766,-761.88798 H 20.558153"
       style="fill:none;stroke:#000000;stroke-width:8.33367634;stroke-linecap:butt;stroke-linejoin:miter;stroke-miterlimit:4;stroke-dasharray:none;stroke-opacity:1" />
  </g>
</svg>
