<?xml version="1.0" encoding="utf-8"?>
<svg xmlns="http://www.w3.org/2000/svg" xmlns:xlink="http://www.w3.org/1999/xlink" width="2000" height="500" viewBox="0 0 8000 2000">
<defs>
  <clipPath id="clip940">
    <rect x="0" y="0" width="8000" height="2000"/>
  </clipPath>
</defs>
<path clip-path="url(#clip940)" d="
M0 2000 L8000 2000 L8000 0 L0 0  Z
  " fill="#ffffff" fill-rule="evenodd" fill-opacity="1"/>
<defs>
  <clipPath id="clip941">
    <rect x="1600" y="0" width="5601" height="2000"/>
  </clipPath>
</defs>
<path clip-path="url(#clip940)" d="
M47.2441 1242.52 L1952.76 1242.52 L1952.76 47.2441 L47.2441 47.2441  Z
  " fill="#ffffff" fill-rule="evenodd" fill-opacity="1"/>
<defs>
  <clipPath id="clip942">
    <rect x="47" y="47" width="1907" height="1196"/>
  </clipPath>
</defs>
<polyline clip-path="url(#clip940)" style="stroke:#000000; stroke-linecap:butt; stroke-linejoin:round; stroke-width:4; stroke-opacity:1; fill:none" points="
  47.2441,1242.52 1952.76,1242.52 
  "/>
<polyline clip-path="url(#clip940)" style="stroke:#000000; stroke-linecap:butt; stroke-linejoin:round; stroke-width:4; stroke-opacity:1; fill:none" points="
  47.2441,47.2441 1952.76,47.2441 
  "/>
<polyline clip-path="url(#clip940)" style="stroke:#000000; stroke-linecap:butt; stroke-linejoin:round; stroke-width:4; stroke-opacity:1; fill:none" points="
  47.2441,1242.52 47.2441,47.2441 
  "/>
<polyline clip-path="url(#clip940)" style="stroke:#000000; stroke-linecap:butt; stroke-linejoin:round; stroke-width:4; stroke-opacity:1; fill:none" points="
  1952.76,1242.52 1952.76,47.2441 
  "/>
<polyline clip-path="url(#clip942)" style="stroke:#ff00ff; stroke-linecap:butt; stroke-linejoin:round; stroke-width:16; stroke-opacity:0.7; fill:none" points="
  53.617,842.794 65.1309,842.787 171.593,842.704 235.573,842.637 289.666,842.566 348.427,842.472 402.6,842.366 460.678,842.226 527.968,842.023 587.767,841.796 
  640.205,841.552 697.377,841.229 754.889,840.828 818.476,840.278 878.977,839.623 910.431,839.223 941.884,838.775 968.361,838.356 994.838,837.897 1027.16,837.274 
  1059.49,836.575 1089.88,835.841 1120.26,835.025 1144.61,834.304 1168.95,833.52 1193.29,832.666 1217.63,831.736 1221.37,831.586 1225.12,831.434 1228.87,831.28 
  1232.61,831.124 
  "/>
<polyline clip-path="url(#clip942)" style="stroke:#f00ef0; stroke-linecap:butt; stroke-linejoin:round; stroke-width:16; stroke-opacity:0.7; fill:none" points="
  53.617,842.208 65.1309,842.202 171.593,842.127 235.573,842.067 289.666,842.003 348.427,841.919 402.6,841.823 460.678,841.698 527.968,841.515 587.767,841.311 
  640.205,841.092 697.377,840.801 754.889,840.441 818.476,839.946 878.977,839.358 910.431,838.997 941.884,838.594 968.361,838.218 994.838,837.804 1027.16,837.243 
  1059.49,836.614 1089.88,835.953 1120.26,835.218 1144.61,834.569 1168.95,833.861 1193.29,833.091 1217.63,832.253 1221.37,832.117 1225.12,831.98 1228.87,831.841 
  1232.61,831.7 
  "/>
<polyline clip-path="url(#clip942)" style="stroke:#e21ce2; stroke-linecap:butt; stroke-linejoin:round; stroke-width:16; stroke-opacity:0.7; fill:none" points="
  53.617,843.238 65.1309,843.229 171.593,843.127 235.573,843.043 289.666,842.956 348.427,842.84 402.6,842.709 460.678,842.536 527.968,842.286 587.767,842.006 
  640.205,841.705 697.377,841.306 754.889,840.812 818.476,840.134 878.977,839.328 910.431,838.835 941.884,838.283 968.361,837.769 994.838,837.204 1027.16,836.438 
  1059.49,835.58 1089.88,834.679 1120.26,833.677 1144.61,832.794 1168.95,831.833 1193.29,830.788 1217.63,829.65 1221.37,829.467 1225.12,829.281 1228.87,829.092 
  1232.61,828.901 
  "/>
<polyline clip-path="url(#clip942)" style="stroke:#d42ad4; stroke-linecap:butt; stroke-linejoin:round; stroke-width:16; stroke-opacity:0.7; fill:none" points="
  53.617,846.009 65.1309,846.002 171.593,845.929 235.573,845.87 289.666,845.808 348.427,845.725 402.6,845.631 460.678,845.507 527.968,845.328 587.767,845.128 
  640.205,844.913 697.377,844.627 754.889,844.273 818.476,843.787 878.977,843.209 910.431,842.856 941.884,842.46 968.361,842.09 994.838,841.684 1027.16,841.133 
  1059.49,840.515 1089.88,839.866 1120.26,839.143 1144.61,838.505 1168.95,837.81 1193.29,837.054 1217.63,836.23 1221.37,836.097 1225.12,835.962 1228.87,835.825 
  1232.61,835.687 
  "/>
<polyline clip-path="url(#clip942)" style="stroke:#c638c6; stroke-linecap:butt; stroke-linejoin:round; stroke-width:16; stroke-opacity:0.7; fill:none" points="
  53.617,843.725 65.1309,843.72 171.593,843.667 235.573,843.624 289.666,843.579 348.427,843.518 402.6,843.45 460.678,843.36 527.968,843.23 587.767,843.084 
  640.205,842.928 697.377,842.72 754.889,842.462 818.476,842.108 878.977,841.687 910.431,841.429 941.884,841.14 968.361,840.87 994.838,840.574 1027.16,840.171 
  1059.49,839.72 1089.88,839.245 1120.26,838.716 1144.61,838.249 1168.95,837.74 1193.29,837.185 1217.63,836.58 1221.37,836.482 1225.12,836.383 1228.87,836.283 
  1232.61,836.181 
  "/>
<polyline clip-path="url(#clip942)" style="stroke:#b846b8; stroke-linecap:butt; stroke-linejoin:round; stroke-width:16; stroke-opacity:0.7; fill:none" points="
  53.617,842.845 65.1309,842.84 171.593,842.79 235.573,842.748 289.666,842.705 348.427,842.647 402.6,842.582 460.678,842.496 527.968,842.372 587.767,842.232 
  640.205,842.083 697.377,841.884 754.889,841.638 818.476,841.3 878.977,840.897 910.431,840.65 941.884,840.374 968.361,840.116 994.838,839.833 1027.16,839.448 
  1059.49,839.016 1089.88,838.562 1120.26,838.056 1144.61,837.61 1168.95,837.123 1193.29,836.592 1217.63,836.013 1221.37,835.92 1225.12,835.825 1228.87,835.729 
  1232.61,835.631 
  "/>
<polyline clip-path="url(#clip942)" style="stroke:#aa55aa; stroke-linecap:butt; stroke-linejoin:round; stroke-width:16; stroke-opacity:0.7; fill:none" points="
  53.617,842.137 65.0687,842.133 170.955,842.081 234.589,842.039 288.39,841.995 346.834,841.936 400.713,841.87 458.478,841.783 525.404,841.656 584.88,841.515 
  637.035,841.364 693.898,841.163 751.099,840.914 814.342,840.573 874.516,840.167 905.799,839.919 937.083,839.641 963.417,839.382 989.751,839.097 1021.9,838.711 
  1054.05,838.277 1084.28,837.822 1114.5,837.315 1138.71,836.867 1162.92,836.38 1187.13,835.848 1211.34,835.27 1215.06,835.176 1218.79,835.081 1222.51,834.985 
  1226.24,834.888 
  "/>
<polyline clip-path="url(#clip942)" style="stroke:#9b639b; stroke-linecap:butt; stroke-linejoin:round; stroke-width:16; stroke-opacity:0.7; fill:none" points="
  53.617,845.436 64.9442,845.432 169.68,845.385 232.622,845.346 285.838,845.306 343.647,845.253 396.94,845.194 454.077,845.115 520.276,845.002 579.105,844.876 
  630.693,844.74 686.938,844.561 743.517,844.34 806.073,844.037 865.593,843.678 896.536,843.458 927.48,843.213 953.528,842.984 979.575,842.733 1011.38,842.393 
  1043.18,842.011 1073.07,841.611 1102.97,841.166 1126.91,840.774 1150.86,840.346 1174.81,839.881 1198.75,839.374 1202.44,839.292 1206.12,839.209 1209.81,839.125 
  1213.49,839.04 
  "/>
<polyline clip-path="url(#clip942)" style="stroke:#8d718d; stroke-linecap:butt; stroke-linejoin:round; stroke-width:16; stroke-opacity:0.7; fill:none" points="
  53.617,842.581 64.882,842.577 169.042,842.523 231.638,842.479 284.562,842.434 342.053,842.374 395.054,842.306 451.877,842.218 517.712,842.089 576.218,841.947 
  627.522,841.794 683.458,841.592 739.727,841.343 801.938,841.003 861.131,840.6 891.905,840.354 922.678,840.079 948.583,839.823 974.488,839.542 1006.11,839.161 
  1037.74,838.735 1067.47,838.289 1097.2,837.792 1121.02,837.354 1144.83,836.878 1168.65,836.36 1192.46,835.797 1196.13,835.706 1199.79,835.613 1203.46,835.52 
  1207.12,835.425 
  "/>
<polyline clip-path="url(#clip942)" style="stroke:#7f7f7f; stroke-linecap:butt; stroke-linejoin:round; stroke-width:16; stroke-opacity:0.7; fill:none" points="
  53.617,842.265 64.8379,842.261 168.591,842.211 230.942,842.17 283.66,842.128 340.925,842.072 393.719,842.009 450.32,841.926 515.897,841.807 574.175,841.675 
  625.279,841.533 680.996,841.346 737.044,841.116 799.013,840.801 857.974,840.428 888.628,840.201 919.281,839.947 945.084,839.71 970.888,839.451 1002.39,839.1 
  1033.89,838.707 1063.51,838.295 1093.12,837.837 1116.84,837.434 1140.56,836.995 1164.29,836.518 1188.01,835.999 1191.66,835.915 1195.31,835.83 1198.96,835.744 
  1202.61,835.657 
  "/>
<polyline clip-path="url(#clip942)" style="stroke:#718d71; stroke-linecap:butt; stroke-linejoin:round; stroke-width:16; stroke-opacity:0.7; fill:none" points="
  53.617,842.255 64.7575,842.25 167.767,842.194 229.671,842.15 282.011,842.103 338.866,842.042 391.281,841.973 447.476,841.883 512.584,841.753 570.443,841.608 
  621.181,841.454 676.499,841.251 732.145,841.001 793.67,840.659 852.209,840.256 882.642,840.01 913.075,839.736 938.694,839.481 964.312,839.201 995.59,838.823 
  1026.87,838.401 1056.27,837.958 1085.67,837.466 1109.22,837.033 1132.77,836.562 1156.33,836.051 1179.88,835.495 1183.5,835.405 1187.13,835.314 1190.75,835.222 
  1194.37,835.129 
  "/>
<polyline clip-path="url(#clip942)" style="stroke:#639b63; stroke-linecap:butt; stroke-linejoin:round; stroke-width:16; stroke-opacity:0.7; fill:none" points="
  53.617,840.513 64.7209,840.508 167.392,840.457 229.094,840.416 281.261,840.373 337.93,840.316 390.174,840.252 446.184,840.169 511.078,840.049 568.748,839.916 
  619.319,839.774 674.455,839.587 729.919,839.358 791.242,839.044 849.589,838.674 879.922,838.448 910.256,838.197 935.79,837.963 961.325,837.706 992.499,837.359 
  1023.67,836.972 1052.98,836.566 1082.28,836.115 1105.76,835.719 1129.23,835.288 1152.71,834.819 1176.18,834.31 1179.79,834.228 1183.41,834.145 1187.02,834.06 
  1190.63,833.975 
  "/>
<polyline clip-path="url(#clip942)" style="stroke:#55aa55; stroke-linecap:butt; stroke-linejoin:round; stroke-width:16; stroke-opacity:0.7; fill:none" points="
  53.617,838 64.6952,837.996 167.129,837.949 228.688,837.911 280.735,837.871 337.272,837.819 389.395,837.761 445.276,837.684 510.019,837.574 567.556,837.452 
  618.01,837.322 673.019,837.15 728.355,836.939 789.535,836.651 847.747,836.312 878.011,836.105 908.274,835.875 933.749,835.66 959.225,835.425 990.327,835.108 
  1021.43,834.753 1050.67,834.381 1079.9,833.968 1103.32,833.605 1126.74,833.21 1150.16,832.781 1173.58,832.315 1177.19,832.24 1180.79,832.164 1184.4,832.087 
  1188,832.008 
  "/>
<polyline clip-path="url(#clip942)" style="stroke:#46b846; stroke-linecap:butt; stroke-linejoin:round; stroke-width:16; stroke-opacity:0.7; fill:none" points="
  53.617,840.493 64.6952,840.49 167.129,840.448 228.688,840.414 280.735,840.378 337.272,840.332 389.395,840.28 445.276,840.212 510.019,840.113 567.556,840.005 
  618.01,839.889 673.019,839.735 728.355,839.548 789.535,839.291 847.747,838.988 878.011,838.804 908.274,838.598 933.749,838.407 959.225,838.198 990.327,837.914 
  1021.43,837.598 1050.67,837.266 1079.9,836.898 1103.32,836.574 1126.74,836.221 1150.16,835.838 1173.58,835.422 1177.19,835.355 1180.79,835.287 1184.4,835.218 
  1188,835.148 
  "/>
<polyline clip-path="url(#clip942)" style="stroke:#38c638; stroke-linecap:butt; stroke-linejoin:round; stroke-width:16; stroke-opacity:0.7; fill:none" points="
  53.617,839.977 64.6952,839.973 167.129,839.926 228.688,839.888 280.735,839.849 337.272,839.797 389.395,839.739 445.276,839.663 510.019,839.554 567.556,839.432 
  618.01,839.303 673.019,839.133 728.355,838.923 789.535,838.638 847.747,838.301 878.011,838.095 908.274,837.867 933.749,837.654 959.225,837.42 990.327,837.105 
  1021.43,836.753 1050.67,836.384 1079.9,835.974 1103.32,835.613 1126.74,835.222 1150.16,834.796 1173.58,834.333 1177.19,834.258 1180.79,834.183 1184.4,834.106 
  1188,834.028 
  "/>
<polyline clip-path="url(#clip942)" style="stroke:#2ad42a; stroke-linecap:butt; stroke-linejoin:round; stroke-width:16; stroke-opacity:0.7; fill:none" points="
  53.617,839.818 64.633,839.814 166.491,839.765 227.704,839.726 279.459,839.686 335.679,839.633 387.508,839.573 443.076,839.495 507.455,839.383 564.669,839.258 
  614.839,839.126 669.539,838.952 724.564,838.738 785.401,838.447 843.286,838.104 873.379,837.895 903.473,837.662 928.805,837.446 954.137,837.209 985.065,836.889 
  1015.99,836.531 1045.07,836.157 1074.14,835.742 1097.43,835.377 1120.72,834.98 1144,834.549 1167.29,834.081 1170.88,834.006 1174.46,833.929 1178.05,833.852 
  1181.63,833.773 
  "/>
<polyline clip-path="url(#clip942)" style="stroke:#1ce21c; stroke-linecap:butt; stroke-linejoin:round; stroke-width:16; stroke-opacity:0.7; fill:none" points="
  53.617,836.325 64.633,836.32 166.491,836.259 227.704,836.209 279.459,836.158 335.679,836.091 387.508,836.015 443.076,835.917 507.455,835.775 564.669,835.618 
  614.839,835.451 669.539,835.231 724.564,834.961 785.401,834.593 843.286,834.159 873.379,833.896 903.473,833.602 928.805,833.329 954.137,833.03 985.065,832.627 
  1015.99,832.176 1045.07,831.705 1074.14,831.182 1097.43,830.722 1120.72,830.223 1144,829.681 1167.29,829.092 1170.88,828.997 1174.46,828.901 1178.05,828.804 
  1181.63,828.705 
  "/>
<polyline clip-path="url(#clip942)" style="stroke:#0ef00e; stroke-linecap:butt; stroke-linejoin:round; stroke-width:16; stroke-opacity:0.7; fill:none" points="
  53.617,836.097 64.633,836.093 166.491,836.04 227.704,835.997 279.459,835.953 335.679,835.895 387.508,835.83 443.076,835.745 507.455,835.623 564.669,835.488 
  614.839,835.344 669.539,835.154 724.564,834.921 785.401,834.604 843.286,834.23 873.379,834.003 903.473,833.749 928.805,833.514 954.137,833.256 985.065,832.908 
  1015.99,832.518 1045.07,832.111 1074.14,831.66 1097.43,831.262 1120.72,830.831 1144,830.362 1167.29,829.853 1170.88,829.771 1174.46,829.688 1178.05,829.604 
  1181.63,829.519 
  "/>
<polyline clip-path="url(#clip942)" style="stroke:#00ff00; stroke-linecap:butt; stroke-linejoin:round; stroke-width:16; stroke-opacity:0.7; fill:none" points="
  53.617,836.133 64.633,836.129 166.491,836.083 227.704,836.045 279.459,836.007 335.679,835.956 387.508,835.899 443.076,835.825 507.455,835.718 564.669,835.6 
  614.839,835.475 669.539,835.309 724.564,835.106 785.401,834.828 843.286,834.502 873.379,834.303 903.473,834.082 928.805,833.876 954.137,833.65 985.065,833.346 
  1015.99,833.006 1045.07,832.65 1074.14,832.254 1097.43,831.907 1120.72,831.529 1144,831.119 1167.29,830.674 1170.88,830.602 1174.46,830.529 1178.05,830.455 
  1181.63,830.381 
  "/>
<path clip-path="url(#clip940)" d="
M47.2441 1952.76 L1952.76 1952.76 L1952.76 1337.01 L47.2441 1337.01  Z
  " fill="#ffffff" fill-rule="evenodd" fill-opacity="1"/>
<defs>
  <clipPath id="clip943">
    <rect x="47" y="1337" width="1907" height="617"/>
  </clipPath>
</defs>
<polyline clip-path="url(#clip940)" style="stroke:#000000; stroke-linecap:butt; stroke-linejoin:round; stroke-width:4; stroke-opacity:1; fill:none" points="
  47.2441,1952.76 1952.76,1952.76 
  "/>
<polyline clip-path="url(#clip940)" style="stroke:#000000; stroke-linecap:butt; stroke-linejoin:round; stroke-width:4; stroke-opacity:1; fill:none" points="
  47.2441,1337.01 1952.76,1337.01 
  "/>
<polyline clip-path="url(#clip940)" style="stroke:#000000; stroke-linecap:butt; stroke-linejoin:round; stroke-width:4; stroke-opacity:1; fill:none" points="
  47.2441,1952.76 47.2441,1337.01 
  "/>
<polyline clip-path="url(#clip940)" style="stroke:#000000; stroke-linecap:butt; stroke-linejoin:round; stroke-width:4; stroke-opacity:1; fill:none" points="
  1952.76,1952.76 1952.76,1337.01 
  "/>
<polyline clip-path="url(#clip943)" style="stroke:#87ceff; stroke-linecap:butt; stroke-linejoin:round; stroke-width:40; stroke-opacity:0.7; fill:none" points="
  52.7849,1914.75 163.989,1915.62 242.889,1912.73 354.093,1915.87 494.194,1917.89 605.398,1918.12 684.298,1917.95 795.502,1918.43 874.403,1917.63 985.607,1917.99 
  1125.71,1917.37 1236.91,1917.77 1315.81,1918.14 1427.02,1918.76 1505.92,1918.22 1617.12,1918.01 1757.22,1916.48 1868.42,1917.44 1947.32,1918.2 
  "/>
<circle clip-path="url(#clip943)" cx="52.7849" cy="1914.75" r="28" fill="#ff00ff" fill-rule="evenodd" fill-opacity="1" stroke="#000000" stroke-opacity="1" stroke-width="4"/>
<circle clip-path="url(#clip943)" cx="163.989" cy="1915.62" r="28" fill="#f00ef0" fill-rule="evenodd" fill-opacity="1" stroke="#000000" stroke-opacity="1" stroke-width="4"/>
<circle clip-path="url(#clip943)" cx="242.889" cy="1912.73" r="28" fill="#e21ce2" fill-rule="evenodd" fill-opacity="1" stroke="#000000" stroke-opacity="1" stroke-width="4"/>
<circle clip-path="url(#clip943)" cx="354.093" cy="1915.87" r="28" fill="#d42ad4" fill-rule="evenodd" fill-opacity="1" stroke="#000000" stroke-opacity="1" stroke-width="4"/>
<circle clip-path="url(#clip943)" cx="494.194" cy="1917.89" r="28" fill="#c638c6" fill-rule="evenodd" fill-opacity="1" stroke="#000000" stroke-opacity="1" stroke-width="4"/>
<circle clip-path="url(#clip943)" cx="605.398" cy="1918.12" r="28" fill="#b846b8" fill-rule="evenodd" fill-opacity="1" stroke="#000000" stroke-opacity="1" stroke-width="4"/>
<circle clip-path="url(#clip943)" cx="684.298" cy="1917.95" r="28" fill="#aa55aa" fill-rule="evenodd" fill-opacity="1" stroke="#000000" stroke-opacity="1" stroke-width="4"/>
<circle clip-path="url(#clip943)" cx="795.502" cy="1918.43" r="28" fill="#9b639b" fill-rule="evenodd" fill-opacity="1" stroke="#000000" stroke-opacity="1" stroke-width="4"/>
<circle clip-path="url(#clip943)" cx="874.403" cy="1917.63" r="28" fill="#8d718d" fill-rule="evenodd" fill-opacity="1" stroke="#000000" stroke-opacity="1" stroke-width="4"/>
<circle clip-path="url(#clip943)" cx="985.607" cy="1917.99" r="28" fill="#7f7f7f" fill-rule="evenodd" fill-opacity="1" stroke="#000000" stroke-opacity="1" stroke-width="4"/>
<circle clip-path="url(#clip943)" cx="1125.71" cy="1917.37" r="28" fill="#718d71" fill-rule="evenodd" fill-opacity="1" stroke="#000000" stroke-opacity="1" stroke-width="4"/>
<circle clip-path="url(#clip943)" cx="1236.91" cy="1917.77" r="28" fill="#639b63" fill-rule="evenodd" fill-opacity="1" stroke="#000000" stroke-opacity="1" stroke-width="4"/>
<circle clip-path="url(#clip943)" cx="1315.81" cy="1918.14" r="28" fill="#55aa55" fill-rule="evenodd" fill-opacity="1" stroke="#000000" stroke-opacity="1" stroke-width="4"/>
<circle clip-path="url(#clip943)" cx="1427.02" cy="1918.76" r="28" fill="#46b846" fill-rule="evenodd" fill-opacity="1" stroke="#000000" stroke-opacity="1" stroke-width="4"/>
<circle clip-path="url(#clip943)" cx="1505.92" cy="1918.22" r="28" fill="#38c638" fill-rule="evenodd" fill-opacity="1" stroke="#000000" stroke-opacity="1" stroke-width="4"/>
<circle clip-path="url(#clip943)" cx="1617.12" cy="1918.01" r="28" fill="#2ad42a" fill-rule="evenodd" fill-opacity="1" stroke="#000000" stroke-opacity="1" stroke-width="4"/>
<circle clip-path="url(#clip943)" cx="1757.22" cy="1916.48" r="28" fill="#1ce21c" fill-rule="evenodd" fill-opacity="1" stroke="#000000" stroke-opacity="1" stroke-width="4"/>
<circle clip-path="url(#clip943)" cx="1868.42" cy="1917.44" r="28" fill="#0ef00e" fill-rule="evenodd" fill-opacity="1" stroke="#000000" stroke-opacity="1" stroke-width="4"/>
<circle clip-path="url(#clip943)" cx="1947.32" cy="1918.2" r="28" fill="#00ff00" fill-rule="evenodd" fill-opacity="1" stroke="#000000" stroke-opacity="1" stroke-width="4"/>
<polyline clip-path="url(#clip943)" style="stroke:#0000ee; stroke-linecap:butt; stroke-linejoin:round; stroke-width:40; stroke-opacity:0.7; fill:none" points="
  52.7849,1650.05 163.989,1649.41 242.889,1650.56 354.093,1653.39 494.194,1650.96 605.398,1650.03 684.298,1649.29 795.502,1652.75 874.403,1649.77 985.607,1649.43 
  1125.71,1649.43 1236.91,1647.57 1315.81,1644.88 1427.02,1647.53 1505.92,1646.99 1617.12,1646.83 1757.22,1643.11 1868.42,1642.84 1947.32,1642.87 
  "/>
<circle clip-path="url(#clip943)" cx="52.7849" cy="1650.05" r="28" fill="#ff00ff" fill-rule="evenodd" fill-opacity="1" stroke="#000000" stroke-opacity="1" stroke-width="4"/>
<circle clip-path="url(#clip943)" cx="163.989" cy="1649.41" r="28" fill="#f00ef0" fill-rule="evenodd" fill-opacity="1" stroke="#000000" stroke-opacity="1" stroke-width="4"/>
<circle clip-path="url(#clip943)" cx="242.889" cy="1650.56" r="28" fill="#e21ce2" fill-rule="evenodd" fill-opacity="1" stroke="#000000" stroke-opacity="1" stroke-width="4"/>
<circle clip-path="url(#clip943)" cx="354.093" cy="1653.39" r="28" fill="#d42ad4" fill-rule="evenodd" fill-opacity="1" stroke="#000000" stroke-opacity="1" stroke-width="4"/>
<circle clip-path="url(#clip943)" cx="494.194" cy="1650.96" r="28" fill="#c638c6" fill-rule="evenodd" fill-opacity="1" stroke="#000000" stroke-opacity="1" stroke-width="4"/>
<circle clip-path="url(#clip943)" cx="605.398" cy="1650.03" r="28" fill="#b846b8" fill-rule="evenodd" fill-opacity="1" stroke="#000000" stroke-opacity="1" stroke-width="4"/>
<circle clip-path="url(#clip943)" cx="684.298" cy="1649.29" r="28" fill="#aa55aa" fill-rule="evenodd" fill-opacity="1" stroke="#000000" stroke-opacity="1" stroke-width="4"/>
<circle clip-path="url(#clip943)" cx="795.502" cy="1652.75" r="28" fill="#9b639b" fill-rule="evenodd" fill-opacity="1" stroke="#000000" stroke-opacity="1" stroke-width="4"/>
<circle clip-path="url(#clip943)" cx="874.403" cy="1649.77" r="28" fill="#8d718d" fill-rule="evenodd" fill-opacity="1" stroke="#000000" stroke-opacity="1" stroke-width="4"/>
<circle clip-path="url(#clip943)" cx="985.607" cy="1649.43" r="28" fill="#7f7f7f" fill-rule="evenodd" fill-opacity="1" stroke="#000000" stroke-opacity="1" stroke-width="4"/>
<circle clip-path="url(#clip943)" cx="1125.71" cy="1649.43" r="28" fill="#718d71" fill-rule="evenodd" fill-opacity="1" stroke="#000000" stroke-opacity="1" stroke-width="4"/>
<circle clip-path="url(#clip943)" cx="1236.91" cy="1647.57" r="28" fill="#639b63" fill-rule="evenodd" fill-opacity="1" stroke="#000000" stroke-opacity="1" stroke-width="4"/>
<circle clip-path="url(#clip943)" cx="1315.81" cy="1644.88" r="28" fill="#55aa55" fill-rule="evenodd" fill-opacity="1" stroke="#000000" stroke-opacity="1" stroke-width="4"/>
<circle clip-path="url(#clip943)" cx="1427.02" cy="1647.53" r="28" fill="#46b846" fill-rule="evenodd" fill-opacity="1" stroke="#000000" stroke-opacity="1" stroke-width="4"/>
<circle clip-path="url(#clip943)" cx="1505.92" cy="1646.99" r="28" fill="#38c638" fill-rule="evenodd" fill-opacity="1" stroke="#000000" stroke-opacity="1" stroke-width="4"/>
<circle clip-path="url(#clip943)" cx="1617.12" cy="1646.83" r="28" fill="#2ad42a" fill-rule="evenodd" fill-opacity="1" stroke="#000000" stroke-opacity="1" stroke-width="4"/>
<circle clip-path="url(#clip943)" cx="1757.22" cy="1643.11" r="28" fill="#1ce21c" fill-rule="evenodd" fill-opacity="1" stroke="#000000" stroke-opacity="1" stroke-width="4"/>
<circle clip-path="url(#clip943)" cx="1868.42" cy="1642.84" r="28" fill="#0ef00e" fill-rule="evenodd" fill-opacity="1" stroke="#000000" stroke-opacity="1" stroke-width="4"/>
<circle clip-path="url(#clip943)" cx="1947.32" cy="1642.87" r="28" fill="#00ff00" fill-rule="evenodd" fill-opacity="1" stroke="#000000" stroke-opacity="1" stroke-width="4"/>
<path clip-path="url(#clip940)" d="
M2047.24 1242.52 L3952.76 1242.52 L3952.76 47.2441 L2047.24 47.2441  Z
  " fill="#ffffff" fill-rule="evenodd" fill-opacity="1"/>
<defs>
  <clipPath id="clip944">
    <rect x="2047" y="47" width="1907" height="1196"/>
  </clipPath>
</defs>
<polyline clip-path="url(#clip940)" style="stroke:#000000; stroke-linecap:butt; stroke-linejoin:round; stroke-width:4; stroke-opacity:1; fill:none" points="
  2047.24,1242.52 3952.76,1242.52 
  "/>
<polyline clip-path="url(#clip940)" style="stroke:#000000; stroke-linecap:butt; stroke-linejoin:round; stroke-width:4; stroke-opacity:1; fill:none" points="
  2047.24,47.2441 3952.76,47.2441 
  "/>
<polyline clip-path="url(#clip940)" style="stroke:#000000; stroke-linecap:butt; stroke-linejoin:round; stroke-width:4; stroke-opacity:1; fill:none" points="
  2047.24,1242.52 2047.24,47.2441 
  "/>
<polyline clip-path="url(#clip940)" style="stroke:#000000; stroke-linecap:butt; stroke-linejoin:round; stroke-width:4; stroke-opacity:1; fill:none" points="
  3952.76,1242.52 3952.76,47.2441 
  "/>
<polyline clip-path="url(#clip944)" style="stroke:#ff00ff; stroke-linecap:butt; stroke-linejoin:round; stroke-width:16; stroke-opacity:0.7; fill:none" points="
  2053.62,666.663 2065.94,666.659 2179.88,666.613 2248.36,666.574 2306.25,666.533 2369.14,666.478 2427.12,666.414 2489.28,666.329 2561.3,666.204 2625.3,666.061 
  2681.43,665.906 2742.61,665.697 2804.17,665.434 2872.22,665.067 2936.98,664.623 2970.64,664.349 3004.3,664.038 3032.64,663.747 3060.98,663.424 3095.58,662.983 
  3130.17,662.483 3162.69,661.954 3195.22,661.361 3221.27,660.833 3247.32,660.254 3273.37,659.619 3299.42,658.924 3303.43,658.811 3307.44,658.696 3311.45,658.58 
  3315.46,658.463 
  "/>
<polyline clip-path="url(#clip944)" style="stroke:#da24da; stroke-linecap:butt; stroke-linejoin:round; stroke-width:16; stroke-opacity:0.7; fill:none" points="
  2053.62,787.505 2064.32,787.501 2163.3,787.451 2222.79,787.411 2273.08,787.37 2327.71,787.316 2378.08,787.256 2432.07,787.179 2494.64,787.067 2550.23,786.945 
  2598.99,786.815 2652.14,786.645 2705.61,786.438 2764.73,786.158 2820.98,785.829 2850.22,785.63 2879.47,785.408 2904.08,785.203 2928.7,784.979 2958.75,784.677 
  2988.81,784.341 3017.06,783.99 3045.31,783.602 3067.94,783.262 3090.57,782.893 3113.2,782.493 3135.83,782.06 3139.32,781.99 3142.8,781.919 3146.28,781.848 
  3149.76,781.775 
  "/>
<polyline clip-path="url(#clip944)" style="stroke:#b648b6; stroke-linecap:butt; stroke-linejoin:round; stroke-width:16; stroke-opacity:0.7; fill:none" points="
  2053.62,840.549 2063.76,840.544 2157.56,840.486 2213.93,840.441 2261.6,840.394 2313.37,840.334 2361.1,840.267 2412.27,840.181 2471.56,840.06 2524.25,839.928 
  2570.45,839.79 2620.82,839.61 2671.49,839.394 2727.52,839.103 2780.83,838.767 2808.54,838.565 2836.25,838.341 2859.58,838.135 2882.91,837.911 2911.39,837.611 
  2939.87,837.278 2966.65,836.933 2993.42,836.554 3014.87,836.223 3036.31,835.865 3057.76,835.479 3079.21,835.062 3082.51,834.995 3085.81,834.928 3089.11,834.859 
  3092.41,834.79 
  "/>
<polyline clip-path="url(#clip944)" style="stroke:#916d91; stroke-linecap:butt; stroke-linejoin:round; stroke-width:16; stroke-opacity:0.7; fill:none" points="
  2053.62,927.392 2062.83,927.385 2148,927.303 2199.18,927.241 2242.46,927.179 2289.47,927.099 2332.8,927.012 2379.27,926.902 2433.1,926.75 2480.94,926.588 
  2522.89,926.42 2568.63,926.206 2614.63,925.953 2665.5,925.618 2713.9,925.238 2739.07,925.013 2764.23,924.766 2785.41,924.541 2806.59,924.297 2832.45,923.974 
  2858.32,923.62 2882.62,923.255 2906.93,922.858 2945.88,922.145 2984.83,921.326 2990.82,921.19 2996.81,921.051 
  "/>
<polyline clip-path="url(#clip944)" style="stroke:#6d916d; stroke-linecap:butt; stroke-linejoin:round; stroke-width:16; stroke-opacity:0.7; fill:none" points="
  2053.62,985.762 2062.08,985.759 2140.35,985.725 2187.38,985.699 2227.15,985.674 2270.34,985.642 2310.17,985.608 2352.86,985.565 2402.33,985.507 2446.29,985.445 
  2484.84,985.383 2526.87,985.304 2569.15,985.211 2615.89,985.091 2660.37,984.956 2706.61,984.791 2745.54,984.629 2769.31,984.519 2793.07,984.398 2815.41,984.275 
  2837.75,984.141 2873.53,983.904 2909.32,983.633 2914.83,983.589 2920.34,983.543 
  "/>
<polyline clip-path="url(#clip944)" style="stroke:#48b648; stroke-linecap:butt; stroke-linejoin:round; stroke-width:16; stroke-opacity:0.7; fill:none" points="
  2053.62,1001.67 2061.58,1001.66 2135.24,1001.63 2179.51,1001.6 2216.94,1001.57 2257.59,1001.53 2295.08,1001.49 2335.26,1001.45 2381.82,1001.39 2423.19,1001.32 
  2459.47,1001.25 2499.03,1001.17 2538.82,1001.07 2582.82,1000.95 2624.68,1000.81 2668.2,1000.65 2704.84,1000.48 2727.21,1000.37 2749.57,1000.25 2770.6,1000.13 
  2791.62,1000 2825.3,999.769 2858.99,999.507 2864.17,999.464 2869.35,999.42 
  "/>
<polyline clip-path="url(#clip944)" style="stroke:#00ff00; stroke-linecap:butt; stroke-linejoin:round; stroke-width:16; stroke-opacity:0.7; fill:none" points="
  2053.62,1105.3 2060.34,1105.29 2122.49,1105.25 2159.84,1105.22 2191.42,1105.19 2225.72,1105.15 2257.35,1105.12 2291.25,1105.07 2330.54,1105.01 2365.45,1104.95 
  2396.06,1104.89 2429.43,1104.82 2463.01,1104.73 2500.13,1104.63 2535.45,1104.51 2572.17,1104.38 2603.09,1104.25 2621.96,1104.16 2640.83,1104.07 2658.57,1103.98 
  2676.31,1103.88 2704.73,1103.71 2733.15,1103.52 2737.52,1103.49 2741.9,1103.46 
  "/>
<path clip-path="url(#clip940)" d="
M2047.24 1952.76 L3952.76 1952.76 L3952.76 1337.01 L2047.24 1337.01  Z
  " fill="#ffffff" fill-rule="evenodd" fill-opacity="1"/>
<defs>
  <clipPath id="clip945">
    <rect x="2047" y="1337" width="1907" height="617"/>
  </clipPath>
</defs>
<polyline clip-path="url(#clip940)" style="stroke:#000000; stroke-linecap:butt; stroke-linejoin:round; stroke-width:4; stroke-opacity:1; fill:none" points="
  2047.24,1952.76 3952.76,1952.76 
  "/>
<polyline clip-path="url(#clip940)" style="stroke:#000000; stroke-linecap:butt; stroke-linejoin:round; stroke-width:4; stroke-opacity:1; fill:none" points="
  2047.24,1337.01 3952.76,1337.01 
  "/>
<polyline clip-path="url(#clip940)" style="stroke:#000000; stroke-linecap:butt; stroke-linejoin:round; stroke-width:4; stroke-opacity:1; fill:none" points="
  2047.24,1952.76 2047.24,1337.01 
  "/>
<polyline clip-path="url(#clip940)" style="stroke:#000000; stroke-linecap:butt; stroke-linejoin:round; stroke-width:4; stroke-opacity:1; fill:none" points="
  3952.76,1952.76 3952.76,1337.01 
  "/>
<polyline clip-path="url(#clip945)" style="stroke:#ff8c69; stroke-linecap:butt; stroke-linejoin:round; stroke-width:40; stroke-opacity:0.7; fill:none" points="
  2059.93,1914.62 2495.01,1916.36 2749.52,1916.27 3070.16,1915.36 3324.67,1920.45 3505.24,1919.98 3940.33,1920.33 
  "/>
<circle clip-path="url(#clip945)" cx="2059.93" cy="1914.62" r="28" fill="#ff00ff" fill-rule="evenodd" fill-opacity="1" stroke="#000000" stroke-opacity="1" stroke-width="4"/>
<circle clip-path="url(#clip945)" cx="2495.01" cy="1916.36" r="28" fill="#da24da" fill-rule="evenodd" fill-opacity="1" stroke="#000000" stroke-opacity="1" stroke-width="4"/>
<circle clip-path="url(#clip945)" cx="2749.52" cy="1916.27" r="28" fill="#b648b6" fill-rule="evenodd" fill-opacity="1" stroke="#000000" stroke-opacity="1" stroke-width="4"/>
<circle clip-path="url(#clip945)" cx="3070.16" cy="1915.36" r="28" fill="#916d91" fill-rule="evenodd" fill-opacity="1" stroke="#000000" stroke-opacity="1" stroke-width="4"/>
<circle clip-path="url(#clip945)" cx="3324.67" cy="1920.45" r="28" fill="#6d916d" fill-rule="evenodd" fill-opacity="1" stroke="#000000" stroke-opacity="1" stroke-width="4"/>
<circle clip-path="url(#clip945)" cx="3505.24" cy="1919.98" r="28" fill="#48b648" fill-rule="evenodd" fill-opacity="1" stroke="#000000" stroke-opacity="1" stroke-width="4"/>
<circle clip-path="url(#clip945)" cx="3940.33" cy="1920.33" r="28" fill="#00ff00" fill-rule="evenodd" fill-opacity="1" stroke="#000000" stroke-opacity="1" stroke-width="4"/>
<polyline clip-path="url(#clip945)" style="stroke:#ee0000; stroke-linecap:butt; stroke-linejoin:round; stroke-width:40; stroke-opacity:0.7; fill:none" points="
  2059.93,1384.39 2495.01,1585.07 2749.52,1647.64 3070.16,1726.13 3324.67,1765.79 3505.24,1775.18 3940.33,1824 
  "/>
<circle clip-path="url(#clip945)" cx="2059.93" cy="1384.39" r="28" fill="#ff00ff" fill-rule="evenodd" fill-opacity="1" stroke="#000000" stroke-opacity="1" stroke-width="4"/>
<circle clip-path="url(#clip945)" cx="2495.01" cy="1585.07" r="28" fill="#da24da" fill-rule="evenodd" fill-opacity="1" stroke="#000000" stroke-opacity="1" stroke-width="4"/>
<circle clip-path="url(#clip945)" cx="2749.52" cy="1647.64" r="28" fill="#b648b6" fill-rule="evenodd" fill-opacity="1" stroke="#000000" stroke-opacity="1" stroke-width="4"/>
<circle clip-path="url(#clip945)" cx="3070.16" cy="1726.13" r="28" fill="#916d91" fill-rule="evenodd" fill-opacity="1" stroke="#000000" stroke-opacity="1" stroke-width="4"/>
<circle clip-path="url(#clip945)" cx="3324.67" cy="1765.79" r="28" fill="#6d916d" fill-rule="evenodd" fill-opacity="1" stroke="#000000" stroke-opacity="1" stroke-width="4"/>
<circle clip-path="url(#clip945)" cx="3505.24" cy="1775.18" r="28" fill="#48b648" fill-rule="evenodd" fill-opacity="1" stroke="#000000" stroke-opacity="1" stroke-width="4"/>
<circle clip-path="url(#clip945)" cx="3940.33" cy="1824" r="28" fill="#00ff00" fill-rule="evenodd" fill-opacity="1" stroke="#000000" stroke-opacity="1" stroke-width="4"/>
<path clip-path="url(#clip940)" d="
M4047.24 1242.52 L5952.76 1242.52 L5952.76 47.2441 L4047.24 47.2441  Z
  " fill="#ffffff" fill-rule="evenodd" fill-opacity="1"/>
<defs>
  <clipPath id="clip946">
    <rect x="4047" y="47" width="1907" height="1196"/>
  </clipPath>
</defs>
<polyline clip-path="url(#clip940)" style="stroke:#000000; stroke-linecap:butt; stroke-linejoin:round; stroke-width:4; stroke-opacity:1; fill:none" points="
  4047.24,1242.52 5952.76,1242.52 
  "/>
<polyline clip-path="url(#clip940)" style="stroke:#000000; stroke-linecap:butt; stroke-linejoin:round; stroke-width:4; stroke-opacity:1; fill:none" points="
  4047.24,47.2441 5952.76,47.2441 
  "/>
<polyline clip-path="url(#clip940)" style="stroke:#000000; stroke-linecap:butt; stroke-linejoin:round; stroke-width:4; stroke-opacity:1; fill:none" points="
  4047.24,1242.52 4047.24,47.2441 
  "/>
<polyline clip-path="url(#clip940)" style="stroke:#000000; stroke-linecap:butt; stroke-linejoin:round; stroke-width:4; stroke-opacity:1; fill:none" points="
  5952.76,1242.52 5952.76,47.2441 
  "/>
<polyline clip-path="url(#clip946)" style="stroke:#ff00ff; stroke-linecap:butt; stroke-linejoin:round; stroke-width:16; stroke-opacity:0.7; fill:none" points="
  4053.62,969.64 4062.89,969.633 4148.64,969.558 4200.16,969.5 4243.73,969.442 4291.06,969.368 4334.69,969.287 4381.47,969.185 4435.66,969.043 4483.82,968.891 
  4526.06,968.734 4572.11,968.534 4618.43,968.296 4669.64,967.982 4718.37,967.625 4743.7,967.413 4769.03,967.18 4790.36,966.968 4811.68,966.739 4837.72,966.434 
  4863.75,966.099 4888.23,965.754 4912.7,965.379 4951.91,964.704 4991.12,963.929 4997.15,963.799 5003.19,963.667 
  "/>
<polyline clip-path="url(#clip946)" style="stroke:#7f7f7f; stroke-linecap:butt; stroke-linejoin:round; stroke-width:16; stroke-opacity:0.7; fill:none" points="
  4053.62,856.813 4064.51,856.809 4165.22,856.764 4225.74,856.728 4276.91,856.691 4332.49,856.641 4383.74,856.586 4438.67,856.514 4502.33,856.411 4558.89,856.297 
  4608.5,856.177 4662.58,856.018 4716.98,855.823 4777.13,855.558 4834.36,855.247 4864.12,855.058 4893.87,854.848 4918.92,854.653 4943.96,854.439 4974.54,854.151 
  5005.12,853.829 5033.86,853.493 5062.61,853.12 5085.63,852.792 5108.66,852.437 5131.68,852.051 5154.71,851.632 5158.25,851.564 5161.8,851.496 5165.34,851.427 
  5168.88,851.356 
  "/>
<polyline clip-path="url(#clip946)" style="stroke:#00ff00; stroke-linecap:butt; stroke-linejoin:round; stroke-width:16; stroke-opacity:0.7; fill:none" points="
  4053.62,769.245 4065.57,769.24 4176.06,769.184 4242.46,769.137 4298.6,769.088 4359.58,769.022 4415.8,768.947 4476.08,768.848 4545.92,768.702 4607.98,768.538 
  4662.4,768.36 4721.74,768.122 4781.42,767.825 4847.42,767.413 4910.21,766.919 4942.85,766.615 4975.49,766.272 5002.97,765.952 5030.45,765.598 5064,765.116 
  5097.55,764.573 5129.09,764 5160.62,763.358 5185.89,762.791 5211.15,762.17 5236.41,761.491 5261.67,760.749 5265.56,760.629 5269.45,760.507 5273.34,760.384 
  5277.22,760.259 
  "/>
<path clip-path="url(#clip940)" d="
M4047.24 1952.76 L5952.76 1952.76 L5952.76 1337.01 L4047.24 1337.01  Z
  " fill="#ffffff" fill-rule="evenodd" fill-opacity="1"/>
<defs>
  <clipPath id="clip947">
    <rect x="4047" y="1337" width="1907" height="617"/>
  </clipPath>
</defs>
<polyline clip-path="url(#clip940)" style="stroke:#000000; stroke-linecap:butt; stroke-linejoin:round; stroke-width:4; stroke-opacity:1; fill:none" points="
  4047.24,1952.76 5952.76,1952.76 
  "/>
<polyline clip-path="url(#clip940)" style="stroke:#000000; stroke-linecap:butt; stroke-linejoin:round; stroke-width:4; stroke-opacity:1; fill:none" points="
  4047.24,1337.01 5952.76,1337.01 
  "/>
<polyline clip-path="url(#clip940)" style="stroke:#000000; stroke-linecap:butt; stroke-linejoin:round; stroke-width:4; stroke-opacity:1; fill:none" points="
  4047.24,1952.76 4047.24,1337.01 
  "/>
<polyline clip-path="url(#clip940)" style="stroke:#000000; stroke-linecap:butt; stroke-linejoin:round; stroke-width:4; stroke-opacity:1; fill:none" points="
  5952.76,1952.76 5952.76,1337.01 
  "/>
<polyline clip-path="url(#clip947)" style="stroke:#00ff00; stroke-linecap:butt; stroke-linejoin:round; stroke-width:40; stroke-opacity:0.7; fill:none" points="
  4083.2,1917.13 4982.02,1918.63 5880.85,1915.94 
  "/>
<circle clip-path="url(#clip947)" cx="4083.2" cy="1917.13" r="28" fill="#ff00ff" fill-rule="evenodd" fill-opacity="1" stroke="#000000" stroke-opacity="1" stroke-width="4"/>
<circle clip-path="url(#clip947)" cx="4982.02" cy="1918.63" r="28" fill="#7f7f7f" fill-rule="evenodd" fill-opacity="1" stroke="#000000" stroke-opacity="1" stroke-width="4"/>
<circle clip-path="url(#clip947)" cx="5880.85" cy="1915.94" r="28" fill="#00ff00" fill-rule="evenodd" fill-opacity="1" stroke="#000000" stroke-opacity="1" stroke-width="4"/>
<polyline clip-path="url(#clip947)" style="stroke:#008000; stroke-linecap:butt; stroke-linejoin:round; stroke-width:40; stroke-opacity:0.7; fill:none" points="
  4083.2,1755.76 4982.02,1664.35 5880.85,1560.41 
  "/>
<circle clip-path="url(#clip947)" cx="4083.2" cy="1755.76" r="28" fill="#ff00ff" fill-rule="evenodd" fill-opacity="1" stroke="#000000" stroke-opacity="1" stroke-width="4"/>
<circle clip-path="url(#clip947)" cx="4982.02" cy="1664.35" r="28" fill="#7f7f7f" fill-rule="evenodd" fill-opacity="1" stroke="#000000" stroke-opacity="1" stroke-width="4"/>
<circle clip-path="url(#clip947)" cx="5880.85" cy="1560.41" r="28" fill="#00ff00" fill-rule="evenodd" fill-opacity="1" stroke="#000000" stroke-opacity="1" stroke-width="4"/>
<path clip-path="url(#clip940)" d="
M6047.24 1242.52 L7952.76 1242.52 L7952.76 47.2441 L6047.24 47.2441  Z
  " fill="#ffffff" fill-rule="evenodd" fill-opacity="1"/>
<defs>
  <clipPath id="clip948">
    <rect x="6047" y="47" width="1907" height="1196"/>
  </clipPath>
</defs>
<polyline clip-path="url(#clip940)" style="stroke:#000000; stroke-linecap:butt; stroke-linejoin:round; stroke-width:4; stroke-opacity:1; fill:none" points="
  6047.24,1242.52 7952.76,1242.52 
  "/>
<polyline clip-path="url(#clip940)" style="stroke:#000000; stroke-linecap:butt; stroke-linejoin:round; stroke-width:4; stroke-opacity:1; fill:none" points="
  6047.24,47.2441 7952.76,47.2441 
  "/>
<polyline clip-path="url(#clip940)" style="stroke:#000000; stroke-linecap:butt; stroke-linejoin:round; stroke-width:4; stroke-opacity:1; fill:none" points="
  6047.24,1242.52 6047.24,47.2441 
  "/>
<polyline clip-path="url(#clip940)" style="stroke:#000000; stroke-linecap:butt; stroke-linejoin:round; stroke-width:4; stroke-opacity:1; fill:none" points="
  7952.76,1242.52 7952.76,47.2441 
  "/>
<polyline clip-path="url(#clip948)" style="stroke:#ff00ff; stroke-linecap:butt; stroke-linejoin:round; stroke-width:16; stroke-opacity:0.7; fill:none" points="
  6053.62,744.329 6066,744.329 6180.52,744.329 6249.34,744.329 6307.53,744.329 6370.74,744.329 6429.01,744.329 6491.48,744.329 6563.86,744.329 6628.19,744.329 
  6684.6,744.329 6746.09,744.329 6807.96,744.329 6842.16,744.329 6876.36,744.329 6892.63,744.329 6908.9,744.329 6917.03,744.329 6925.17,744.329 6933.3,744.329 
  6941.44,744.329 6943.55,744.329 6945.67,744.329 6947.78,744.329 6949.9,744.329 6950.95,744.329 6952.01,744.329 6952.54,744.329 6953.07,744.329 6953.6,744.329 
  6954.12,744.329 6954.65,744.329 6955.18,744.329 6955.71,744.329 6956.24,744.329 6957.3,744.329 6958.35,744.329 6962.58,744.329 6966.81,744.329 6971.04,744.329 
  6975.27,744.329 6992.19,744.329 7009.1,744.329 7037.59,744.329 7066.07,744.329 7135.61,744.329 7200.98,744.329 7305.72,744.329 7321.83,744.329 
  "/>
<polyline clip-path="url(#clip948)" style="stroke:#d42ad4; stroke-linecap:butt; stroke-linejoin:round; stroke-width:16; stroke-opacity:0.7; fill:none" points="
  6053.62,750.774 6065.5,750.774 6175.42,750.774 6241.47,750.774 6297.32,750.774 6357.99,750.774 6413.92,750.774 6473.88,750.774 6543.35,750.774 6605.09,750.774 
  6659.23,750.774 6688.74,750.774 6718.26,750.774 6733.1,750.774 6747.94,750.774 6755.37,750.774 6762.79,750.774 6766.5,750.774 6770.21,750.774 6773.92,750.774 
  6777.63,750.774 6779.68,750.774 6781.74,750.774 6782.76,750.774 6783.79,750.774 6784.3,750.774 6784.81,750.774 6785.33,750.774 6785.84,750.774 6786.35,750.774 
  6786.87,750.774 6787.38,750.774 6787.89,750.774 6788.92,750.774 6789.94,750.774 6791.99,750.774 6794.05,750.774 6802.25,750.774 6810.46,750.774 6826.87,750.774 
  6843.28,750.774 6874.51,750.774 6905.75,750.774 6970.69,750.774 7025.36,750.774 7058.74,750.774 7092.11,750.774 7123.49,750.774 7154.86,750.774 7167.42,750.774 
  7179.99,750.774 7192.55,750.774 7205.12,750.774 7211.4,750.774 7217.68,750.774 7220.83,750.774 7223.97,750.774 7225.54,750.774 7227.11,750.774 7227.89,750.774 
  7228.68,750.774 7229.46,750.774 7230.25,750.774 7231.04,750.774 7231.82,750.774 7232.61,750.774 7233.39,750.774 7234.96,750.774 7236.53,750.774 7239.67,750.774 
  7242.82,750.774 7249.1,750.774 7255.38,750.774 7259.25,750.774 7263.12,750.774 7266.98,750.774 7270.85,750.774 
  "/>
<polyline clip-path="url(#clip948)" style="stroke:#aa55aa; stroke-linecap:butt; stroke-linejoin:round; stroke-width:16; stroke-opacity:0.7; fill:none" points="
  6053.62,807.713 6065.13,807.712 6171.59,807.698 6235.57,807.686 6289.67,807.673 6348.43,807.657 6402.6,807.638 6460.68,807.613 6527.97,807.577 6587.77,807.537 
  6640.21,807.494 6697.38,807.437 6754.89,807.366 6818.48,807.269 6878.98,807.152 6910.43,807.081 6941.88,807.001 6968.36,806.927 6994.84,806.845 7027.16,806.733 
  7059.49,806.608 7089.88,806.476 7120.26,806.329 7144.61,806.199 7168.95,806.057 7193.29,805.902 7217.63,805.733 7221.37,805.705 7225.12,805.678 7228.87,805.649 
  7232.61,805.621 
  "/>
<polyline clip-path="url(#clip948)" style="stroke:#7f7f7f; stroke-linecap:butt; stroke-linejoin:round; stroke-width:16; stroke-opacity:0.7; fill:none" points="
  6053.62,845.617 6064.82,845.615 6168.4,845.59 6230.65,845.569 6283.29,845.548 6340.46,845.52 6393.17,845.488 6449.68,845.446 6515.15,845.386 6573.33,845.319 
  6624.35,845.248 6679.98,845.154 6735.94,845.037 6797.8,844.878 6856.67,844.69 6887.27,844.576 6917.88,844.447 6943.64,844.328 6969.4,844.197 7000.85,844.019 
  7032.3,843.821 7061.87,843.612 7091.44,843.38 7115.12,843.176 7138.8,842.954 7162.49,842.711 7186.17,842.448 7189.81,842.405 7193.46,842.362 7197.1,842.318 
  7200.75,842.274 
  "/>
<polyline clip-path="url(#clip948)" style="stroke:#55aa55; stroke-linecap:butt; stroke-linejoin:round; stroke-width:16; stroke-opacity:0.7; fill:none" points="
  6053.62,862.051 6064.38,862.049 6163.94,862.028 6223.77,862.011 6274.35,861.994 6329.3,861.972 6379.96,861.947 6434.27,861.914 6497.2,861.868 6553.12,861.816 
  6602.16,861.762 6655.62,861.69 6709.4,861.603 6768.86,861.484 6825.44,861.345 6854.85,861.261 6884.27,861.167 6909.03,861.08 6933.79,860.984 6964.02,860.856 
  6994.24,860.713 7022.66,860.563 7051.08,860.397 7073.84,860.251 7096.6,860.093 7119.36,859.922 7142.13,859.736 7145.63,859.706 7149.13,859.675 7152.63,859.644 
  7156.14,859.613 
  "/>
<polyline clip-path="url(#clip948)" style="stroke:#2ad42a; stroke-linecap:butt; stroke-linejoin:round; stroke-width:16; stroke-opacity:0.7; fill:none" points="
  6053.62,911.548 6063.26,911.54 6152.46,911.445 6206.07,911.372 6251.39,911.298 6300.62,911.203 6346.01,911.099 6394.67,910.966 6451.05,910.781 6501.15,910.581 
  6545.08,910.373 6592.98,910.106 6641.17,909.786 6694.44,909.362 6745.13,908.875 6771.49,908.585 6797.84,908.266 6820.02,907.974 6842.21,907.657 6869.29,907.235 
  6896.38,906.77 6921.83,906.29 6947.29,905.764 6967.69,905.308 6988.08,904.817 7008.48,904.29 7028.87,903.724 7032.01,903.633 7035.15,903.541 7038.29,903.448 
  7041.42,903.354 
  "/>
<polyline clip-path="url(#clip948)" style="stroke:#00ff00; stroke-linecap:butt; stroke-linejoin:round; stroke-width:16; stroke-opacity:0.7; fill:none" points="
  6053.62,945.271 6061.46,945.242 6133.97,944.94 6177.54,944.716 6214.39,944.497 6254.41,944.225 6291.3,943.936 6330.86,943.581 6376.69,943.101 6417.42,942.603 
  6453.13,942.103 6492.07,941.479 6531.24,940.759 6574.55,939.837 6615.75,938.818 6658.6,937.59 6694.67,936.402 6716.68,935.601 6738.7,934.735 6759.39,933.859 
  6780.09,932.918 6813.25,931.263 6846.4,929.41 6851.51,929.105 6856.61,928.796 
  "/>
<path clip-path="url(#clip940)" d="
M6047.24 1952.76 L7952.76 1952.76 L7952.76 1337.01 L6047.24 1337.01  Z
  " fill="#ffffff" fill-rule="evenodd" fill-opacity="1"/>
<defs>
  <clipPath id="clip949">
    <rect x="6047" y="1337" width="1907" height="617"/>
  </clipPath>
</defs>
<polyline clip-path="url(#clip940)" style="stroke:#000000; stroke-linecap:butt; stroke-linejoin:round; stroke-width:4; stroke-opacity:1; fill:none" points="
  6047.24,1952.76 7952.76,1952.76 
  "/>
<polyline clip-path="url(#clip940)" style="stroke:#000000; stroke-linecap:butt; stroke-linejoin:round; stroke-width:4; stroke-opacity:1; fill:none" points="
  6047.24,1337.01 7952.76,1337.01 
  "/>
<polyline clip-path="url(#clip940)" style="stroke:#000000; stroke-linecap:butt; stroke-linejoin:round; stroke-width:4; stroke-opacity:1; fill:none" points="
  6047.24,1952.76 6047.24,1337.01 
  "/>
<polyline clip-path="url(#clip940)" style="stroke:#000000; stroke-linecap:butt; stroke-linejoin:round; stroke-width:4; stroke-opacity:1; fill:none" points="
  7952.76,1952.76 7952.76,1337.01 
  "/>
<polyline clip-path="url(#clip949)" style="stroke:#eeaeee; stroke-linecap:butt; stroke-linejoin:round; stroke-width:40; stroke-opacity:0.7; fill:none" points="
  6055.53,1923.43 6339.87,1923.43 6715.74,1921.69 7000.08,1920.71 7284.42,1921.24 7660.29,1914.01 7944.63,1889.47 
  "/>
<circle clip-path="url(#clip949)" cx="6055.53" cy="1923.43" r="28" fill="#ff00ff" fill-rule="evenodd" fill-opacity="1" stroke="#000000" stroke-opacity="1" stroke-width="4"/>
<circle clip-path="url(#clip949)" cx="6339.87" cy="1923.43" r="28" fill="#d42ad4" fill-rule="evenodd" fill-opacity="1" stroke="#000000" stroke-opacity="1" stroke-width="4"/>
<circle clip-path="url(#clip949)" cx="6715.74" cy="1921.69" r="28" fill="#aa55aa" fill-rule="evenodd" fill-opacity="1" stroke="#000000" stroke-opacity="1" stroke-width="4"/>
<circle clip-path="url(#clip949)" cx="7000.08" cy="1920.71" r="28" fill="#7f7f7f" fill-rule="evenodd" fill-opacity="1" stroke="#000000" stroke-opacity="1" stroke-width="4"/>
<circle clip-path="url(#clip949)" cx="7284.42" cy="1921.24" r="28" fill="#55aa55" fill-rule="evenodd" fill-opacity="1" stroke="#000000" stroke-opacity="1" stroke-width="4"/>
<circle clip-path="url(#clip949)" cx="7660.29" cy="1914.01" r="28" fill="#2ad42a" fill-rule="evenodd" fill-opacity="1" stroke="#000000" stroke-opacity="1" stroke-width="4"/>
<circle clip-path="url(#clip949)" cx="7944.63" cy="1889.47" r="28" fill="#00ff00" fill-rule="evenodd" fill-opacity="1" stroke="#000000" stroke-opacity="1" stroke-width="4"/>
<polyline clip-path="url(#clip949)" style="stroke:#800080; stroke-linecap:butt; stroke-linejoin:round; stroke-width:40; stroke-opacity:0.7; fill:none" points="
  6055.53,1523.66 6339.87,1533.47 6715.74,1610.32 7000.08,1652.89 7284.42,1669.48 7660.29,1713.73 7944.63,1739.8 
  "/>
<circle clip-path="url(#clip949)" cx="6055.53" cy="1523.66" r="28" fill="#ff00ff" fill-rule="evenodd" fill-opacity="1" stroke="#000000" stroke-opacity="1" stroke-width="4"/>
<circle clip-path="url(#clip949)" cx="6339.87" cy="1533.47" r="28" fill="#d42ad4" fill-rule="evenodd" fill-opacity="1" stroke="#000000" stroke-opacity="1" stroke-width="4"/>
<circle clip-path="url(#clip949)" cx="6715.74" cy="1610.32" r="28" fill="#aa55aa" fill-rule="evenodd" fill-opacity="1" stroke="#000000" stroke-opacity="1" stroke-width="4"/>
<circle clip-path="url(#clip949)" cx="7000.08" cy="1652.89" r="28" fill="#7f7f7f" fill-rule="evenodd" fill-opacity="1" stroke="#000000" stroke-opacity="1" stroke-width="4"/>
<circle clip-path="url(#clip949)" cx="7284.42" cy="1669.48" r="28" fill="#55aa55" fill-rule="evenodd" fill-opacity="1" stroke="#000000" stroke-opacity="1" stroke-width="4"/>
<circle clip-path="url(#clip949)" cx="7660.29" cy="1713.73" r="28" fill="#2ad42a" fill-rule="evenodd" fill-opacity="1" stroke="#000000" stroke-opacity="1" stroke-width="4"/>
<circle clip-path="url(#clip949)" cx="7944.63" cy="1739.8" r="28" fill="#00ff00" fill-rule="evenodd" fill-opacity="1" stroke="#000000" stroke-opacity="1" stroke-width="4"/>
</svg>
