<?xml version="1.0" encoding="utf-8"?>
<svg xmlns="http://www.w3.org/2000/svg" xmlns:xlink="http://www.w3.org/1999/xlink" width="900" height="600" viewBox="0 0 3600 2400">
<defs>
  <clipPath id="clip480">
    <rect x="0" y="0" width="3600" height="2400"/>
  </clipPath>
</defs>
<path clip-path="url(#clip480)" d="
M0 2400 L3600 2400 L3600 0 L0 0  Z
  " fill="#ffffff" fill-rule="evenodd" fill-opacity="1"/>
<defs>
  <clipPath id="clip481">
    <rect x="720" y="0" width="2521" height="2400"/>
  </clipPath>
</defs>
<path clip-path="url(#clip480)" d="
M47.2441 2352.76 L3552.76 2352.76 L3552.76 47.2441 L47.2441 47.2441  Z
  " fill="#ffffff" fill-rule="evenodd" fill-opacity="1"/>
<defs>
  <clipPath id="clip482">
    <rect x="47" y="47" width="3507" height="2307"/>
  </clipPath>
</defs>
<polyline clip-path="url(#clip480)" style="stroke:#000000; stroke-linecap:butt; stroke-linejoin:round; stroke-width:4; stroke-opacity:1; fill:none" points="
  47.2441,2352.76 3552.76,2352.76 
  "/>
<polyline clip-path="url(#clip480)" style="stroke:#000000; stroke-linecap:butt; stroke-linejoin:round; stroke-width:4; stroke-opacity:1; fill:none" points="
  47.2441,47.2441 3552.76,47.2441 
  "/>
<polyline clip-path="url(#clip480)" style="stroke:#000000; stroke-linecap:butt; stroke-linejoin:round; stroke-width:4; stroke-opacity:1; fill:none" points="
  47.2441,2352.76 47.2441,47.2441 
  "/>
<polyline clip-path="url(#clip480)" style="stroke:#000000; stroke-linecap:butt; stroke-linejoin:round; stroke-width:4; stroke-opacity:1; fill:none" points="
  3552.76,2352.76 3552.76,47.2441 
  "/>
<polyline clip-path="url(#clip482)" style="stroke:#000000; stroke-linecap:butt; stroke-linejoin:round; stroke-width:20; stroke-opacity:1; fill:none" stroke-dasharray="10, 20" points="
  923.622,2417.4 923.622,1232.32 
  "/>
<polyline clip-path="url(#clip482)" style="stroke:#000000; stroke-linecap:butt; stroke-linejoin:round; stroke-width:20; stroke-opacity:1; fill:none" stroke-dasharray="10, 20" points="
  47.2441,1232.32 923.622,1232.32 
  "/>
<polyline clip-path="url(#clip482)" style="stroke:#000000; stroke-linecap:butt; stroke-linejoin:round; stroke-width:20; stroke-opacity:1; fill:none" stroke-dasharray="10, 20" points="
  47.2441,154.978 4429.13,154.978 
  "/>
<polyline clip-path="url(#clip482)" style="stroke:#009af9; stroke-linecap:butt; stroke-linejoin:round; stroke-width:56; stroke-opacity:0.8; fill:none" points="
  47.2441,2309.66 57.9423,2283.68 68.6405,2258.31 79.3387,2233.54 90.0368,2209.35 139.497,2104.45 188.957,2009.74 238.417,1923.81 287.877,1845.49 386.797,1707.96 
  485.718,1591.12 545.164,1529 604.611,1472.03 664.058,1419.6 723.505,1371.18 824.028,1297.22 924.552,1231.75 1033.75,1168.63 1142.94,1112.51 1243.61,1066 
  1344.28,1023.8 1560.14,945.31 1810.23,870.422 2032.48,814.856 2227.38,772.78 2439.86,732.623 2653.61,697.17 2889.94,662.717 3114.8,633.769 3348.6,606.974 
  3545.42,586.638 3785.7,564.163 4011.57,545.069 4373.44,517.936 4429.13,514.092 
  "/>
<polyline clip-path="url(#clip482)" style="stroke:#e26f46; stroke-linecap:butt; stroke-linejoin:round; stroke-width:56; stroke-opacity:0.8; fill:none" points="
  47.2441,2309.66 57.9423,2309.34 68.6405,2308.38 79.3387,2306.78 90.0368,2304.54 139.497,2286.05 188.957,2254.76 238.417,2211.79 287.877,2158.6 386.797,2028.42 
  485.718,1878.28 604.611,1689.13 723.505,1505.5 824.028,1361.66 924.552,1231.18 1033.75,1105.39 1142.94,995.617 1243.61,907.423 1344.28,830.343 1452.21,758.515 
  1560.14,696.339 1685.18,634.53 1810.23,581.916 2032.48,506.392 2227.38,454.72 2439.86,409.863 2653.61,373.843 2889.94,341.992 3114.8,317.573 3348.6,296.821 
  3545.42,282.225 3785.7,267.218 4011.57,255.372 4373.44,239.913 4429.13,237.851 
  "/>
<polyline clip-path="url(#clip482)" style="stroke:#3da44d; stroke-linecap:butt; stroke-linejoin:round; stroke-width:56; stroke-opacity:0.8; fill:none" points="
  47.2441,2309.66 57.9423,2309.66 68.6405,2309.63 79.3387,2309.56 90.0368,2309.41 188.957,2300.59 287.877,2265.96 337.337,2234.25 386.797,2191.23 436.257,2136.37 
  485.718,2069.84 545.164,1975.73 604.611,1868.79 664.058,1752.64 723.505,1631.31 824.028,1425.17 924.552,1230.61 1033.75,1043.02 1142.94,884.306 1243.61,762.954 
  1344.28,662.944 1452.21,575.794 1560.14,505.641 1685.18,441.178 1810.23,390.697 2032.48,325.657 2227.38,286.403 2439.86,255.904 2653.61,233.891 2889.94,216.315 
  3114.8,204.077 3348.6,194.545 3545.42,188.333 3785.7,182.383 4011.57,178.008 4373.44,172.742 4429.13,172.079 
  "/>
<polyline clip-path="url(#clip482)" style="stroke:#c271d2; stroke-linecap:butt; stroke-linejoin:round; stroke-width:56; stroke-opacity:0.8; fill:none" points="
  47.2441,2309.66 57.9423,2309.66 68.6405,2309.66 79.3387,2309.66 90.0368,2309.66 188.957,2309.42 287.877,2306.3 337.337,2301.13 386.797,2291.01 436.257,2273.16 
  485.718,2244.16 515.441,2219.8 545.164,2189.23 574.888,2151.7 604.611,2106.59 634.335,2053.52 664.058,1992.33 693.782,1923.24 723.505,1846.79 773.767,1703.38 
  824.028,1547.73 874.29,1387.28 924.552,1229.47 979.15,1068.15 1033.75,922.5 1088.35,795.116 1142.94,686.352 1193.28,601.626 1243.61,530.294 1293.95,470.643 
  1344.28,420.962 1398.25,376.971 1452.21,340.896 1506.18,311.279 1560.14,286.912 1685.18,245.491 1810.23,218.454 2032.48,190.505 2227.38,177.36 2439.86,169.091 
  2653.61,164.2 2889.94,160.962 3114.8,159.071 3348.6,157.815 3545.42,157.103 3785.7,156.503 4011.57,156.115 4373.44,155.713 4429.13,155.668 
  "/>
<polyline clip-path="url(#clip482)" style="stroke:#ac8d18; stroke-linecap:butt; stroke-linejoin:round; stroke-width:56; stroke-opacity:0.8; fill:none" points="
  47.2441,2309.66 68.6405,2309.66 90.0368,2309.66 287.877,2309.66 485.718,2307.55 545.164,2302.14 604.611,2286.58 634.335,2271.14 664.058,2247.25 693.782,2211.45 
  723.505,2159.6 748.636,2099.96 773.767,2023.24 798.898,1927.79 824.028,1813.34 849.159,1681.5 874.29,1535.97 899.421,1382.19 924.552,1226.61 951.851,1062.96 
  979.15,911.422 1006.45,776.432 1033.75,660.01 1061.05,562.167 1088.35,481.554 1115.65,416.104 1142.94,363.511 1193.28,292.888 1243.61,246.757 1293.95,216.645 
  1344.28,196.881 1452.21,174.023 1560.14,164.106 1685.18,159.113 1810.23,156.962 2032.48,155.584 2227.38,155.216 2439.86,155.072 2653.61,155.018 2889.94,154.995 
  3114.8,154.986 3348.6,154.982 3545.42,154.98 3785.7,154.979 4011.57,154.979 4373.44,154.979 4429.13,154.979 
  "/>
</svg>
