<?xml version="1.0" encoding="utf-8"?>
<svg xmlns="http://www.w3.org/2000/svg" xmlns:xlink="http://www.w3.org/1999/xlink" width="2000" height="1000" viewBox="0 0 8000 4000">
<defs>
  <clipPath id="clip600">
    <rect x="0" y="0" width="8000" height="4000"/>
  </clipPath>
</defs>
<path clip-path="url(#clip600)" d="
M0 4000 L8000 4000 L8000 0 L0 0  Z
  " fill="#ffffff" fill-rule="evenodd" fill-opacity="1"/>
<defs>
  <clipPath id="clip601">
    <rect x="1600" y="0" width="5601" height="4000"/>
  </clipPath>
</defs>
<path clip-path="url(#clip600)" d="
M110.236 1889.76 L1952.76 1889.76 L1952.76 47.2441 L110.236 47.2441  Z
  " fill="#ffffff" fill-rule="evenodd" fill-opacity="1"/>
<defs>
  <clipPath id="clip602">
    <rect x="110" y="47" width="1844" height="1844"/>
  </clipPath>
</defs>
<polyline clip-path="url(#clip600)" style="stroke:#000000; stroke-linecap:round; stroke-linejoin:round; stroke-width:4; stroke-opacity:1; fill:none" points="
  110.236,1889.76 1952.76,1889.76 
  "/>
<polyline clip-path="url(#clip600)" style="stroke:#000000; stroke-linecap:round; stroke-linejoin:round; stroke-width:4; stroke-opacity:1; fill:none" points="
  110.236,47.2441 1952.76,47.2441 
  "/>
<polyline clip-path="url(#clip600)" style="stroke:#000000; stroke-linecap:round; stroke-linejoin:round; stroke-width:4; stroke-opacity:1; fill:none" points="
  110.236,1889.76 110.236,47.2441 
  "/>
<polyline clip-path="url(#clip600)" style="stroke:#000000; stroke-linecap:round; stroke-linejoin:round; stroke-width:4; stroke-opacity:1; fill:none" points="
  1952.76,1889.76 1952.76,47.2441 
  "/>
<polyline clip-path="url(#clip602)" style="stroke:#009af9; stroke-linecap:round; stroke-linejoin:round; stroke-width:20; stroke-opacity:1; fill:none" points="
  110.236,1858.3 119.01,1872.28 127.784,1861.89 136.558,1872.15 145.332,1858.74 154.106,1861.48 162.88,1871.65 171.654,1856.37 180.427,1855.14 189.201,1875.57 
  197.975,1870.74 206.749,1876.26 215.523,1857.45 224.297,1871.45 233.071,1850.59 241.845,1874.73 250.619,1856.56 259.393,1851.57 268.166,1863.28 276.94,1877.21 
  285.714,1872.87 294.488,1872.46 303.262,1868.82 312.036,1863.08 320.81,1873.08 329.584,1865.28 338.358,1876.12 347.132,1861.94 355.906,1868.77 364.679,1876.79 
  373.453,1851.3 382.227,1874.76 391.001,1867.1 399.775,1829.82 408.549,1863.87 417.323,1865.32 426.097,1879.13 434.871,1858.82 443.645,1868.67 452.418,1856.51 
  461.192,1863.79 469.966,1873.19 478.74,1867.26 487.514,1873.16 496.288,1868.97 505.062,1873.36 513.836,1868.49 522.61,1867.72 531.384,1878.32 540.157,1865.82 
  548.931,1860.57 557.705,1871.65 566.479,1858.9 575.253,1869.05 584.027,1865.98 592.801,1849.41 601.575,1848.07 610.349,1859.6 619.123,1846.87 627.897,1854.19 
  636.67,1854.92 645.444,1855.67 654.218,1866.2 662.992,1865.22 671.766,1858.07 680.54,1865.35 689.314,1878.27 698.088,1864.22 706.862,1860.68 715.636,1867.32 
  724.409,1867.36 733.183,1876.27 741.957,1847.97 750.731,1851.99 759.505,1844.58 768.279,1855.41 777.053,1877.42 785.827,1863.45 794.601,1868.22 803.375,1854.73 
  812.148,1859.01 820.922,1844.79 829.696,1851.21 838.47,1877.9 847.244,1865.62 856.018,1848.17 864.792,1852.67 873.566,1858.68 882.34,1850.44 891.114,1855.76 
  899.888,1854.24 908.661,1865.82 917.435,1850.43 926.209,1867.52 934.983,1853.42 943.757,1866.61 952.531,1840.84 961.305,1846.04 970.079,1849.07 978.853,1866.12 
  987.627,1861.34 996.4,1853.53 1005.17,1867.42 1013.95,1861.01 1022.72,1873.59 1031.5,1856.75 1040.27,1857.45 1049.04,1865.48 1057.82,1856.23 1066.59,1841.75 
  1075.37,1847.5 1084.14,1865.61 1092.91,1876.87 1101.69,1834.3 1110.46,1858.22 1119.24,1842.74 1128.01,1836.26 1136.78,1854.77 1145.56,1843.77 1154.33,1870.98 
  1163.1,1861.13 1171.88,1827.56 1180.65,1867.33 1189.43,1846.16 1198.2,1878.64 1206.97,1850.74 1215.75,1855.34 1224.52,1839.58 1233.3,1840.03 1242.07,1833.11 
  1250.84,1842.4 1259.62,1844.36 1268.39,1843.55 1277.17,1834.25 1285.94,1855.97 1294.71,1846.31 1303.49,1854.01 1312.26,1845.74 1321.03,1829.88 1329.81,1858.39 
  1338.58,1841.1 1347.36,1833.16 1356.13,1829.08 1364.9,1844.05 1373.68,1840.56 1382.45,1831.95 1391.23,1847.02 1400,1825.28 1408.77,1862.87 1417.55,1844.72 
  1426.32,1831.94 1435.1,1826.83 1443.87,1840.75 1452.64,1842.38 1461.42,1833.9 1470.19,1836.97 1478.97,1823.1 1487.74,1849.86 1496.51,1822.41 1505.29,1822.22 
  1514.06,1830.37 1522.83,1839.68 1531.61,1829.28 1540.38,1815.31 1549.16,1807.87 1557.93,1812.89 1566.7,1812.25 1575.48,1807.08 1584.25,1813.86 1593.03,1818.48 
  1601.8,1811.23 1610.57,1817.39 1619.35,1786.85 1628.12,1813.27 1636.9,1789.49 1645.67,1775.33 1654.44,1777.05 1663.22,1767.23 1671.99,1779.06 1680.76,1770.27 
  1689.54,1755.81 1698.31,1726.81 1707.09,1731.7 1715.86,1686.01 1724.63,1643.92 1733.41,1675.04 1742.18,1657.14 1750.96,1599.57 1759.73,1599.52 1768.5,1518.77 
  1777.28,1525.82 1786.05,1416.62 1794.83,1350.83 1803.6,1279.6 1812.37,1183.97 1821.15,1083.73 1829.92,1039.78 1838.7,1009.05 1847.47,896.751 1856.24,836.767 
  1865.02,822.024 1873.79,737.977 1882.56,677.052 1891.34,590.855 1900.11,545.833 1908.89,450.011 1917.66,437.314 1926.43,365.809 1935.21,342.208 1943.98,328.768 
  1952.76,312.589 
  "/>
<polyline clip-path="url(#clip602)" style="stroke:#e26f46; stroke-linecap:round; stroke-linejoin:round; stroke-width:20; stroke-opacity:1; fill:none" points="
  110.236,999.501 119.01,1001.62 127.784,997.864 136.558,1001.25 145.332,998.176 154.106,1000.88 162.88,1003.65 171.654,1000.12 180.427,996.907 189.201,1004.52 
  197.975,1006.24 206.749,1010.17 215.523,1006.04 224.297,1012.18 233.071,1009.11 241.845,1014.2 250.619,1007.17 259.393,1003.39 268.166,1003.5 276.94,1009.26 
  285.714,1008.84 294.488,1007.07 303.262,1005.77 312.036,1006.61 320.81,1013.94 329.584,1008.33 338.358,1011.2 347.132,1005.39 355.906,1008.54 364.679,1011.42 
  373.453,1005.72 382.227,1013.56 391.001,1013.66 399.775,1005.53 408.549,1015.12 417.323,1018.52 426.097,1026.06 434.871,1018.3 443.645,1022.06 452.418,1018.73 
  461.192,1020.45 469.966,1022.98 478.74,1026.48 487.514,1030.94 496.288,1033.02 505.062,1033.31 513.836,1029.89 522.61,1033.23 531.384,1034.22 540.157,1029.21 
  548.931,1030.32 557.705,1035.46 566.479,1029.42 575.253,1036.67 584.027,1036.26 592.801,1032.94 601.575,1035.36 610.349,1041.42 619.123,1037.29 627.897,1044.62 
  636.67,1042.5 645.444,1041.2 654.218,1047.47 662.992,1048.29 671.766,1050.85 680.54,1054.98 689.314,1054.15 698.088,1048.59 706.862,1050.11 715.636,1056.14 
  724.409,1058.66 733.183,1058.77 741.957,1051.84 750.731,1052.06 759.505,1053.49 768.279,1057.4 777.053,1063.96 785.827,1061.27 794.601,1063.47 803.375,1058.44 
  812.148,1057.21 820.922,1051.84 829.696,1057.03 838.47,1060.47 847.244,1054.37 856.018,1054.24 864.792,1056.06 873.566,1058.76 882.34,1058.06 891.114,1063.86 
  899.888,1064.02 908.661,1063.61 917.435,1062.1 926.209,1070.91 934.983,1065.42 943.757,1069.87 952.531,1064.11 961.305,1068.37 970.079,1069.84 978.853,1074.1 
  987.627,1073.45 996.4,1069.72 1005.17,1075.55 1013.95,1074.9 1022.72,1076.76 1031.5,1073.84 1040.27,1076.28 1049.04,1080.96 1057.82,1080.35 1066.59,1081.42 
  1075.37,1083.87 1084.14,1090.32 1092.91,1093.82 1101.69,1083.81 1110.46,1090.22 1119.24,1087.91 1128.01,1087.87 1136.78,1098.68 1145.56,1094.19 1154.33,1104.22 
  1163.1,1106.4 1171.88,1096.31 1180.65,1109.29 1189.43,1102.72 1198.2,1108.83 1206.97,1100.35 1215.75,1104.07 1224.52,1096.58 1233.3,1095.2 1242.07,1091.05 
  1250.84,1092.34 1259.62,1092.74 1268.39,1095.49 1277.17,1095.55 1285.94,1107.21 1294.71,1098.66 1303.49,1102.36 1312.26,1099.39 1321.03,1095.85 1329.81,1106.94 
  1338.58,1099.33 1347.36,1100.01 1356.13,1100.28 1364.9,1103.1 1373.68,1105.55 1382.45,1102.21 1391.23,1108.8 1400,1100.52 1408.77,1112.67 1417.55,1107.07 
  1426.32,1099.44 1435.1,1102.5 1443.87,1105.69 1452.64,1106.94 1461.42,1106.53 1470.19,1108.14 1478.97,1097.79 1487.74,1109.13 1496.51,1096.76 1505.29,1098.31 
  1514.06,1095.42 1522.83,1098.47 1531.61,1093.79 1540.38,1090.78 1549.16,1090.18 1557.93,1085.33 1566.7,1080.92 1575.48,1077.3 1584.25,1075.71 1593.03,1075.01 
  1601.8,1074.16 1610.57,1066.33 1619.35,1059.76 1628.12,1068.74 1636.9,1059.33 1645.67,1056.11 1654.44,1051.41 1663.22,1042.54 1671.99,1043.85 1680.76,1036.47 
  1689.54,1029.38 1698.31,1020.83 1707.09,1018.54 1715.86,997.714 1724.63,977.942 1733.41,987.541 1742.18,972.24 1750.96,949.351 1759.73,949.322 1768.5,922.107 
  1777.28,920.644 1786.05,884.424 1794.83,861.115 1803.6,830.588 1812.37,798.413 1821.15,769.509 1829.92,747.702 1838.7,725.518 1847.47,688.047 1856.24,660.284 
  1865.02,638.775 1873.79,604.444 1882.56,579.287 1891.34,542.541 1900.11,520.022 1908.89,484.276 1917.66,477.31 1926.43,442.199 1935.21,421.385 1943.98,415.423 
  1952.76,406.378 
  "/>
<path clip-path="url(#clip600)" d="
M110.236 3889.76 L1952.76 3889.76 L1952.76 2047.24 L110.236 2047.24  Z
  " fill="#ffffff" fill-rule="evenodd" fill-opacity="1"/>
<defs>
  <clipPath id="clip603">
    <rect x="110" y="2047" width="1844" height="1844"/>
  </clipPath>
</defs>
<polyline clip-path="url(#clip600)" style="stroke:#000000; stroke-linecap:round; stroke-linejoin:round; stroke-width:4; stroke-opacity:1; fill:none" points="
  110.236,3889.76 1952.76,3889.76 
  "/>
<polyline clip-path="url(#clip600)" style="stroke:#000000; stroke-linecap:round; stroke-linejoin:round; stroke-width:4; stroke-opacity:1; fill:none" points="
  110.236,2047.24 1952.76,2047.24 
  "/>
<polyline clip-path="url(#clip600)" style="stroke:#000000; stroke-linecap:round; stroke-linejoin:round; stroke-width:4; stroke-opacity:1; fill:none" points="
  110.236,3889.76 110.236,2047.24 
  "/>
<polyline clip-path="url(#clip600)" style="stroke:#000000; stroke-linecap:round; stroke-linejoin:round; stroke-width:4; stroke-opacity:1; fill:none" points="
  1952.76,3889.76 1952.76,2047.24 
  "/>
<polyline clip-path="url(#clip603)" style="stroke:#009af9; stroke-linecap:round; stroke-linejoin:round; stroke-width:8; stroke-opacity:0.6; fill:none" points="
  1111.27,3820.55 1095.76,3851.31 1123.28,3828.44 1098.48,3851.01 1120.99,3821.51 1101.17,3827.55 1080.81,3849.91 1106.71,3816.29 1130.29,3813.59 1074.47,3858.55 
  1061.87,3847.91 1033.01,3860.05 1063.3,3818.67 1018.29,3849.48 1040.81,3803.58 1003.46,3856.69 1055.06,3816.73 1082.79,3805.73 1081.93,3831.5 1039.68,3862.14 
  1042.76,3852.6 1055.8,3851.7 1065.32,3843.69 1059.14,3831.07 1005.39,3853.06 1046.51,3835.9 1025.49,3859.75 1068.07,3828.54 1044.98,3843.58 1023.88,3861.22 
  1065.65,3805.14 1008.15,3856.75 1007.44,3839.9 1067.04,3757.88 996.699,3832.79 971.832,3835.98 916.514,3866.37 973.414,3821.68 945.833,3843.36 970.286,3816.6 
  957.676,3832.63 939.116,3853.3 913.449,3840.25 880.689,3853.23 865.493,3844.01 863.359,3853.68 888.423,3842.97 863.91,3841.26 856.679,3864.59 893.422,3837.09 
  885.254,3825.53 847.586,3849.91 891.868,3821.87 838.675,3844.2 841.741,3837.44 866.071,3800.99 848.288,3798.04 803.853,3823.41 834.177,3795.39 780.389,3811.51 
  795.919,3813.1 805.466,3814.76 759.509,3837.92 753.449,3835.77 734.729,3820.03 704.395,3836.05 710.487,3864.47 751.285,3833.57 740.13,3825.79 695.916,3840.38 
  677.409,3840.47 676.658,3860.07 727.464,3797.82 725.811,3806.66 715.344,3790.35 686.664,3814.18 638.601,3862.61 658.297,3831.88 642.195,3842.36 679.074,3812.7 
  688.108,3822.11 727.437,3790.82 689.42,3804.95 664.131,3863.66 708.878,3836.65 709.881,3798.25 696.478,3808.17 676.721,3821.39 681.863,3803.26 639.314,3814.96 
  638.096,3811.61 641.113,3837.09 652.214,3803.23 587.591,3840.82 627.894,3809.8 595.218,3838.83 637.459,3782.14 606.211,3793.57 595.458,3800.23 564.197,3837.74 
  568.963,3827.23 596.313,3810.06 553.568,3840.62 558.359,3826.5 544.696,3854.18 566.129,3817.14 548.193,3818.67 513.916,3836.33 518.381,3815.99 510.527,3784.14 
  492.575,3796.78 445.268,3836.63 419.589,3861.4 492.986,3767.74 445.971,3820.36 462.96,3786.32 463.207,3772.06 383.95,3812.78 416.921,3788.58 343.366,3848.43 
  327.317,3826.77 401.356,3752.92 306.184,3840.42 354.321,3793.84 309.525,3865.29 371.723,3803.92 344.428,3814.03 399.368,3779.36 409.465,3780.36 439.928,3765.13 
  430.418,3785.56 427.542,3789.87 407.318,3788.09 406.885,3767.64 321.406,3815.42 384.09,3794.17 356.963,3811.1 378.788,3792.92 404.688,3758.02 323.392,3820.73 
  379.182,3782.7 374.236,3765.23 372.257,3756.26 351.537,3789.2 333.566,3781.51 358.039,3762.57 309.732,3795.72 370.493,3747.9 281.376,3830.59 322.445,3790.67 
  378.36,3762.56 355.973,3751.32 332.588,3781.92 323.413,3785.52 326.405,3766.86 314.58,3773.62 390.479,3743.1 307.353,3801.97 398.032,3741.59 386.65,3741.16 
  407.842,3759.09 385.487,3779.59 419.849,3756.69 441.87,3725.96 446.268,3709.6 481.871,3720.64 514.196,3719.23 540.75,3707.87 552.388,3722.77 557.51,3732.94 
  563.768,3717 621.158,3730.54 669.362,3663.35 603.508,3721.48 672.513,3669.15 696.147,3638.02 730.598,3641.79 795.629,3620.18 786.078,3646.21 840.186,3626.87 
  892.14,3595.07 954.831,3531.27 971.64,3542.02 1124.38,3441.51 1269.37,3348.91 1198.98,3417.38 1311.19,3377.99 1479.04,3251.33 1479.25,3251.23 1678.83,3073.59 
  1689.56,3089.1 1955.17,2848.85 2126.1,2704.11 2349.97,2547.41 2585.92,2337.02 2797.88,2116.5 2957.79,2019.8 3120.48,1952.2 3395.26,1705.14 3598.86,1573.17 
  3756.6,1540.74 4008.36,1355.83 4192.84,1221.8 4462.31,1032.17 4627.45,933.115 4889.59,722.307 4940.67,694.375 5198.15,537.064 5350.79,485.141 5394.51,455.574 
  5460.84,419.979 
  "/>
<circle clip-path="url(#clip603)" cx="1111.27" cy="3820.55" r="18" fill="#009af9" fill-rule="evenodd" fill-opacity="1" stroke="#000000" stroke-opacity="1" stroke-width="8"/>
<path clip-path="url(#clip600)" d="
M2110.24 1889.76 L3952.76 1889.76 L3952.76 47.2441 L2110.24 47.2441  Z
  " fill="#ffffff" fill-rule="evenodd" fill-opacity="1"/>
<defs>
  <clipPath id="clip604">
    <rect x="2110" y="47" width="1844" height="1844"/>
  </clipPath>
</defs>
<polyline clip-path="url(#clip600)" style="stroke:#000000; stroke-linecap:round; stroke-linejoin:round; stroke-width:4; stroke-opacity:1; fill:none" points="
  2110.24,1889.76 3952.76,1889.76 
  "/>
<polyline clip-path="url(#clip600)" style="stroke:#000000; stroke-linecap:round; stroke-linejoin:round; stroke-width:4; stroke-opacity:1; fill:none" points="
  2110.24,47.2441 3952.76,47.2441 
  "/>
<polyline clip-path="url(#clip600)" style="stroke:#000000; stroke-linecap:round; stroke-linejoin:round; stroke-width:4; stroke-opacity:1; fill:none" points="
  2110.24,1889.76 2110.24,47.2441 
  "/>
<polyline clip-path="url(#clip600)" style="stroke:#000000; stroke-linecap:round; stroke-linejoin:round; stroke-width:4; stroke-opacity:1; fill:none" points="
  3952.76,1889.76 3952.76,47.2441 
  "/>
<polyline clip-path="url(#clip604)" style="stroke:#009af9; stroke-linecap:round; stroke-linejoin:round; stroke-width:20; stroke-opacity:1; fill:none" points="
  2110.24,1872.48 2119.01,1847.5 2127.78,1865.11 2136.56,1849.1 2145.33,1853.96 2154.11,1816.02 2162.88,1862.3 2171.65,1851.2 2180.43,1846.85 2189.2,1867.23 
  2197.98,1862.69 2206.75,1859.23 2215.52,1868.8 2224.3,1856.26 2233.07,1863.26 2241.84,1870.13 2250.62,1862.27 2259.39,1861.89 2268.17,1845.83 2276.94,1852.04 
  2285.71,1848.87 2294.49,1863.13 2303.26,1865.1 2312.04,1861.85 2320.81,1848.83 2329.58,1846.95 2338.36,1860.41 2347.13,1852.16 2355.91,1874.5 2364.68,1853.83 
  2373.45,1851.81 2382.23,1865.97 2391,1876.44 2399.78,1850.6 2408.55,1857.92 2417.32,1852.99 2426.1,1854.29 2434.87,1866.5 2443.64,1861.64 2452.42,1853.06 
  2461.19,1863.17 2469.97,1866.58 2478.74,1871.42 2487.51,1857.15 2496.29,1871.79 2505.06,1864.34 2513.84,1856.88 2522.61,1864.24 2531.38,1849.59 2540.16,1866.42 
  2548.93,1850.28 2557.71,1862.03 2566.48,1873.75 2575.25,1871.48 2584.03,1857.91 2592.8,1872.66 2601.57,1854.35 2610.35,1867.83 2619.12,1869.22 2627.9,1874.43 
  2636.67,1868.47 2645.44,1862.22 2654.22,1863.43 2662.99,1868 2671.77,1873.2 2680.54,1875.34 2689.31,1871.25 2698.09,1843.18 2706.86,1862.18 2715.64,1872.71 
  2724.41,1877.46 2733.18,1856.74 2741.96,1868.99 2750.73,1871.61 2759.51,1861.64 2768.28,1865.04 2777.05,1871.04 2785.83,1869.28 2794.6,1852.33 2803.37,1865.79 
  2812.15,1876.06 2820.92,1868.35 2829.7,1877.92 2838.47,1866.62 2847.24,1853.33 2856.02,1858.76 2864.79,1849.21 2873.57,1856.81 2882.34,1869.88 2891.11,1863.27 
  2899.89,1855.18 2908.66,1828.81 2917.44,1873.55 2926.21,1856.13 2934.98,1854.53 2943.76,1868.83 2952.53,1874.9 2961.3,1859.74 2970.08,1836.1 2978.85,1857.84 
  2987.63,1855.99 2996.4,1851.29 3005.17,1856.14 3013.95,1864.01 3022.72,1860.05 3031.5,1860.94 3040.27,1854.36 3049.04,1851.86 3057.82,1857.9 3066.59,1861.15 
  3075.37,1865.41 3084.14,1864.45 3092.91,1863 3101.69,1843.61 3110.46,1866.27 3119.24,1837.16 3128.01,1852.3 3136.78,1856.25 3145.56,1856.65 3154.33,1844.66 
  3163.1,1864.38 3171.88,1808.95 3180.65,1853.27 3189.43,1840.07 3198.2,1814.74 3206.97,1844.79 3215.75,1839.12 3224.52,1848 3233.3,1843.63 3242.07,1835.6 
  3250.84,1828.75 3259.62,1824.92 3268.39,1829.2 3277.17,1826.4 3285.94,1838.15 3294.71,1843.43 3303.49,1829.71 3312.26,1835.43 3321.03,1845.67 3329.81,1833.19 
  3338.58,1834.37 3347.36,1804.01 3356.13,1813.55 3364.9,1840.84 3373.68,1840.91 3382.45,1812.65 3391.23,1814.43 3400,1786.34 3408.77,1801.03 3417.55,1802.1 
  3426.32,1812.46 3435.1,1779.63 3443.87,1809.71 3452.64,1789.35 3461.42,1742.15 3470.19,1802.1 3478.97,1803.4 3487.74,1793.12 3496.51,1741.57 3505.29,1776.3 
  3514.06,1716.99 3522.83,1772.89 3531.61,1786.38 3540.38,1773.14 3549.16,1761.6 3557.93,1782.45 3566.7,1733.28 3575.48,1717.51 3584.25,1736.5 3593.03,1755.88 
  3601.8,1725.64 3610.57,1720.61 3619.35,1683.27 3628.12,1718.69 3636.9,1632.26 3645.67,1649.94 3654.44,1663.9 3663.22,1595.24 3671.99,1597.61 3680.76,1588.48 
  3689.54,1598.87 3698.31,1493.09 3707.09,1476.01 3715.86,1434.56 3724.63,1365.95 3733.41,1427.9 3742.18,1382.27 3750.96,1391.01 3759.73,1310.42 3768.5,1220.39 
  3777.28,1243.43 3786.05,1258.19 3794.83,1176.2 3803.6,1112.54 3812.37,1137.07 3821.15,1095.35 3829.92,999.121 3838.7,884.678 3847.47,868.992 3856.24,835.798 
  3865.02,863.965 3873.79,763.528 3882.56,756.162 3891.34,662.501 3900.11,646.681 3908.89,531.268 3917.66,509.062 3926.43,493.089 3935.21,522.27 3943.98,538.893 
  3952.76,589.853 
  "/>
<polyline clip-path="url(#clip604)" style="stroke:#e26f46; stroke-linecap:round; stroke-linejoin:round; stroke-width:20; stroke-opacity:1; fill:none" points="
  2110.24,1061.68 2119.01,1052.81 2127.78,1054.63 2136.56,1049.17 2145.33,1047.16 2154.11,1037.74 2162.88,1047.02 2171.65,1042.39 2180.43,1041.32 2189.2,1046.47 
  2197.98,1043.62 2206.75,1044.54 2215.52,1055.74 2224.3,1051.12 2233.07,1054.64 2241.84,1055.54 2250.62,1050.64 2259.39,1049.81 2268.17,1043.43 2276.94,1040.91 
  2285.71,1041.75 2294.49,1044.42 2303.26,1045.61 2312.04,1041.81 2320.81,1037.56 2329.58,1033.3 2338.36,1041.32 2347.13,1043.47 2355.91,1044.43 2364.68,1037.98 
  2373.45,1043.28 2382.23,1049.01 2391,1053.5 2399.78,1045.28 2408.55,1041.12 2417.32,1040.41 2426.1,1042.04 2434.87,1047.81 2443.64,1046.5 2452.42,1038.85 
  2461.19,1039.83 2469.97,1044.76 2478.74,1047.43 2487.51,1042.75 2496.29,1041.77 2505.06,1038.24 2513.84,1035.84 2522.61,1040.31 2531.38,1035.61 2540.16,1037.88 
  2548.93,1037.87 2557.71,1039.15 2566.48,1040.79 2575.25,1040.81 2584.03,1040.86 2592.8,1047.15 2601.57,1039.13 2610.35,1047.44 2619.12,1047.97 2627.9,1051.75 
  2636.67,1050.56 2645.44,1046.88 2654.22,1044.72 2662.99,1043.77 2671.77,1043.55 2680.54,1046.25 2689.31,1050.39 2698.09,1043.99 2706.86,1050.73 2715.64,1057.25 
  2724.41,1060.52 2733.18,1055.36 2741.96,1061.96 2750.73,1066.62 2759.51,1062.28 2768.28,1066.65 2777.05,1071.44 2785.83,1071.83 2794.6,1067.82 2803.37,1071 
  2812.15,1075.18 2820.92,1073.48 2829.7,1076.08 2838.47,1074.47 2847.24,1073.68 2856.02,1080.82 2864.79,1076.04 2873.57,1077.32 2882.34,1080.33 2891.11,1079.03 
  2899.89,1075.64 2908.66,1066.3 2917.44,1080.24 2926.21,1079.86 2934.98,1078.68 2943.76,1085.47 2952.53,1093.2 2961.3,1083.69 2970.08,1081.27 2978.85,1091.23 
  2987.63,1091.23 2996.4,1091.13 3005.17,1092.12 3013.95,1093.44 3022.72,1093.19 3031.5,1089.3 3040.27,1086.89 3049.04,1087.15 3057.82,1092.98 3066.59,1099.84 
  3075.37,1106.33 3084.14,1106.29 3092.91,1105.94 3101.69,1099.46 3110.46,1106.4 3119.24,1097.45 3128.01,1106.48 3136.78,1109.35 3145.56,1104.05 3154.33,1098.65 
  3163.1,1100.46 3171.88,1084.25 3180.65,1101.44 3189.43,1095.54 3198.2,1094.61 3206.97,1101.19 3215.75,1102.71 3224.52,1098.73 3233.3,1092.85 3242.07,1089.33 
  3250.84,1085.58 3259.62,1086.06 3268.39,1085.03 3277.17,1081.71 3285.94,1083.66 3294.71,1090.68 3303.49,1087.76 3312.26,1087.63 3321.03,1089.17 3329.81,1086.51 
  3338.58,1084.41 3347.36,1076.76 3356.13,1074.59 3364.9,1085.21 3373.68,1089.32 3382.45,1079.87 3391.23,1081.12 3400,1072.81 3408.77,1072.28 3417.55,1065.2 
  3426.32,1063.45 3435.1,1047.21 3443.87,1056.56 3452.64,1046.02 3461.42,1032.38 3470.19,1042.94 3478.97,1042.38 3487.74,1038.89 3496.51,1018.27 3505.29,1027.4 
  3514.06,1008.9 3522.83,1018.04 3531.61,1021.16 3540.38,1020.33 3549.16,1012.45 3557.93,1016.57 3566.7,1002.99 3575.48,996.338 3584.25,999.436 3593.03,999.468 
  3601.8,979.576 3610.57,979.546 3619.35,970.212 3628.12,979.378 3636.9,950.159 3645.67,946.147 3654.44,944.949 3663.22,918.368 3671.99,920.112 3680.76,914.552 
  3689.54,913.252 3698.31,874.53 3707.09,871.539 3715.86,851.328 3724.63,823.044 3733.41,825.909 3742.18,804.919 3750.96,804.933 3759.73,774.012 3768.5,740.414 
  3777.28,731.525 3786.05,725.804 3794.83,692.634 3803.6,670.678 3812.37,665.829 3821.15,647.279 3829.92,610.472 3838.7,572.23 3847.47,557.584 3856.24,541.194 
  3865.02,539.995 3873.79,501.687 3882.56,486.949 3891.34,456.448 3900.11,444.904 3908.89,403.997 3917.66,388.861 3926.43,381.114 3935.21,373.058 3943.98,366.568 
  3952.76,371.791 
  "/>
<path clip-path="url(#clip600)" d="
M2110.24 3889.76 L3952.76 3889.76 L3952.76 2047.24 L2110.24 2047.24  Z
  " fill="#ffffff" fill-rule="evenodd" fill-opacity="1"/>
<defs>
  <clipPath id="clip605">
    <rect x="2110" y="2047" width="1844" height="1844"/>
  </clipPath>
</defs>
<polyline clip-path="url(#clip600)" style="stroke:#000000; stroke-linecap:round; stroke-linejoin:round; stroke-width:4; stroke-opacity:1; fill:none" points="
  2110.24,3889.76 3952.76,3889.76 
  "/>
<polyline clip-path="url(#clip600)" style="stroke:#000000; stroke-linecap:round; stroke-linejoin:round; stroke-width:4; stroke-opacity:1; fill:none" points="
  2110.24,2047.24 3952.76,2047.24 
  "/>
<polyline clip-path="url(#clip600)" style="stroke:#000000; stroke-linecap:round; stroke-linejoin:round; stroke-width:4; stroke-opacity:1; fill:none" points="
  2110.24,3889.76 2110.24,2047.24 
  "/>
<polyline clip-path="url(#clip600)" style="stroke:#000000; stroke-linecap:round; stroke-linejoin:round; stroke-width:4; stroke-opacity:1; fill:none" points="
  3952.76,3889.76 3952.76,2047.24 
  "/>
<polyline clip-path="url(#clip605)" style="stroke:#009af9; stroke-linecap:round; stroke-linejoin:round; stroke-width:8; stroke-opacity:0.6; fill:none" points="
  2655.3,3851.75 2720.31,3796.78 2706.99,3835.52 2747.05,3800.29 2761.74,3810.98 2830.86,3727.52 2762.78,3829.34 2796.73,3804.93 2804.58,3795.36 2766.83,3840.19 
  2787.76,3830.2 2780.99,3822.59 2698.86,3843.63 2732.75,3816.05 2706.91,3831.46 2700.31,3846.56 2736.27,3829.27 2742.37,3828.44 2789.11,3793.11 2807.62,3806.77 
  2801.44,3799.79 2781.85,3831.17 2773.12,3835.49 2800.98,3828.36 2832.16,3799.72 2863.4,3795.58 2804.61,3825.19 2788.81,3807.03 2781.78,3856.18 2829.06,3810.7 
  2790.21,3806.26 2748.23,3837.42 2715.3,3860.45 2775.58,3803.6 2806.04,3819.71 2811.29,3808.87 2799.35,3811.72 2757.04,3838.59 2766.64,3827.9 2822.75,3809.02 
  2815.51,3831.25 2779.41,3838.76 2759.81,3849.41 2794.13,3818.01 2801.29,3850.22 2827.18,3833.83 2844.8,3817.42 2811.98,3833.62 2846.5,3801.37 2829.79,3838.41 
  2829.89,3802.91 2820.54,3828.75 2808.46,3854.53 2808.37,3849.54 2807.99,3819.69 2761.84,3852.14 2820.67,3811.85 2759.73,3841.5 2755.85,3844.56 2728.08,3856.03 
  2736.87,3842.91 2763.85,3829.16 2779.69,3831.82 2786.66,3841.89 2788.27,3853.32 2768.43,3858.02 2738.08,3849.03 2785.03,3787.28 2735.61,3829.07 2687.8,3852.25 
  2663.79,3862.69 2701.66,3817.11 2653.22,3844.06 2619.07,3849.82 2650.87,3827.89 2618.86,3835.37 2583.7,3848.57 2580.82,3844.7 2610.23,3807.4 2586.91,3837.01 
  2556.28,3859.61 2568.73,3842.66 2549.66,3863.72 2561.47,3838.84 2567.33,3809.61 2514.92,3821.55 2549.98,3800.54 2540.57,3817.27 2518.51,3846.01 2528.08,3831.47 
  2552.88,3813.68 2621.38,3755.67 2519.18,3854.09 2521.99,3815.77 2530.65,3812.24 2480.83,3843.72 2424.13,3857.07 2493.86,3823.72 2511.61,3771.71 2438.56,3819.53 
  2438.61,3815.47 2439.36,3805.11 2432.03,3815.78 2422.36,3833.11 2424.23,3824.4 2452.74,3826.36 2470.43,3811.89 2468.49,3806.38 2425.77,3819.66 2375.42,3826.82 
  2327.84,3836.18 2328.12,3834.06 2330.72,3830.89 2378.25,3788.22 2327.32,3838.08 2393,3774.03 2326.73,3807.34 2305.68,3816.03 2344.59,3816.91 2384.19,3790.53 
  2370.91,3833.93 2489.8,3711.96 2363.73,3809.48 2407.01,3780.43 2413.83,3724.7 2365.57,3790.83 2354.41,3778.35 2383.62,3797.88 2426.74,3788.26 2452.49,3770.59 
  2480.01,3755.53 2476.5,3747.1 2484.06,3756.52 2508.4,3750.36 2494.11,3776.22 2442.61,3787.84 2464.05,3757.65 2465.02,3770.24 2453.71,3792.75 2473.23,3765.29 
  2488.64,3767.89 2544.69,3701.11 2560.64,3722.1 2482.71,3782.14 2452.63,3782.29 2521.9,3720.11 2512.74,3724.02 2573.68,3662.23 2577.56,3694.55 2629.49,3696.9 
  2642.32,3719.7 2761.41,3647.47 2692.84,3713.66 2770.1,3668.85 2870.17,3565.01 2792.74,3696.91 2796.85,3699.77 2822.43,3677.15 2973.62,3563.74 2906.64,3640.14 
  3042.32,3509.66 2975.35,3632.64 2952.43,3662.31 2958.53,3633.19 3016.29,3607.81 2986.1,3653.67 3085.7,3545.5 3134.46,3510.81 3111.75,3552.58 3111.51,3595.21 
  3257.39,3528.68 3257.6,3517.62 3326.06,3435.48 3258.84,3513.41 3473.11,3323.26 3502.53,3362.15 3511.32,3392.87 3706.25,3241.81 3693.45,3247.02 3734.23,3226.93 
  3743.77,3249.79 4027.72,3017.07 4049.66,2979.5 4197.87,2888.31 4405.29,2737.38 4384.28,2873.66 4538.21,2773.27 4538.1,2792.51 4764.85,2615.21 5011.24,2417.15 
  5076.43,2467.83 5118.38,2500.29 5361.63,2319.93 5522.64,2179.88 5558.2,2233.83 5694.23,2142.06 5964.15,1930.35 6244.59,1678.57 6351.99,1644.07 6472.19,1571.04 
  6480.98,1633.01 6761.91,1412.04 6869.99,1395.84 7093.66,1189.79 7178.31,1154.98 7478.3,901.073 7589.29,852.22 7646.11,817.078 7705.19,881.278 7752.78,917.849 
  7714.48,1029.96 
  "/>
<circle clip-path="url(#clip605)" cx="2655.3" cy="3851.75" r="18" fill="#009af9" fill-rule="evenodd" fill-opacity="1" stroke="#000000" stroke-opacity="1" stroke-width="8"/>
<path clip-path="url(#clip600)" d="
M4110.24 1889.76 L5952.76 1889.76 L5952.76 47.2441 L4110.24 47.2441  Z
  " fill="#ffffff" fill-rule="evenodd" fill-opacity="1"/>
<defs>
  <clipPath id="clip606">
    <rect x="4110" y="47" width="1844" height="1844"/>
  </clipPath>
</defs>
<polyline clip-path="url(#clip600)" style="stroke:#000000; stroke-linecap:round; stroke-linejoin:round; stroke-width:4; stroke-opacity:1; fill:none" points="
  4110.24,1889.76 5952.76,1889.76 
  "/>
<polyline clip-path="url(#clip600)" style="stroke:#000000; stroke-linecap:round; stroke-linejoin:round; stroke-width:4; stroke-opacity:1; fill:none" points="
  4110.24,47.2441 5952.76,47.2441 
  "/>
<polyline clip-path="url(#clip600)" style="stroke:#000000; stroke-linecap:round; stroke-linejoin:round; stroke-width:4; stroke-opacity:1; fill:none" points="
  4110.24,1889.76 4110.24,47.2441 
  "/>
<polyline clip-path="url(#clip600)" style="stroke:#000000; stroke-linecap:round; stroke-linejoin:round; stroke-width:4; stroke-opacity:1; fill:none" points="
  5952.76,1889.76 5952.76,47.2441 
  "/>
<polyline clip-path="url(#clip606)" style="stroke:#009af9; stroke-linecap:round; stroke-linejoin:round; stroke-width:20; stroke-opacity:1; fill:none" points="
  4110.24,1868.32 4119.01,1867.83 4127.78,1851.79 4136.56,1862.94 4145.33,1861.06 4154.11,1870.24 4162.88,1863.16 4171.65,1849.97 4180.43,1854.79 4189.2,1854.65 
  4197.98,1848.36 4206.75,1833.53 4215.52,1884.04 4224.3,1868.92 4233.07,1855.02 4241.84,1863.56 4250.62,1855.68 4259.39,1873.66 4268.17,1858.79 4276.94,1870.58 
  4285.71,1868.99 4294.49,1870.13 4303.26,1850.93 4312.04,1863.9 4320.81,1865.28 4329.58,1861.47 4338.36,1872.38 4347.13,1849.48 4355.91,1876.62 4364.68,1866.46 
  4373.45,1867.96 4382.23,1850.35 4391,1871.63 4399.78,1858.88 4408.55,1852.75 4417.32,1864.41 4426.1,1851.96 4434.87,1867.45 4443.64,1861.09 4452.42,1856.25 
  4461.19,1844.97 4469.97,1842.79 4478.74,1879.13 4487.51,1862.48 4496.29,1859.31 4505.06,1859.72 4513.84,1877.6 4522.61,1871.14 4531.38,1863.65 4540.16,1876.75 
  4548.93,1862.53 4557.71,1861.59 4566.48,1867.42 4575.25,1865.31 4584.03,1854.6 4592.8,1861.93 4601.57,1854.95 4610.35,1851.57 4619.12,1878.65 4627.9,1867.57 
  4636.67,1843.86 4645.44,1854.83 4654.22,1852.68 4662.99,1849.96 4671.77,1858.21 4680.54,1875.95 4689.31,1869.95 4698.09,1863.18 4706.86,1868.17 4715.64,1866.05 
  4724.41,1844.95 4733.18,1837.31 4741.96,1847.77 4750.73,1859.04 4759.51,1864.02 4768.28,1854.46 4777.05,1865.28 4785.83,1863.57 4794.6,1851.7 4803.37,1850.39 
  4812.15,1866.94 4820.92,1839.31 4829.7,1852.23 4838.47,1837.44 4847.24,1835.42 4856.02,1865.88 4864.79,1850.65 4873.57,1864.24 4882.34,1847.14 4891.11,1841.42 
  4899.89,1849.75 4908.66,1853.62 4917.44,1847.6 4926.21,1841.64 4934.98,1861.22 4943.76,1841.49 4952.53,1833.03 4961.3,1852.41 4970.08,1844.84 4978.85,1854.16 
  4987.63,1854.22 4996.4,1860.45 5005.17,1852.33 5013.95,1863.16 5022.72,1863.5 5031.5,1837.4 5040.27,1852.58 5049.04,1859.58 5057.82,1856.39 5066.59,1839.36 
  5075.37,1856.02 5084.14,1835.82 5092.91,1865.27 5101.69,1828.08 5110.46,1824.56 5119.24,1818.59 5128.01,1780.05 5136.78,1829.78 5145.56,1803.34 5154.33,1794.13 
  5163.1,1837.84 5171.88,1818.22 5180.65,1827.07 5189.43,1819.05 5198.2,1834.92 5206.97,1797.08 5215.75,1853.55 5224.52,1827.43 5233.3,1823.04 5242.07,1851.52 
  5250.84,1831.73 5259.62,1848.57 5268.39,1824.98 5277.17,1817.53 5285.94,1833.48 5294.71,1814.94 5303.49,1778.67 5312.26,1815.57 5321.03,1819.55 5329.81,1806.03 
  5338.58,1808.22 5347.36,1802.89 5356.13,1791.72 5364.9,1803.06 5373.68,1845.48 5382.45,1797.56 5391.23,1814.61 5400,1808.39 5408.77,1797.12 5417.55,1788.64 
  5426.32,1782.99 5435.1,1775.1 5443.87,1774.8 5452.64,1770.13 5461.42,1755.94 5470.19,1787.33 5478.97,1778.05 5487.74,1760.88 5496.51,1802.28 5505.29,1766.07 
  5514.06,1732.47 5522.83,1707.3 5531.61,1709.41 5540.38,1724.83 5549.16,1774.47 5557.93,1699.22 5566.7,1752.58 5575.48,1738.51 5584.25,1733.09 5593.03,1703.68 
  5601.8,1670.42 5610.57,1674.05 5619.35,1687.41 5628.12,1649.63 5636.9,1618.39 5645.67,1644.9 5654.44,1605.76 5663.22,1553.17 5671.99,1573.87 5680.76,1607.27 
  5689.54,1517.26 5698.31,1561.37 5707.09,1515.76 5715.86,1453.44 5724.63,1397.51 5733.41,1424.97 5742.18,1407.36 5750.96,1401.05 5759.73,1275.59 5768.5,1219.91 
  5777.28,1222.72 5786.05,1072.87 5794.83,1064.58 5803.6,916.408 5812.37,949.093 5821.15,891.256 5829.92,947.562 5838.7,864.526 5847.47,860.694 5856.24,882.397 
  5865.02,790.417 5873.79,714.062 5882.56,687.594 5891.34,596.527 5900.11,616.843 5908.89,616.334 5917.66,530.321 5926.43,551.104 5935.21,489.563 5943.98,499.154 
  5952.76,491.748 
  "/>
<polyline clip-path="url(#clip606)" style="stroke:#e26f46; stroke-linecap:round; stroke-linejoin:round; stroke-width:20; stroke-opacity:1; fill:none" points="
  4110.24,1030.59 4119.01,1027.8 4127.78,1026.49 4136.56,1035.26 4145.33,1032.61 4154.11,1035.95 4162.88,1038.94 4171.65,1036 4180.43,1037.95 4189.2,1041.38 
  4197.98,1040.68 4206.75,1037.64 4215.52,1049.91 4224.3,1044.74 4233.07,1040.58 4241.84,1042.47 4250.62,1038.24 4259.39,1043.01 4268.17,1040.27 4276.94,1037.91 
  4285.71,1036.5 4294.49,1038.29 4303.26,1032.03 4312.04,1035.74 4320.81,1035 4329.58,1035.34 4338.36,1038.99 4347.13,1032.91 4355.91,1038.97 4364.68,1037.78 
  4373.45,1039.01 4382.23,1036.4 4391,1040.87 4399.78,1039.58 4408.55,1039.89 4417.32,1042.13 4426.1,1036.74 4434.87,1039.84 4443.64,1038.13 4452.42,1035.14 
  4461.19,1032.72 4469.97,1031.28 4478.74,1043.52 4487.51,1041.43 4496.29,1045.14 4505.06,1045.71 4513.84,1050.49 4522.61,1051.12 4531.38,1049.1 4540.16,1053.4 
  4548.93,1046.27 4557.71,1048.42 4566.48,1053.63 4575.25,1051.94 4584.03,1050.35 4592.8,1051.75 4601.57,1049.89 4610.35,1049.04 4619.12,1057.99 4627.9,1054.07 
  4636.67,1047.5 4645.44,1052.11 4654.22,1050.16 4662.99,1053.81 4671.77,1052.56 4680.54,1058.47 4689.31,1058 4698.09,1056.65 4706.86,1059.24 4715.64,1063.04 
  4724.41,1055.86 4733.18,1053.37 4741.96,1052.56 4750.73,1065.52 4759.51,1071.24 4768.28,1070.77 4777.05,1075.68 4785.83,1072.68 4794.6,1065.86 4803.37,1066.93 
  4812.15,1074 4820.92,1069.77 4829.7,1073.98 4838.47,1066.63 4847.24,1066.5 4856.02,1076.01 4864.79,1071.19 4873.57,1075.37 4882.34,1069.9 4891.11,1069.17 
  4899.89,1075.82 4908.66,1076.79 4917.44,1072.36 4926.21,1073.11 4934.98,1082.01 4943.76,1076.76 4952.53,1068.62 4961.3,1071.57 4970.08,1074.1 4978.85,1076.35 
  4987.63,1072.34 4996.4,1075.65 5005.17,1072.41 5013.95,1071.21 5022.72,1072.48 5031.5,1066.3 5040.27,1070.46 5049.04,1070.69 5057.82,1069.27 5066.59,1063.05 
  5075.37,1076.68 5084.14,1071.2 5092.91,1075.89 5101.69,1068.8 5110.46,1072.14 5119.24,1067.17 5128.01,1052.93 5136.78,1068.43 5145.56,1062.96 5154.33,1058.18 
  5163.1,1068.33 5171.88,1065.31 5180.65,1066.7 5189.43,1066.46 5198.2,1067.56 5206.97,1052.89 5215.75,1067.59 5224.52,1059.27 5233.3,1058.04 5242.07,1067.22 
  5250.84,1059.83 5259.62,1064.58 5268.39,1058.23 5277.17,1056.8 5285.94,1061.53 5294.71,1054.28 5303.49,1042.46 5312.26,1051.87 5321.03,1051.98 5329.81,1045.67 
  5338.58,1044.48 5347.36,1044.36 5356.13,1040.3 5364.9,1036.44 5373.68,1050.31 5382.45,1036.87 5391.23,1041.93 5400,1041.1 5408.77,1036.71 5417.55,1029.45 
  5426.32,1028.6 5435.1,1022.79 5443.87,1018.25 5452.64,1020.25 5461.42,1006.55 5470.19,1016.13 5478.97,1014.17 5487.74,1001.93 5496.51,1013.52 5505.29,1000.45 
  5514.06,988.219 5522.83,976.709 5531.61,974.155 5540.38,976.911 5549.16,986.376 5557.93,962.806 5566.7,970.586 5575.48,962.216 5584.25,955.922 5593.03,944.512 
  5601.8,937.741 5610.57,938.745 5619.35,946.117 5628.12,928.044 5636.9,910.83 5645.67,915.393 5654.44,900.227 5663.22,878.285 5671.99,876.903 5680.76,878.187 
  5689.54,845.096 5698.31,853.015 5707.09,827.935 5715.86,805.305 5724.63,782.593 5733.41,786.328 5742.18,775.779 5750.96,770.398 5759.73,735.81 5768.5,708.365 
  5777.28,696.924 5786.05,645.212 5794.83,627.177 5803.6,574.597 5812.37,578.117 5821.15,546.167 5829.92,551.563 5838.7,516.491 5847.47,501.408 5856.24,503.57 
  5865.02,468.346 5873.79,437.294 5882.56,425.786 5891.34,394.797 5900.11,391.513 5908.89,385.642 5917.66,350.597 5926.43,350.594 5935.21,333.155 5943.98,327.869 
  5952.76,316.428 
  "/>
<path clip-path="url(#clip600)" d="
M4110.24 3889.76 L5952.76 3889.76 L5952.76 2047.24 L4110.24 2047.24  Z
  " fill="#ffffff" fill-rule="evenodd" fill-opacity="1"/>
<defs>
  <clipPath id="clip607">
    <rect x="4110" y="2047" width="1844" height="1844"/>
  </clipPath>
</defs>
<polyline clip-path="url(#clip600)" style="stroke:#000000; stroke-linecap:round; stroke-linejoin:round; stroke-width:4; stroke-opacity:1; fill:none" points="
  4110.24,3889.76 5952.76,3889.76 
  "/>
<polyline clip-path="url(#clip600)" style="stroke:#000000; stroke-linecap:round; stroke-linejoin:round; stroke-width:4; stroke-opacity:1; fill:none" points="
  4110.24,2047.24 5952.76,2047.24 
  "/>
<polyline clip-path="url(#clip600)" style="stroke:#000000; stroke-linecap:round; stroke-linejoin:round; stroke-width:4; stroke-opacity:1; fill:none" points="
  4110.24,3889.76 4110.24,2047.24 
  "/>
<polyline clip-path="url(#clip600)" style="stroke:#000000; stroke-linecap:round; stroke-linejoin:round; stroke-width:4; stroke-opacity:1; fill:none" points="
  5952.76,3889.76 5952.76,2047.24 
  "/>
<polyline clip-path="url(#clip607)" style="stroke:#009af9; stroke-linecap:round; stroke-linejoin:round; stroke-width:8; stroke-opacity:0.6; fill:none" points="
  4883.3,3842.59 4903.75,3841.52 4913.32,3806.22 4849.05,3830.76 4868.49,3826.61 4843.95,3846.82 4822.06,3831.23 4843.59,3802.22 4829.34,3812.82 4804.16,3812.5 
  4809.32,3798.67 4831.62,3766.05 4741.64,3877.16 4779.54,3843.91 4810,3813.33 4796.16,3832.13 4827.16,3814.78 4792.18,3854.33 4812.28,3821.62 4829.57,3847.56 
  4839.94,3844.07 4826.82,3846.56 4872.76,3804.32 4845.5,3832.85 4850.93,3835.9 4848.45,3827.52 4821.71,3851.53 4866.31,3801.14 4821.86,3860.84 4830.55,3838.5 
  4821.56,3841.81 4840.64,3803.06 4807.92,3849.88 4817.35,3821.82 4815.12,3808.33 4798.69,3833.98 4838.22,3806.6 4815.45,3840.67 4828.03,3826.69 4849.92,3816.03 
  4867.69,3791.23 4878.25,3786.43 4788.46,3866.36 4803.82,3829.74 4776.57,3822.78 4772.43,3823.67 4737.32,3863.01 4732.73,3848.78 4747.55,3832.32 4716.01,3861.14 
  4768.31,3829.86 4752.55,3827.79 4714.36,3840.62 4726.74,3835.96 4738.41,3812.39 4728.1,3828.52 4741.75,3813.18 4748.01,3805.73 4682.36,3865.32 4711.11,3840.93 
  4759.3,3788.79 4725.49,3812.9 4739.8,3808.19 4712.99,3802.21 4722.16,3820.34 4678.84,3859.38 4682.28,3846.16 4692.16,3831.28 4673.18,3842.27 4645.34,3837.59 
  4697.94,3791.16 4716.19,3774.36 4722.18,3797.39 4627.1,3822.18 4585.19,3833.12 4588.6,3812.09 4552.63,3835.9 4574.62,3832.13 4624.62,3806.02 4616.78,3803.13 
  4564.93,3839.54 4595.96,3778.77 4565.12,3807.2 4618.99,3774.65 4619.96,3770.2 4550.22,3837.22 4585.57,3803.71 4554.91,3833.6 4595.02,3796 4600.33,3783.4 
  4551.61,3801.73 4544.51,3810.24 4576.99,3797.01 4571.49,3783.89 4506.22,3826.97 4544.71,3783.56 4604.36,3764.95 4582.77,3807.59 4564.24,3790.94 4547.74,3811.44 
  4577.12,3811.57 4552.81,3825.27 4576.57,3807.4 4585.44,3831.23 4576.11,3831.99 4621.43,3774.55 4590.92,3807.95 4589.25,3823.35 4599.6,3816.33 4645.21,3778.87 
  4545.29,3815.53 4585.46,3771.09 4551.07,3835.87 4603.11,3754.05 4578.6,3746.31 4615.04,3733.18 4719.42,3648.39 4605.82,3757.81 4645.89,3699.63 4680.95,3679.37 
  4606.55,3775.54 4628.7,3732.38 4618.48,3751.83 4620.21,3734.2 4612.19,3769.12 4719.73,3685.86 4611.97,3810.08 4672.96,3752.62 4681.96,3742.96 4614.67,3805.63 
  4668.87,3762.08 4634.02,3799.14 4680.57,3747.24 4691.11,3730.86 4656.42,3765.93 4709.55,3725.15 4796.2,3645.36 4727.22,3726.54 4726.44,3735.29 4772.73,3705.55 
  4781.44,3710.37 4782.3,3698.64 4812.08,3674.08 4840.42,3699.01 4738.67,3792.35 4837.23,3686.92 4800.14,3724.42 4806.2,3710.74 4838.37,3685.95 4891.65,3667.29 
  4897.85,3654.87 4940.47,3637.5 4973.78,3636.84 4959.14,3626.56 5059.59,3595.35 4989.31,3664.42 5003.69,3643.99 5093.46,3606.22 5008.45,3697.29 5104.34,3617.64 
  5194.01,3543.73 5278.41,3488.33 5297.14,3492.98 5276.93,3526.91 5207.52,3636.12 5380.37,3470.57 5323.32,3587.95 5384.7,3557 5430.85,3545.09 5514.53,3480.38 
  5564.18,3407.2 5556.82,3415.19 5502.76,3444.58 5635.29,3361.47 5761.53,3292.74 5728.06,3351.07 5839.28,3264.96 6000.19,3149.26 6010.33,3194.8 6000.9,3268.27 
  6243.58,3070.26 6185.5,3167.29 6369.42,3066.95 6535.38,2929.85 6701.93,2806.8 6674.54,2867.22 6751.9,2828.47 6791.36,2814.59 7045,2538.59 7246.27,2416.08 
  7330.17,2422.27 7709.39,2092.59 7841.65,2074.37 8227.24,1748.38 8201.42,1820.29 8435.72,1693.05 8396.15,1816.92 8653.35,1634.24 8763.95,1625.81 8748.1,1673.56 
  9006.41,1471.2 9234.12,1303.22 9318.51,1244.99 9545.77,1044.64 9569.85,1089.34 9612.9,1088.22 9869.9,898.989 9869.92,944.711 9997.8,809.322 10036.6,830.422 
  10120.5,814.128 
  "/>
<circle clip-path="url(#clip607)" cx="4883.3" cy="3842.59" r="18" fill="#009af9" fill-rule="evenodd" fill-opacity="1" stroke="#000000" stroke-opacity="1" stroke-width="8"/>
<path clip-path="url(#clip600)" d="
M6110.24 1889.76 L7952.76 1889.76 L7952.76 47.2441 L6110.24 47.2441  Z
  " fill="#ffffff" fill-rule="evenodd" fill-opacity="1"/>
<defs>
  <clipPath id="clip608">
    <rect x="6110" y="47" width="1844" height="1844"/>
  </clipPath>
</defs>
<polyline clip-path="url(#clip600)" style="stroke:#000000; stroke-linecap:round; stroke-linejoin:round; stroke-width:4; stroke-opacity:1; fill:none" points="
  6110.24,1889.76 7952.76,1889.76 
  "/>
<polyline clip-path="url(#clip600)" style="stroke:#000000; stroke-linecap:round; stroke-linejoin:round; stroke-width:4; stroke-opacity:1; fill:none" points="
  6110.24,47.2441 7952.76,47.2441 
  "/>
<polyline clip-path="url(#clip600)" style="stroke:#000000; stroke-linecap:round; stroke-linejoin:round; stroke-width:4; stroke-opacity:1; fill:none" points="
  6110.24,1889.76 6110.24,47.2441 
  "/>
<polyline clip-path="url(#clip600)" style="stroke:#000000; stroke-linecap:round; stroke-linejoin:round; stroke-width:4; stroke-opacity:1; fill:none" points="
  7952.76,1889.76 7952.76,47.2441 
  "/>
<polyline clip-path="url(#clip608)" style="stroke:#009af9; stroke-linecap:round; stroke-linejoin:round; stroke-width:20; stroke-opacity:1; fill:none" points="
  6110.24,1867.54 6119.01,1857.3 6127.78,1851.19 6136.56,1863.28 6145.33,1865.19 6154.11,1861.62 6162.88,1840.39 6171.65,1856.65 6180.43,1868.85 6189.2,1843.26 
  6197.98,1858.66 6206.75,1862.59 6215.52,1874.03 6224.3,1847.19 6233.07,1859.13 6241.84,1858.34 6250.62,1874.35 6259.39,1840.82 6268.17,1854.14 6276.94,1848.87 
  6285.71,1861.43 6294.49,1864.82 6303.26,1863.89 6312.04,1862.65 6320.81,1852.32 6329.58,1857.39 6338.36,1866.22 6347.13,1865.76 6355.91,1860.81 6364.68,1860.52 
  6373.45,1874.44 6382.23,1851.91 6391,1846.05 6399.78,1866.29 6408.55,1866.71 6417.32,1853.67 6426.1,1834.01 6434.87,1832.89 6443.64,1849.09 6452.42,1837.35 
  6461.19,1859.61 6469.97,1853.96 6478.74,1856.38 6487.51,1842.49 6496.29,1845.22 6505.06,1847.74 6513.84,1859.24 6522.61,1840.35 6531.38,1836.79 6540.16,1850.27 
  6548.93,1849.67 6557.71,1854.05 6566.48,1861.52 6575.25,1835.88 6584.03,1863.86 6592.8,1827.59 6601.57,1848.64 6610.35,1864.4 6619.12,1854.21 6627.9,1868.39 
  6636.67,1860.23 6645.44,1844.33 6654.22,1840.58 6662.99,1855.6 6671.77,1852.55 6680.54,1845.07 6689.31,1832.96 6698.09,1862.02 6706.86,1851.1 6715.64,1849.05 
  6724.41,1852.31 6733.18,1852.16 6741.96,1865.99 6750.73,1843.05 6759.51,1852.2 6768.28,1859.43 6777.05,1858.48 6785.83,1848.23 6794.6,1840.31 6803.37,1848.16 
  6812.15,1853.49 6820.92,1863.82 6829.7,1843.12 6838.47,1839.1 6847.24,1854.23 6856.02,1850.43 6864.79,1862.36 6873.57,1866.93 6882.34,1847.65 6891.11,1857.91 
  6899.89,1868.98 6908.66,1848.99 6917.44,1860.06 6926.21,1840.93 6934.98,1847.56 6943.76,1860.16 6952.53,1833.74 6961.3,1849.88 6970.08,1851.15 6978.85,1827.74 
  6987.63,1866.7 6996.4,1835.88 7005.17,1846.18 7013.95,1841.43 7022.72,1853.87 7031.5,1831.75 7040.27,1846.8 7049.04,1858.06 7057.82,1854.71 7066.59,1832.27 
  7075.37,1850.8 7084.14,1841.94 7092.91,1860.48 7101.69,1849.52 7110.46,1860.82 7119.24,1853.5 7128.01,1831.21 7136.78,1863.71 7145.56,1843.55 7154.33,1834.61 
  7163.1,1847.27 7171.88,1846.53 7180.65,1837.17 7189.43,1849.78 7198.2,1824.12 7206.97,1842.98 7215.75,1839.49 7224.52,1823.76 7233.3,1831.07 7242.07,1852.24 
  7250.84,1840.48 7259.62,1851.84 7268.39,1865.81 7277.17,1843.06 7285.94,1855.53 7294.71,1834.89 7303.49,1860.1 7312.26,1835.62 7321.03,1848.29 7329.81,1854.8 
  7338.58,1844.37 7347.36,1824.89 7356.13,1841.9 7364.9,1839.33 7373.68,1853.82 7382.45,1861.18 7391.23,1856 7400,1831.94 7408.77,1842.57 7417.55,1802.75 
  7426.32,1828.9 7435.1,1851.79 7443.87,1831.26 7452.64,1834.65 7461.42,1846.84 7470.19,1810.43 7478.97,1837.93 7487.74,1830.92 7496.51,1837.76 7505.29,1838.97 
  7514.06,1842.21 7522.83,1835.43 7531.61,1840.3 7540.38,1849.06 7549.16,1780.07 7557.93,1808.63 7566.7,1839.79 7575.48,1830.25 7584.25,1797.94 7593.03,1805.67 
  7601.8,1813.14 7610.57,1787.84 7619.35,1804.68 7628.12,1792.78 7636.9,1771.3 7645.67,1801.06 7654.44,1747.27 7663.22,1771.57 7671.99,1731.95 7680.76,1711.7 
  7689.54,1730.99 7698.31,1723.97 7707.09,1674.07 7715.86,1634.8 7724.63,1654.22 7733.41,1638.66 7742.18,1586.99 7750.96,1518.77 7759.73,1543.97 7768.5,1470.25 
  7777.28,1452.33 7786.05,1432.59 7794.83,1340.31 7803.6,1182.1 7812.37,1112.93 7821.15,1136.13 7829.92,1105.23 7838.7,1025.02 7847.47,949.221 7856.24,832.159 
  7865.02,806.151 7873.79,754.605 7882.56,753.627 7891.34,715.548 7900.11,661.522 7908.89,625.662 7917.66,601.696 7926.43,594.629 7935.21,584.939 7943.98,528.324 
  7952.76,410.04 
  "/>
<polyline clip-path="url(#clip608)" style="stroke:#e26f46; stroke-linecap:round; stroke-linejoin:round; stroke-width:20; stroke-opacity:1; fill:none" points="
  6110.24,1076.06 6119.01,1071.84 6127.78,1068.83 6136.56,1068.6 6145.33,1069.36 6154.11,1069.16 6162.88,1062.93 6171.65,1068.17 6180.43,1076.4 6189.2,1064.13 
  6197.98,1070.37 6206.75,1068.83 6215.52,1071.56 6224.3,1067.89 6233.07,1068.05 6241.84,1069.45 6250.62,1073.43 6259.39,1061.39 6268.17,1063.47 6276.94,1059.92 
  6285.71,1060.66 6294.49,1064.65 6303.26,1068.24 6312.04,1072.54 6320.81,1066.63 6329.58,1068.87 6338.36,1071.62 6347.13,1069.83 6355.91,1071.97 6364.68,1074.84 
  6373.45,1077.23 6382.23,1068.19 6391,1064.48 6399.78,1072.38 6408.55,1073.19 6417.32,1066.7 6426.1,1064.81 6434.87,1067.61 6443.64,1072.49 6452.42,1066.09 
  6461.19,1066.31 6469.97,1067.74 6478.74,1067.09 6487.51,1063.61 6496.29,1067.52 6505.06,1070.99 6513.84,1070.87 6522.61,1062.43 6531.38,1059.99 6540.16,1064.03 
  6548.93,1066.08 6557.71,1071.64 6566.48,1074.36 6575.25,1071.72 6584.03,1079.91 6592.8,1072.09 6601.57,1073.7 6610.35,1079.79 6619.12,1075.21 6627.9,1080.2 
  6636.67,1080.67 6645.44,1077.47 6654.22,1075.74 6662.99,1078.25 6671.77,1072.21 6680.54,1073.38 6689.31,1069.6 6698.09,1077.44 6706.86,1075.62 6715.64,1076.26 
  6724.41,1076.4 6733.18,1077.42 6741.96,1079.65 6750.73,1069.82 6759.51,1073.09 6768.28,1076.09 6777.05,1074.5 6785.83,1074.01 6794.6,1071.32 6803.37,1074.17 
  6812.15,1076.61 6820.92,1083.45 6829.7,1085.19 6838.47,1082.88 6847.24,1092.98 6856.02,1085.3 6864.79,1084.75 6873.57,1083.6 6882.34,1078.19 6891.11,1085.14 
  6899.89,1090.15 6908.66,1083.49 6917.44,1083.29 6926.21,1073.72 6934.98,1074.98 6943.76,1077.58 6952.53,1067.95 6961.3,1073.65 6970.08,1078.49 6978.85,1075.75 
  6987.63,1090.78 6996.4,1082.25 7005.17,1088.24 7013.95,1093.91 7022.72,1096.46 7031.5,1090.91 7040.27,1095.26 7049.04,1094.51 7057.82,1096.36 7066.59,1085.77 
  7075.37,1090.62 7084.14,1085.26 7092.91,1091.98 7101.69,1083.86 7110.46,1082.81 7119.24,1074.87 7128.01,1072.35 7136.78,1081.39 7145.56,1072.79 7154.33,1070.55 
  7163.1,1078.73 7171.88,1078.15 7180.65,1073.13 7189.43,1074.57 7198.2,1069.96 7206.97,1074.35 7215.75,1070.02 7224.52,1065.85 7233.3,1068.43 7242.07,1076.19 
  7250.84,1074.28 7259.62,1075.25 7268.39,1080.2 7277.17,1073.87 7285.94,1079.14 7294.71,1072.5 7303.49,1077.12 7312.26,1070.86 7321.03,1071.25 7329.81,1075.1 
  7338.58,1071.18 7347.36,1064.51 7356.13,1067.21 7364.9,1065.88 7373.68,1071.04 7382.45,1072.52 7391.23,1073.4 7400,1064.57 7408.77,1070.63 7417.55,1056.05 
  7426.32,1066.25 7435.1,1069.1 7443.87,1064.36 7452.64,1066.04 7461.42,1075.1 7470.19,1059.65 7478.97,1067.56 7487.74,1067.91 7496.51,1075.64 7505.29,1074.76 
  7514.06,1074.16 7522.83,1071.6 7531.61,1076.39 7540.38,1079.21 7549.16,1059.54 7557.93,1065.78 7566.7,1073.63 7575.48,1069.95 7584.25,1057.13 7593.03,1061.3 
  7601.8,1056.99 7610.57,1045.12 7619.35,1046.65 7628.12,1041.86 7636.9,1033.49 7645.67,1040.07 7654.44,1022.65 7663.22,1027.33 7671.99,1015.39 7680.76,1002.85 
  7689.54,1005.63 7698.31,996.413 7707.09,975.93 7715.86,960.728 7724.63,958.651 7733.41,950.352 7742.18,931.236 7750.96,908.31 7759.73,913.539 7768.5,889.433 
  7777.28,878.561 7786.05,864.562 7794.83,827.539 7803.6,781.682 7812.37,751.826 7821.15,749.201 7829.92,731.794 7838.7,706.096 7847.47,680.083 7856.24,639.139 
  7865.02,619.942 7873.79,589.464 7882.56,574.682 7891.34,558.148 7900.11,533.516 7908.89,515.982 7917.66,504.126 7926.43,487.659 7935.21,487.062 7943.98,459.765 
  7952.76,416.787 
  "/>
<path clip-path="url(#clip600)" d="
M6110.24 3889.76 L7952.76 3889.76 L7952.76 2047.24 L6110.24 2047.24  Z
  " fill="#ffffff" fill-rule="evenodd" fill-opacity="1"/>
<defs>
  <clipPath id="clip609">
    <rect x="6110" y="2047" width="1844" height="1844"/>
  </clipPath>
</defs>
<polyline clip-path="url(#clip600)" style="stroke:#000000; stroke-linecap:round; stroke-linejoin:round; stroke-width:4; stroke-opacity:1; fill:none" points="
  6110.24,3889.76 7952.76,3889.76 
  "/>
<polyline clip-path="url(#clip600)" style="stroke:#000000; stroke-linecap:round; stroke-linejoin:round; stroke-width:4; stroke-opacity:1; fill:none" points="
  6110.24,2047.24 7952.76,2047.24 
  "/>
<polyline clip-path="url(#clip600)" style="stroke:#000000; stroke-linecap:round; stroke-linejoin:round; stroke-width:4; stroke-opacity:1; fill:none" points="
  6110.24,3889.76 6110.24,2047.24 
  "/>
<polyline clip-path="url(#clip600)" style="stroke:#000000; stroke-linecap:round; stroke-linejoin:round; stroke-width:4; stroke-opacity:1; fill:none" points="
  7952.76,3889.76 7952.76,2047.24 
  "/>
<polyline clip-path="url(#clip609)" style="stroke:#009af9; stroke-linecap:round; stroke-linejoin:round; stroke-width:8; stroke-opacity:0.6; fill:none" points="
  6549.85,3840.87 6580.79,3818.35 6602.87,3804.9 6604.51,3831.5 6598.99,3835.71 6600.47,3827.84 6646.12,3781.14 6607.71,3816.92 6547.33,3843.75 6637.32,3787.44 
  6591.59,3821.33 6602.82,3829.99 6582.83,3855.14 6609.73,3796.1 6608.61,3822.38 6598.34,3820.64 6569.11,3855.86 6657.45,3782.09 6642.19,3811.39 6668.19,3799.8 
  6662.78,3827.43 6633.54,3834.88 6607.21,3832.84 6575.67,3830.1 6618.99,3807.39 6602.59,3818.54 6582.43,3837.98 6595.56,3836.96 6579.83,3826.06 6558.76,3825.43 
  6541.28,3856.04 6607.54,3806.49 6634.78,3793.6 6576.84,3838.12 6570.9,3839.05 6618.49,3810.37 6632.34,3767.11 6611.81,3764.64 6576.01,3800.29 6622.93,3774.45 
  6621.36,3823.42 6610.82,3810.99 6615.65,3816.32 6641.13,3785.75 6612.47,3791.77 6587.02,3797.31 6587.87,3822.61 6649.82,3781.05 6667.66,3773.23 6638.09,3802.89 
  6622.99,3801.55 6582.24,3811.19 6562.33,3827.63 6581.67,3771.21 6521.62,3832.78 6578.96,3752.97 6567.15,3799.3 6522.49,3833.97 6556.04,3811.54 6519.46,3842.74 
  6516.05,3824.79 6539.47,3789.81 6552.16,3781.56 6533.8,3814.61 6578.11,3807.9 6569.5,3791.43 6597.18,3764.8 6539.73,3828.73 6553.04,3804.7 6548.4,3800.18 
  6547.38,3807.36 6539.88,3807.03 6523.48,3837.46 6595.57,3787 6571.65,3807.12 6549.62,3823.03 6561.28,3820.94 6564.88,3798.39 6584.58,3780.96 6563.68,3798.24 
  6545.81,3809.96 6495.61,3832.69 6482.89,3787.14 6499.82,3778.29 6425.77,3811.6 6482.05,3803.24 6486.15,3829.48 6494.57,3839.52 6534.23,3797.12 6483.23,3819.68 
  6446.49,3844.03 6495.36,3800.07 6496.8,3824.41 6567.03,3782.33 6557.72,3796.91 6538.67,3824.64 6609.33,3766.51 6567.49,3802.02 6532.01,3804.81 6552.12,3753.31 
  6441.91,3839.01 6504.45,3771.21 6460.55,3793.89 6418.95,3783.43 6400.21,3810.79 6440.96,3762.13 6409.06,3795.23 6414.51,3820.02 6400.94,3812.65 6478.67,3763.28 
  6443.03,3804.05 6482.36,3784.56 6433.08,3825.35 6492.6,3801.22 6500.37,3826.08 6558.56,3809.98 6577.02,3760.95 6510.78,3832.43 6573.85,3788.09 6590.27,3768.42 
  6530.22,3796.28 6534.53,3794.64 6571.33,3774.05 6560.74,3801.8 6594.56,3745.36 6562.39,3786.84 6594.17,3779.17 6624.69,3744.55 6605.79,3760.63 6548.9,3807.2 
  6562.89,3781.34 6555.75,3806.32 6519.5,3837.06 6565.92,3787.01 6527.28,3814.44 6575.97,3769.03 6542.03,3824.49 6587.97,3770.65 6585.08,3798.52 6556.84,3812.84 
  6585.65,3789.91 6634.57,3747.03 6614.74,3784.47 6624.52,3778.82 6586.65,3810.68 6575.78,3826.89 6569.37,3815.49 6634.11,3762.55 6589.68,3785.95 6696.6,3698.34 
  6621.75,3755.87 6600.86,3806.21 6635.64,3761.06 6623.29,3768.52 6556.86,3795.33 6670.18,3715.23 6612.2,3775.74 6609.62,3760.31 6552.94,3775.35 6559.35,3778.03 
  6563.81,3785.14 6582.52,3770.23 6547.41,3780.95 6526.72,3800.21 6670.96,3648.43 6625.23,3711.27 6567.65,3779.82 6594.65,3758.84 6688.63,3687.75 6658.09,3704.76 
  6689.66,3721.2 6776.74,3665.54 6765.53,3702.59 6800.67,3676.4 6862.05,3629.14 6813.79,3694.63 6941.53,3576.28 6907.2,3629.75 6994.73,3542.57 7086.72,3498.02 
  7066.35,3540.45 7133.92,3525.02 7284.13,3415.25 7395.61,3328.85 7410.84,3371.57 7471.7,3337.34 7611.88,3223.66 7780,3073.58 7741.66,3129.01 7918.43,2966.82 
  7998.16,2927.42 8100.83,2883.98 8372.32,2680.96 8708.61,2332.9 8927.55,2180.72 8946.8,2231.76 9074.45,2163.79 9262.91,1987.32 9453.67,1820.57 9753.93,1563.03 
  9894.7,1505.82 10118.2,1392.41 10226.6,1390.26 10347.9,1306.49 10528.5,1187.63 10657.1,1108.74 10744,1056.01 10864.8,1040.47 10869.2,1019.15 11069.3,894.595 
  11384.5,634.371 
  "/>
<circle clip-path="url(#clip609)" cx="6549.85" cy="3840.87" r="18" fill="#009af9" fill-rule="evenodd" fill-opacity="1" stroke="#000000" stroke-opacity="1" stroke-width="8"/>
</svg>
