
Intensity Median
 ==================== 
Time [s],1000000000,1000000001,1000000002,1000000003,1000000004,1000000005,1000000006,
0.000000,439.05,455.94,517.552,470.992,493.55,463.066,445.042,
1.000000,441.485,472.994,534.54,472.035,483.018,482.023,446.98,
2.000000,463.016,479.984,531.068,495.968,543.06,472.025,462.984,
3.000000,485.028,530.096,578.041,587.93,576.036,531.486,546.044,
4.000000,540,761.16,691.9,781.023,759.096,608.008,667.12,
5.000000,586.95,1020.77,892.289,1066.97,626.005,786.716,870.222,
6.000000,710.992,879.117,1047.63,1053.36,854.71,735.121,951.88,
7.000000,766.1,1132.56,823.519,819.817,875.932,761.067,828.925,
8.000000,742.84,1214.62,841.12,818.828,727.043,818.1,904.341,
9.000000,759.452,1200.3,1703.87,857.256,800.5,832.98,876.027,
10.000000,714.14,1097.12,1016.12,794.144,775.255,812.207,836.283,
11.000000,728.5,1107.14,979.44,793.204,745.237,925.66,804.314,
12.000000,793.117,912.528,1007.65,860.1,741.284,973.036,728.2,
13.000000,731.125,986.536,1047.72,783.896,720.912,897.294,750.792,
14.000000,726.963,1051.89,991.465,772.896,709.768,874.994,699.102,
15.000000,659.068,1119.72,958.677,725.988,656.256,724.094,613.288,
16.000000,627.074,879.016,834.681,690.88,611.108,660.008,594.848,
17.000000,593.083,882.124,801.155,656.052,585.87,603.968,688.908,
18.000000,560.984,765.611,747,660.94,586.012,555.992,659.035,
19.000000,543.011,739.952,717.968,648.088,627.052,557.9,617.9,
20.000000,546.984,696.876,774.9,622.992,687.799,548.96,651.096,
21.000000,567.064,784.15,874.288,601.048,793.021,606.01,672.986,
22.000000,589.454,819.83,855.076,664.884,913.812,652.11,793.148,
23.000000,674.144,833.311,1012.78,820.976,1039.39,769.898,923.156,
24.000000,760.12,835.075,927.976,870.307,735.271,794.138,815.158,
25.000000,840.034,900.396,918.593,914.32,776.644,865.072,711.848,
26.000000,889.208,884.488,937.477,858.792,682.743,865.784,782.392,
27.000000,936.912,827.01,849.765,858.92,602.028,831.072,783.256,
28.000000,885.09,767.94,874.656,837.12,624.75,745.04,795.302,
29.000000,855.156,735.084,840.547,885.231,641.988,693.079,816.186,
30.000000,858.105,645.98,826.16,882.208,606.992,723.424,730.977,
31.000000,812.771,691.896,786.224,825.245,664.784,691.9,687.986,
32.000000,741.464,675.146,765,792.196,625.164,720.247,723.176,
33.000000,737.96,700.984,808.351,790.162,633.144,675.007,773.104,
34.000000,699.5,688.094,726.056,758.128,602.016,653.177,731.107,
35.000000,651.056,667.889,684.864,777.174,606.128,586.99,661.9,
36.000000,616.048,610.882,790.311,716.06,565.83,598.92,637.066,
37.000000,607,592.129,708.212,691.099,642.95,555.96,666.768,
38.000000,583,611.89,714.12,729.968,634.002,556.9,705.449,
39.000000,599,565.982,679.064,729.95,725.126,572.072,688.064,
40.000000,643.03,532.013,725,755.933,770.683,585.978,705.884,
41.000000,684.088,521.016,706.188,830.114,833.553,581.96,809.968,
42.000000,711.864,498.934,819.24,883.956,982.677,594.896,865.075,
43.000000,791,485.988,867.62,944.128,1020.51,612.144,924.114,
44.000000,798,487.047,1008.88,973.76,1113.74,735.984,924.725,
45.000000,741.068,493,1021.24,927,1143.2,777.08,885.119,
46.000000,712.98,495.01,985.756,831.18,864.826,742.52,909.511,
47.000000,704.965,507.95,939.198,845.96,768.76,738.04,855.735,
48.000000,703.502,507.472,884.788,821.856,787.184,741.316,873.165,
49.000000,646.99,533,909.835,783.05,786.872,749.526,913.031,
50.000000,691,517.6,928.152,839.956,808.145,689.442,810.967,
51.000000,670.086,530.52,850.13,713,723.782,756.98,780.024,
52.000000,674.08,515.978,710.167,701.1,759.05,709.012,766.04,
53.000000,640.955,533.008,782.128,690.064,732.208,724.902,722.552,
54.000000,631.056,517,782.958,661.038,645.2,689.96,672.176,
55.000000,627.96,498.038,854.928,623.112,747.996,651,691.953,
56.000000,607.956,470.031,797.122,637.968,678.136,639.062,709.456,
57.000000,611.92,476.018,772.14,614.92,704.028,651.998,675.44,
58.000000,570.102,448.009,763.724,590,656.25,637.014,685.896,
59.000000,644.15,445.004,838.114,621.025,779.096,696.96,730.16,
60.000000,615.989,452.047,807.98,645.98,827.98,677.1,752.998,
61.000000,680.032,460.95,949.076,674.016,836.506,701.071,756.628,
62.000000,694.962,457.966,819.888,692.156,893.092,716.084,792.815,
63.000000,666.872,464.002,782.972,736.944,730.217,737.985,785.218,
64.000000,743.038,480.976,858.972,650.064,734.972,706.996,772.028,
65.000000,693.928,475.992,909.788,676.872,717.892,732.087,762.851,
66.000000,711,474.028,821.9,674.028,758.072,695,772.936,
67.000000,702.052,471.034,780.072,694,770.12,709.085,750.108,
68.000000,685.528,490.972,765.172,650,759.14,654.11,814.896,
69.000000,644.987,481.992,743.846,676.08,767.184,611,732.962,
70.000000,637.98,467.507,727.3,647.096,675.9,579.088,759.856,
71.000000,691.083,471.004,725.904,634.944,678.107,587.072,658.988,
72.000000,614.125,453.94,761.015,596.068,696.968,600.04,691.128,
73.000000,599.052,446.008,739.12,607,711.869,585.11,700.107,
74.000000,587.101,436.982,682.169,585.04,683.928,573.936,711.98,
75.000000,582.128,444.02,746.96,579.044,710.04,562.03,662.492,
76.000000,582.952,434.987,732.184,606.096,702.4,603.052,695.088,
77.000000,620.03,441,641.98,610.967,723.824,613.933,683.984,
78.000000,583.904,433.525,721.17,639.091,770.532,642.925,698.944,
79.000000,611.816,436.992,775.199,619.94,772.522,623.943,744.06,
80.000000,661.026,447.504,774.077,645.05,767.968,617.008,753.22,
81.000000,616.09,442.019,711.18,659.976,811.06,597.008,761.04,
82.000000,610.95,438.03,693.472,662.128,803.996,604.948,754.964,
83.000000,627.952,445.038,671.985,625.056,737.821,636.994,754.234,
84.000000,620.912,450.024,692.072,607.006,760.194,648.096,748.937,
85.000000,622.948,432.996,732.864,602.059,769.138,633.926,686.938,
86.000000,632.54,443.042,659.984,631.018,746.044,625.992,719.978,
87.000000,609,452.512,677.008,598.99,729.246,606.91,678.957,
88.000000,581.988,434.524,721,588.954,733.904,577.992,659.94,
89.000000,536.02,443,663.94,599.904,715.208,581.986,612.136,
90.000000,548.946,439.98,641.072,577.168,666.99,591.98,608.979,
91.000000,538.004,437.498,707.04,597.916,688.033,561.951,625.944,
92.000000,527.019,434.986,617.504,583.94,659.17,544.051,615.508,
93.000000,537.061,434.003,640.104,569.016,672.15,535.942,610.919,
94.000000,570.06,438.004,639.98,560.068,652.073,572.972,622.006,
95.000000,558.972,427.96,657.48,544.06,691.944,560.011,643.972,
