Frame number,1000000000,1000000001,1000000002,
0.000000,1039.82,654.003,518.04,
1.000000,778.13,614.008,530.964,
2.000000,727.863,586.972,555.992,
3.000000,711.833,642.941,611.03,
4.000000,725.81,770.977,716.58,
5.000000,801.046,855.045,752.125,
6.000000,778.46,957.043,785.518,
7.000000,732.988,955.369,821.996,
8.000000,740.513,975.39,760.894,
9.000000,711.984,864.072,680.584,
10.000000,678.089,785.941,669.85,
11.000000,645.351,713.418,626.048,
12.000000,627.908,657.99,568.043,
13.000000,604.454,643.54,546.965,
14.000000,595.972,613.099,529.48,
15.000000,601.075,584.936,503.492,
16.000000,598.063,576.925,501.501,
17.000000,594.007,536.991,479.475,
18.000000,575.013,503.1,495.49,
19.000000,553.089,543.026,495,
20.000000,538.029,550.015,517.02,
21.000000,582.044,560.986,535.994,
22.000000,604.522,639.064,574.516,
23.000000,632.485,625.256,600.504,
24.000000,657.944,682.008,638.088,
25.000000,666.362,713.96,624.53,
26.000000,716.982,691.607,643.936,
27.000000,763.974,698.436,633.488,
28.000000,735.44,711.048,617.973,
29.000000,720.49,661.903,584.986,
30.000000,652.6,629.48,547.52,
31.000000,621.012,597.52,533.986,
32.000000,615.551,552.52,512.96,
33.000000,555.996,540.958,490.504,
34.000000,527.008,559.02,499.474,
35.000000,515.065,512.518,489.52,
36.000000,518.966,539.021,472.008,
37.000000,512.988,517.97,483.5,
38.000000,512.961,514.989,482.996,
39.000000,545.536,499.496,493.975,
40.000000,557.022,534.507,508.025,
41.000000,573.03,555.536,538.52,
42.000000,603.09,553.944,560.051,
43.000000,611.938,580.023,598.466,
44.000000,616.512,573,620,
45.000000,644.971,609.53,595.035,
46.000000,619.494,624.502,585.52,
47.000000,630.532,624.993,601.989,
48.000000,619.037,597.03,558.056,
49.000000,594.89,605.044,532.474,
50.000000,576.424,574.92,513.984,
51.000000,541.534,577.432,510.986,
52.000000,531.508,586.511,489.497,
53.000000,522.5,549.48,484.524,
54.000000,517.016,523.956,482,
55.000000,506.475,517.998,474.97,
56.000000,514.06,514.484,471.99,
57.000000,507.482,512.52,461.5,
58.000000,510.996,511.992,476.52,
59.000000,514.961,507.464,478.976,
60.000000,517.544,508.038,481.999,
61.000000,545.997,510.003,511.049,
62.000000,546.004,522.06,532.017,
63.000000,553.039,547.986,543.988,
64.000000,585.548,564.539,546.944,
65.000000,609.068,572.52,546.952,
66.000000,610,576.988,549.968,
67.000000,593.504,581.932,539.964,
68.000000,596.52,558.475,529.018,
69.000000,598.048,548.484,516.026,
70.000000,610.068,545.96,500.936,
71.000000,568.052,520.99,488.012,
72.000000,576.088,532.986,490.981,
73.000000,570.984,531.478,480.99,
74.000000,525.96,505.078,469.008,
75.000000,518.05,496.998,464.004,
76.000000,525.981,482.99,469,
77.000000,503.995,484.93,459.99,
78.000000,511.98,491.018,467.512,
79.000000,503.029,516.996,468.01,
80.000000,532.96,529.077,492.003,
81.000000,530.034,501.028,497.989,
82.000000,564.976,540.982,511.013,
83.000000,572.532,536.98,509.493,
84.000000,592.53,552.954,518.01,
85.000000,574.014,544.98,515.973,
86.000000,585.958,528.01,530.48,
87.000000,566.94,546.958,512,
88.000000,569.028,551.034,506.009,
89.000000,541.482,522.006,510.524,
90.000000,557.07,509.044,501.984,
91.000000,506.962,502.027,493,
92.000000,561.016,494.988,477.52,
93.000000,527.508,505.039,489.968,
94.000000,502.533,492.964,474.5,
95.000000,529.08,488.98,468.498,
96.000000,521.508,503.946,459.496,
