Time [ms],1000000000,1000000001,
0,686.314,751.476,
1000000000,743.97,646.665,
2000000000,1434.58,817.3,
3000000000,1910.68,1176.38,
4000000000,2207.04,1440.67,
5000000000,2113.08,1799.11,
6000000000,2111.29,1834.31,
7000000000,2047.54,1663.2,
8000000000,1980.99,1527.13,
9000000000,1611.35,1345.44,
10000000000,1476.83,1260.01,
11000000000,1224.14,1232.17,
12000000000,1084.07,1079.86,
13000000000,1010.68,1053.64,
14000000000,883.864,905.09,
15000000000,824.632,805.408,
16000000000,780.992,793.352,
17000000000,721,742.462,
18000000000,738,736.906,
19000000000,737.496,690.106,
20000000000,817.08,726.08,
21000000000,947.016,831.104,
22000000000,1129.01,924.724,
23000000000,1197.78,968.134,
24000000000,1315.86,927.152,
25000000000,1191.25,942.024,
26000000000,1163.82,864.06,
27000000000,1021.15,853.08,
28000000000,901.792,768.016,
29000000000,848.955,703.088,
30000000000,806.018,705.912,
31000000000,780.488,676.942,
32000000000,696,637.028,
33000000000,654.016,593.112,
34000000000,649,601.112,
35000000000,619.04,565.012,
36000000000,633.992,594.95,
37000000000,638,603,
38000000000,686.1,625.996,
39000000000,686.833,644.856,
40000000000,720.958,666.074,
41000000000,751.536,686.96,
42000000000,784.16,700,
43000000000,795,671.982,
44000000000,773.48,663.092,
45000000000,771.984,642.944,
46000000000,703.492,625.008,
47000000000,684.436,581.001,
48000000000,653.872,590.6,
49000000000,640.048,589.934,
50000000000,613.02,521.975,
51000000000,603.952,552.448,
52000000000,576,545.024,
53000000000,568.048,536.973,
54000000000,553.022,544.465,
55000000000,552.96,534.974,
56000000000,567.968,546.949,
57000000000,583.964,553.498,
58000000000,601.928,561.536,
59000000000,636.056,571.46,
60000000000,659.039,597.008,
61000000000,646.037,575.006,
62000000000,631.966,569.992,
63000000000,621.084,566.983,
64000000000,615.032,571.977,
65000000000,603.056,535.092,
66000000000,575.914,544.049,
67000000000,560.042,525.038,
68000000000,550.952,523.064,
69000000000,548.01,516.972,
70000000000,526.976,519.023,
71000000000,525.99,514.936,
72000000000,534.984,512.969,
73000000000,524.056,527.027,
74000000000,546.96,541.008,
75000000000,531.013,518.972,
76000000000,541.464,538.05,
77000000000,569.016,535.986,
78000000000,544.032,536.03,
79000000000,548.056,538.994,
80000000000,546.96,521.94,
81000000000,523.482,544,
82000000000,527.944,508.957,
83000000000,517.061,519.04,
84000000000,510.016,516.02,
85000000000,515.516,525.992,
86000000000,503.48,499.996,
87000000000,504.516,498.95,
88000000000,487.47,509.02,
89000000000,486.96,513.966,
90000000000,506.987,500.973,
91000000000,499.04,522.964,
92000000000,512.018,516.005,
93000000000,522.003,506.016,
94000000000,529,508.04,
95000000000,534,512.99,
