Time [ms],1000000000,
0,445.04,
1000000000,440.999,
2000000000,468.512,
3000000000,480.04,
4000000000,498.496,
5000000000,493.512,
6000000000,490.987,
7000000000,485.496,
8000000000,471.047,
9000000000,464.032,
10000000000,465.529,
11000000000,448.5,
12000000000,443.008,
13000000000,443.98,
14000000000,443.502,
15000000000,443.5,
16000000000,444.974,
17000000000,443.986,
18000000000,436.002,
19000000000,456.52,
20000000000,447.942,
21000000000,462.981,
22000000000,453.979,
23000000000,450.02,
24000000000,464.029,
25000000000,453.951,
26000000000,447.06,
27000000000,445.038,
28000000000,443.955,
29000000000,441.984,
30000000000,436.965,
31000000000,438.031,
32000000000,438.026,
33000000000,434.99,
34000000000,449.028,
35000000000,434.012,
36000000000,440.016,
37000000000,433.979,
38000000000,440.971,
39000000000,430.986,
40000000000,436.488,
41000000000,441.525,
42000000000,438.446,
43000000000,441.472,
44000000000,436.504,
45000000000,440.036,
46000000000,432.444,
47000000000,433.056,
48000000000,439.96,
49000000000,440.02,
50000000000,435.525,
51000000000,427.992,
52000000000,433.48,
53000000000,433.5,
54000000000,435.517,
55000000000,434.991,
56000000000,439.48,
57000000000,428.992,
58000000000,431.489,
59000000000,432.01,
60000000000,427.992,
61000000000,441,
62000000000,429,
63000000000,432.53,
64000000000,436.996,
65000000000,432.528,
66000000000,439.492,
67000000000,432.982,
68000000000,440.504,
69000000000,431.484,
70000000000,434.502,
71000000000,431.492,
72000000000,441.024,
73000000000,433.506,
74000000000,422.976,
75000000000,432.012,
76000000000,434.5,
77000000000,429,
78000000000,431.044,
79000000000,437.016,
80000000000,430.5,
81000000000,431.48,
82000000000,425.016,
83000000000,434.004,
84000000000,425.993,
85000000000,428.032,
86000000000,434.46,
87000000000,433.01,
88000000000,443.52,
89000000000,442.48,
90000000000,432.994,
91000000000,434.52,
92000000000,431.976,
93000000000,432.5,
94000000000,445.504,
