Frame number,1000000000,1000000001,1000000002,
0.000000,4890.58,3510.98,3751.25,
1.000000,5586.93,4749.04,4721.12,
2.000000,5320.99,4766.28,5160.46,
3.000000,4847.56,4050.17,5357.83,
4.000000,5025.92,4735.61,5057.59,
5.000000,3886.77,2847.1,4182.68,
6.000000,3025.03,2042.31,3276.86,
7.000000,2404.23,1583.84,2484.78,
8.000000,1905.46,1149.25,2099.09,
9.000000,1591.77,1068.57,1734.88,
10.000000,1331.11,880.904,1417.07,
11.000000,1215.53,876.944,1166.99,
12.000000,1159.48,829.9,1085.5,
13.000000,1089.17,759.149,992.892,
14.000000,1012.8,709.456,924.472,
15.000000,961.8,716,915.995,
16.000000,1131.61,720.078,970.596,
17.000000,1395.41,857.968,1377.53,
18.000000,1989,1027.36,1872.44,
19.000000,2676.7,1478.25,2407.12,
20.000000,3224.32,1776.42,2542.13,
21.000000,3171.04,1936.12,2378.87,
22.000000,2789.55,1911.59,2134.94,
23.000000,2272.08,1595.46,1799.09,
24.000000,1836.48,1341.86,1509.41,
25.000000,1630.15,1125.06,1231.15,
26.000000,1306.97,933.01,1111.95,
27.000000,1117.8,842.552,990.053,
28.000000,1040.41,788.51,872.125,
29.000000,1007.08,714.05,790.08,
30.000000,921.01,740.94,787.051,
31.000000,877.16,701.936,771.032,
32.000000,857.061,716.584,825.92,
33.000000,945.04,772.994,993.076,
34.000000,1141.81,816.093,1209.63,
35.000000,1383.47,969.904,1537,
36.000000,1870.31,1177.8,1799.66,
37.000000,2058.96,1430.95,1767.56,
38.000000,2263.53,1588.9,1737.45,
39.000000,2121.5,1623.16,1616.09,
40.000000,2003.3,1455.27,1416.24,
41.000000,1573.22,1267.3,1218.27,
42.000000,1330.05,1112.42,1077.84,
43.000000,1245.08,1048.9,961.882,
44.000000,1060.83,900.991,889.1,
45.000000,980.066,807.188,792.144,
46.000000,885.095,735.154,753.912,
47.000000,792.034,747.106,724.936,
48.000000,798.856,742.06,717.096,
49.000000,815.094,707.16,788.055,
50.000000,838.132,737.848,931.919,
51.000000,956.11,792.99,1124.1,
52.000000,1106.28,843.232,1289.44,
53.000000,1387.13,1034.85,1448.72,
54.000000,1620.82,1190.24,1516.53,
55.000000,1890,1283.46,1397.99,
56.000000,1873.21,1438.98,1347.34,
57.000000,1740.38,1313.11,1222.91,
58.000000,1509.11,1275.42,1075.23,
59.000000,1278.03,1097.3,945.164,
60.000000,1020.83,986.178,817.186,
61.000000,899.895,842.172,727.98,
62.000000,820.064,768.108,690.912,
63.000000,778.886,734.208,674.964,
64.000000,729.164,691.902,645.11,
65.000000,709.064,702.506,678.008,
66.000000,697.06,695.108,720.928,
67.000000,739.956,703.952,814.208,
68.000000,829.028,774.964,904.848,
69.000000,973.043,881.58,1017.48,
70.000000,1144.76,991.952,1063.58,
71.000000,1327.11,1117.8,1061.06,
72.000000,1497.79,1153.26,1011.38,
73.000000,1558.09,1168.8,965.488,
74.000000,1501.95,1327.77,886.972,
75.000000,1346.36,1231.01,833.521,
76.000000,1161.06,1125.99,759.496,
77.000000,995.975,1054.92,697.6,
78.000000,868.155,841.022,632.02,
79.000000,759.766,768.103,618.008,
80.000000,716.04,712.068,586.976,
81.000000,663.97,691.05,605.048,
82.000000,652.004,686.008,644.076,
83.000000,672.07,696.925,688.5,
84.000000,693.04,714.836,770.409,
85.000000,749,734.832,840.14,
86.000000,833.932,833.12,934.492,
87.000000,946.366,921.071,995.096,
88.000000,1103.17,1009.83,1071.83,
89.000000,1204.24,1112.94,1053.07,
90.000000,1248.36,1211.01,987.132,
91.000000,1285.74,1503.02,924.859,
92.000000,1207.83,1559.37,849.949,
93.000000,1069.22,1300.95,736.112,
94.000000,937.912,1135.91,719.025,
95.000000,802.889,910.49,640.888,
