Frame number,1000000000,
0.000000,595.956,
1.000000,540.518,
2.000000,572.04,
3.000000,605.536,
4.000000,583.487,
5.000000,567.996,
6.000000,543,
7.000000,509.98,
8.000000,491.992,
9.000000,477.976,
10.000000,462.963,
11.000000,443.966,
12.000000,445.988,
13.000000,443.016,
14.000000,438.986,
15.000000,450,
16.000000,452.04,
17.000000,493.98,
18.000000,492.005,
19.000000,527.024,
20.000000,512,
21.000000,501.04,
22.000000,477.05,
23.000000,466.952,
24.000000,448.032,
25.000000,448.996,
26.000000,445.995,
27.000000,448.006,
28.000000,445.992,
29.000000,434.016,
30.000000,451.046,
31.000000,468.016,
32.000000,476.992,
33.000000,492.05,
34.000000,498.03,
35.000000,471.984,
36.000000,465.025,
37.000000,463.014,
38.000000,456.025,
39.000000,448.972,
40.000000,447.008,
41.000000,442.007,
42.000000,445.012,
43.000000,441,
44.000000,446,
45.000000,464.026,
46.000000,475.046,
47.000000,480,
48.000000,480.012,
49.000000,468.976,
50.000000,456,
51.000000,447.984,
52.000000,447.979,
53.000000,443.028,
54.000000,439.963,
55.000000,431.012,
56.000000,432.015,
57.000000,440.973,
58.000000,461,
59.000000,468.972,
60.000000,473.952,
61.000000,475.98,
62.000000,463.014,
63.000000,445.02,
64.000000,448.979,
65.000000,447.984,
66.000000,441.02,
67.000000,434.998,
68.000000,432.044,
69.000000,450.965,
70.000000,438.992,
71.000000,433.019,
72.000000,445.978,
73.000000,464.964,
74.000000,473.016,
75.000000,478.995,
76.000000,445.936,
77.000000,441.004,
78.000000,442.99,
79.000000,440.986,
80.000000,441,
81.000000,437.016,
82.000000,442.1,
83.000000,435.984,
84.000000,434.009,
85.000000,443.5,
86.000000,448.99,
87.000000,468.44,
88.000000,454.966,
89.000000,449.976,
90.000000,444.05,
91.000000,443.98,
92.000000,441.01,
93.000000,434.996,
94.000000,442.47,
95.000000,440.48,
