Time [ms],1000000000,1000000001,1000000002,1000000003,
0,930.12,608.03,602.1,584.25,
1000000000,685.711,654.016,694.966,586.897,
2000000000,822.032,759.995,855.166,743.212,
3000000000,982.792,1001.74,1068.48,953.872,
4000000000,1148.89,913.656,1308.41,1044.19,
5000000000,1242.83,1114.12,1569.33,1189.95,
6000000000,1520.55,1377.97,1715.87,1408.09,
7000000000,1681.2,1405.37,2045.06,1424.69,
8000000000,1667.47,1336.92,2309.31,1348,
9000000000,1669.83,1361.36,1962.73,1194.2,
10000000000,981.214,1360.7,1723.61,1171,
11000000000,1017.26,1182.89,1536.87,1109.17,
12000000000,1024.17,945.776,1601.18,1006.97,
13000000000,974.806,910.126,1596,927.113,
14000000000,1101.28,853.722,1182.19,824.085,
15000000000,1064.96,876.661,1186.05,761.985,
16000000000,1088.19,780.886,1014,705.98,
17000000000,903.3,869.833,892.164,685.013,
18000000000,831,736.582,936.24,707.02,
19000000000,722.024,895.204,902.88,775.904,
20000000000,764.216,796.652,1079.27,756.972,
21000000000,814.048,890.856,967.04,831.022,
22000000000,980.132,930.98,1190.15,928.88,
23000000000,1000.62,993.031,1357.62,937.996,
24000000000,1159.77,1192.76,1332.48,1013.53,
25000000000,1081.59,1118.04,1379.71,915.408,
26000000000,923.192,1197.04,1178.91,934.04,
27000000000,923.25,964.14,1139.18,858.08,
28000000000,876.331,1066.38,1073.01,848.218,
29000000000,853.368,1076.77,1035.86,828.3,
30000000000,804.88,936.026,920.828,809.132,
31000000000,864.988,877.03,855.064,755.858,
32000000000,914.68,785.072,811.185,763.4,
33000000000,920.132,797.528,748.95,710.917,
34000000000,874,783.85,731.8,679.032,
35000000000,805.936,728.045,737.992,691.977,
36000000000,787.095,734.98,770.062,687.925,
37000000000,822.884,776.872,708.122,714.906,
38000000000,889.124,771.852,816.876,773.38,
39000000000,879.199,870.536,688.976,800.002,
40000000000,1085.15,796.268,818.824,814.502,
41000000000,1230.6,937.631,804.338,815.002,
42000000000,1185.39,1048.16,831.383,888.018,
43000000000,1123.5,1084.1,875.16,866.408,
44000000000,1096.58,1163.73,839.84,891.528,
45000000000,1057.57,959.832,815.936,830.512,
46000000000,990.363,1009.94,800.088,796.012,
47000000000,942.096,934.13,780.108,741.552,
48000000000,829.916,840.04,698,723.54,
49000000000,834.938,827.104,651.025,677.043,
50000000000,804.894,781.24,654.985,690.103,
51000000000,762.03,782.2,700,626.972,
52000000000,692.111,727.2,677.03,608.91,
53000000000,707,733.16,628,618.951,
54000000000,727.153,717.198,655.92,659.9,
55000000000,665.186,722.894,625.857,685.174,
56000000000,735.946,846.25,662.811,666.992,
57000000000,889.102,871.838,760.312,752.916,
58000000000,858.16,1066.13,826.863,844.112,
59000000000,804.888,1134.09,847.857,866.136,
60000000000,932.103,1279.18,945.296,864.064,
61000000000,801.619,1281.98,840.985,853.03,
62000000000,860.708,1127.95,801.88,801.072,
63000000000,765.368,1080.87,714.952,741.72,
64000000000,718.23,1018.29,700.952,723.976,
65000000000,760.72,940.216,653.966,715.993,
66000000000,666.84,860.032,640.988,684.992,
67000000000,719.96,815.97,622.035,667.46,
68000000000,608.808,775.912,647.989,682.22,
69000000000,609.12,758.968,675.16,674.84,
70000000000,625.914,688.123,649.135,687.832,
71000000000,638.832,742.7,656.922,655.11,
72000000000,641.876,781.892,662.917,658.97,
73000000000,597.034,747.966,618.874,696.14,
74000000000,640.946,718.028,657.986,617.992,
75000000000,681.8,759.48,764.995,744.252,
76000000000,766.96,807.628,870.032,814.844,
77000000000,799.52,769.208,806.848,825.14,
78000000000,857.704,931.74,947.849,831.92,
79000000000,861.264,1093.03,869.064,779.976,
80000000000,880.066,1035.7,894.854,817.976,
81000000000,811.92,949.045,810.026,816,
82000000000,807.85,973.056,780.888,815.87,
83000000000,933.01,812.63,745.088,790.984,
84000000000,724.2,831.56,707.914,762,
85000000000,803.464,825.98,702.015,771.075,
86000000000,716.048,761.641,660.031,731.006,
87000000000,774.2,780,625.86,675.1,
88000000000,759.504,746.406,633.06,637.962,
89000000000,726.418,742.036,596.9,669.473,
90000000000,728.044,752.594,650.228,671.328,
91000000000,771.009,738.64,665.956,697.003,
92000000000,781.004,728.544,713.056,695.104,
93000000000,822.944,798.96,723.148,698.847,
94000000000,882.82,856.908,741.952,737.16,
95000000000,851.016,871.879,808.908,715,
