Frame number,1000000000,1000000001,1000000002,1000000003,1000000004,
0.000000,2632.16,2747.06,3824.56,6825.58,3045.52,
1.000000,2568.67,3182.51,4372.54,6971.88,3927.91,
2.000000,2213.97,2902.72,4587.85,6322.2,5125.06,
3.000000,2328.76,3065.14,4428.09,6161.59,6328.62,
4.000000,2352.56,3080.54,5040.93,6694.77,7513.27,
5.000000,2439.99,3385.32,4422.1,7316.53,6354.97,
6.000000,2434.8,3389.32,3882.83,6521.91,5628.15,
7.000000,2268.07,3168.28,3122.23,5889.68,5736.98,
8.000000,2083.74,2835.73,2676.45,5185.41,5129.72,
9.000000,1901,2641.44,2221.83,4282.88,4424,
10.000000,1716.54,2437.35,1955.71,3813.19,3807.02,
11.000000,1534.15,2278.1,1639.86,3345.46,3284,
12.000000,1374.2,1976.1,1514.13,2992.59,2822.61,
13.000000,1317.11,1748.91,1458.09,2750.24,2500.25,
14.000000,1231.05,1299.5,1382.45,2521.79,2228.08,
15.000000,1204.05,1199.1,1482.13,2541.25,2214.44,
16.000000,1100.14,1143.88,1489.27,2472.72,2278.52,
17.000000,1137.78,1135.7,1513.19,2579.88,2329.06,
18.000000,1155.03,1147.52,1742.55,2717.32,2636.88,
19.000000,1206.08,1213.33,2110.36,3014.38,3323.25,
20.000000,1320.81,1322.42,2476.13,3139.17,3921.59,
21.000000,1432.78,1369.52,2870.02,3439.47,4376.91,
22.000000,1549.24,1634.32,2795.27,3676.34,4681.15,
23.000000,1584.01,1585.23,2789.05,3654.81,4633.22,
24.000000,1599.95,1614.19,2710.56,3362.58,4072.94,
25.000000,1506.14,1584.14,2606.86,3014.9,3772.14,
26.000000,1450,1576.33,2300.47,2851.32,3069.24,
27.000000,1362.82,1466.1,2085.92,2646.9,2763.02,
28.000000,1245.26,1337.75,1874.52,2419.32,2364.35,
29.000000,1172.95,1307.79,1643.23,2290.74,2221.4,
30.000000,1155.9,1412.14,1504.62,2305.66,2004.25,
31.000000,1081.98,1411.05,1434.35,2196.73,1957.42,
32.000000,1049.95,1284.2,1347.75,2019.11,1849.9,
33.000000,995.128,1307.4,1376.97,2079.92,1937.37,
34.000000,1053.94,1355.29,1532.47,2158.08,2130.1,
35.000000,1051,1328.65,1802.48,2367.41,2501.54,
36.000000,1123.9,1560.1,2231.38,2457.04,2870.12,
37.000000,1164.08,1628,2295.5,2470.32,3062.05,
38.000000,1229.41,1664.35,2555.44,2675.15,3381.74,
39.000000,1303.93,1671.46,2490.22,2901.99,3559.25,
40.000000,1381.5,1877.04,2377.99,2776.37,3388.88,
41.000000,1407.54,1828.22,2252.65,2648.01,3029.59,
42.000000,1336.94,1696.53,2029.43,2485.3,2712.34,
43.000000,1295.95,1552.63,1919.31,2210.55,2440.13,
44.000000,1198.48,1449.72,1639.23,2101.23,2151.43,
45.000000,1153.62,1464.46,1515.73,1962.98,1937.28,
46.000000,1088.49,1394.9,1412.47,1749.49,1924.89,
47.000000,1055.04,1347,1478.8,1664.27,1662.54,
48.000000,1056.54,1331.1,1431.48,1705,1658.97,
49.000000,1009.76,1257.76,1479.87,1705.9,1763.56,
50.000000,1018.99,1241.08,1521.99,1810.23,1932.45,
51.000000,1050.6,1262.01,1556.36,1804,2092.31,
52.000000,1064.95,1362.81,1808.19,2070.72,2339.44,
53.000000,1108.86,1456.4,1637.49,2172.45,2619.66,
54.000000,1147.62,1532.11,2193.27,2282.51,2904.16,
55.000000,1178.58,1613.43,2008.78,2352.61,3019.63,
56.000000,1288.57,1779.8,2336.77,2464.37,3066.41,
57.000000,1263.12,1700.44,2115.96,2329.44,2824.38,
58.000000,1284.83,1687.93,2090.96,2287.26,2599.6,
59.000000,1252.86,1591.39,1980.29,2036.43,2500.64,
60.000000,1233.87,1608.47,1886.33,1909.62,2207.44,
61.000000,1158.59,1575.53,1680.16,1875.49,2026.13,
62.000000,1150.55,1498.5,1736.98,1703.7,1893.38,
63.000000,1119.6,1465.66,1710.16,1679.47,1899.17,
64.000000,1082.75,1489.23,1698.41,1726.57,1783.92,
65.000000,1076.04,1451.93,1676.83,1674.56,1722.45,
66.000000,1036.82,1387.22,1832.84,1694.24,1853.9,
67.000000,1003.71,1376.5,1666.96,1698.22,2002.52,
68.000000,1051.88,1370.93,1821.95,1752.15,2262.49,
69.000000,1016.95,1538.69,1824.66,1762.63,2488.96,
70.000000,1076.1,1629.02,2234.37,1889.51,2622.59,
71.000000,1083.78,1588.94,2220.96,1935.37,2706.75,
72.000000,1116.54,1674.48,2469.94,1946.59,2884.37,
73.000000,1126.54,1687.34,2283.85,1978.52,2880.49,
74.000000,1181.44,1696.31,2324.37,1888.48,2719.67,
75.000000,1182.6,1645.76,2271.8,1902.98,2585.03,
76.000000,1205.07,1739.58,2312.9,1773.75,2469.61,
77.000000,1186.11,1653.94,2165.6,1754.21,2331.29,
78.000000,1209.53,1627.47,2129.76,1654.05,2056.69,
79.000000,1146.3,1578.69,2055,1630.04,2033.33,
80.000000,1111.05,1622.18,2029.76,1543.77,1931.09,
81.000000,1095.97,1504.76,1933.5,1468.7,1869.79,
82.000000,1083.96,1543.73,1966.71,1371.86,1837.75,
83.000000,1080,1495.98,1894.78,1529.13,1922.16,
84.000000,1046.12,1522.05,2182.08,1537.64,2050.69,
85.000000,1043.98,1553.52,2230.15,1495.58,2080.69,
86.000000,1020.06,1575.88,2405.45,1618.47,2202.94,
87.000000,1044.79,1528.92,2429.5,1591.71,2320.59,
88.000000,1098.09,1615.89,2519.34,1679.11,2489.3,
89.000000,1083.12,1577.52,2397.01,1625.75,2423.17,
90.000000,1100.13,1657.59,2297.06,1669.11,2447.46,
91.000000,1069.13,1592.25,2349,1593.7,2580.23,
92.000000,1153.91,1708,2308.57,1678.57,2530.83,
93.000000,1165.18,1643.82,2221.65,1674.81,2304.22,
94.000000,1210.2,1720.28,2214.86,1619.25,2259.64,
95.000000,1194,1596.48,2298.36,1616.73,2173.01,
