Frame number,1000000000,1000000001,1000000002,
0.000000,625.975,573.942,541.972,
1.000000,810.808,597.074,585.006,
2.000000,874.104,625.896,627.063,
3.000000,994,677.112,655.175,
4.000000,1043.05,730.046,754.109,
5.000000,956.172,705.044,664.001,
6.000000,813.124,625.974,606.953,
7.000000,712.899,558.027,584.15,
8.000000,596.122,555.064,540.44,
9.000000,597.072,533.975,522.45,
10.000000,573.512,521.975,497.008,
11.000000,548,509,500.46,
12.000000,519.56,489.03,483.572,
13.000000,512.988,493.969,485.508,
14.000000,523.012,494.962,477.532,
15.000000,512.496,471.964,482.003,
16.000000,519.08,496.039,470.008,
17.000000,504.04,471.976,480.016,
18.000000,532.992,511.02,496.016,
19.000000,558.454,505.015,504.48,
20.000000,582.556,534.944,513,
21.000000,600.594,555.08,525.51,
22.000000,664.484,599.088,554.56,
23.000000,718.104,597.896,630.479,
24.000000,684.17,582.887,602.5,
25.000000,616.08,573.086,581.068,
26.000000,578.918,532,537.952,
27.000000,553.036,512.931,514.512,
28.000000,529.948,483.938,487.44,
29.000000,518.96,488.988,486.978,
30.000000,515.048,480.016,482.944,
31.000000,506.012,475.985,470.015,
32.000000,502.013,473.978,477.012,
33.000000,513.028,464.016,474.496,
34.000000,498.957,484.492,477.985,
35.000000,503.995,480.97,480.036,
36.000000,503.072,481.032,472.988,
37.000000,514.99,477.043,494.04,
38.000000,509.021,489.976,490.035,
39.000000,536.976,499.014,495.035,
40.000000,538.96,505.979,511.952,
41.000000,553.032,522.1,503.968,
42.000000,569.038,523.01,509,
43.000000,559.03,496.96,512.52,
44.000000,536.945,524.92,508.512,
45.000000,526.04,494.99,481.034,
46.000000,521.96,490.021,486.952,
47.000000,496.01,493.031,476.96,
48.000000,496.976,482.992,476.986,
49.000000,491.01,469.968,476.993,
50.000000,500.032,491.992,478.04,
51.000000,489.11,469.965,469.004,
52.000000,486.051,471.02,480.98,
53.000000,496.992,471.011,476.068,
54.000000,504.974,474.032,461.036,
55.000000,513.05,477.044,468.032,
56.000000,515.928,486,475.964,
57.000000,500.066,480.06,462.042,
58.000000,495.068,487.528,473.055,
59.000000,493.1,490.515,474.974,
60.000000,496.041,486.05,471.975,
61.000000,516.03,486.02,492.04,
62.000000,523.051,505.547,499.948,
63.000000,512.968,501.48,484.056,
64.000000,515.511,492.536,491.998,
65.000000,519.128,495.54,490.968,
66.000000,499.039,490.54,489.04,
67.000000,508.01,477.05,482.97,
68.000000,497.96,467.48,480.96,
69.000000,496.02,474.994,476,
70.000000,506.984,470.02,472.98,
71.000000,495.508,464.474,472.985,
72.000000,497,475.016,471.04,
73.000000,503.027,470.976,471.976,
74.000000,485.996,478.976,463.024,
75.000000,476.023,472.988,468.05,
76.000000,486.474,465.992,462.008,
77.000000,485.98,479.975,465,
78.000000,496.014,479.48,470.952,
79.000000,501.012,491.04,467.044,
80.000000,507.016,507.483,487.036,
81.000000,498.504,500.021,472.029,
82.000000,513.06,507.968,491.048,
83.000000,508.04,492.05,482.962,
84.000000,494.986,479.045,483,
85.000000,505.973,488.05,471.032,
86.000000,500.995,476.985,474.972,
87.000000,500.97,463.041,470.981,
88.000000,504.008,469,473.016,
89.000000,509.964,480.994,469.968,
90.000000,501.997,474.996,475.022,
91.000000,498.944,478.06,467.048,
92.000000,502,464.969,466.964,
93.000000,498.974,484.96,456.04,
94.000000,498.029,471.016,479,
