Time [ms],1000000000,
0,657.948,
1000000000,590.968,
2000000000,590.932,
3000000000,574.472,
4000000000,650.507,
5000000000,701.544,
6000000000,701.962,
7000000000,663.512,
8000000000,642.992,
9000000000,619.496,
10000000000,580.514,
11000000000,562.51,
12000000000,541.55,
13000000000,507.47,
14000000000,506,
15000000000,494.536,
16000000000,478.504,
17000000000,484.516,
18000000000,491.008,
19000000000,496,
20000000000,512.976,
21000000000,553.5,
22000000000,556.476,
23000000000,568.493,
24000000000,549.984,
25000000000,561.032,
26000000000,553.024,
27000000000,541.515,
28000000000,525.992,
29000000000,502.012,
30000000000,514,
31000000000,497.986,
32000000000,499.983,
33000000000,477.968,
34000000000,469.984,
35000000000,471.025,
36000000000,479.024,
37000000000,505.058,
38000000000,531.006,
39000000000,514.007,
40000000000,506.02,
41000000000,498.016,
42000000000,511.484,
43000000000,510.501,
44000000000,495.956,
45000000000,499.52,
46000000000,500.48,
47000000000,494.552,
48000000000,477.002,
49000000000,487.036,
50000000000,469.498,
51000000000,472.008,
52000000000,470.021,
53000000000,476.52,
54000000000,491.984,
55000000000,503.484,
56000000000,490.944,
57000000000,494.52,
58000000000,489,
59000000000,486.992,
60000000000,484.018,
61000000000,467.982,
62000000000,478.04,
63000000000,475.996,
64000000000,483.978,
65000000000,472.97,
66000000000,471.978,
67000000000,463.019,
68000000000,468.96,
69000000000,476.02,
70000000000,480.03,
71000000000,491.952,
72000000000,482.973,
73000000000,488.998,
74000000000,495.984,
75000000000,474.985,
76000000000,477.006,
77000000000,482.981,
78000000000,468.977,
79000000000,465.96,
80000000000,463.021,
81000000000,459,
82000000000,452.989,
83000000000,455.968,
84000000000,462.05,
85000000000,467.996,
86000000000,481.987,
87000000000,486.016,
88000000000,495.982,
89000000000,501.02,
90000000000,486.017,
91000000000,496.04,
92000000000,477.009,
93000000000,470.029,
94000000000,482.01,
95000000000,470.027,
