Time [ms],1000000000,1000000001,1000000002,1000000003,
0,830.824,1084.8,1003.89,808.042,
1000000000,766.956,944.938,773.06,767.952,
2000000000,770.968,840.91,720.08,789.984,
3000000000,765.03,857.525,729.956,751.432,
4000000000,800.104,872.424,690.996,756.93,
5000000000,790,864.362,723.987,743.016,
6000000000,825.231,849.021,826.136,766,
7000000000,819.068,900.832,957.764,826.97,
8000000000,804.116,888.987,985.984,799.008,
9000000000,764.96,889.908,884.82,739,
10000000000,733.459,790.999,841.196,714.438,
11000000000,666.5,765.95,777,679.444,
12000000000,678.024,737.885,725.912,661.014,
13000000000,674.997,685.944,704.016,644.95,
14000000000,673.982,686.992,694.96,628.992,
15000000000,692.152,717,710.912,630.048,
16000000000,733.944,687.032,713.594,652.92,
17000000000,799.02,735.025,728,683.1,
18000000000,841.084,752.927,728.012,681.904,
19000000000,869.012,825.988,752.56,680.92,
20000000000,935.976,955.052,764.976,659.042,
21000000000,988,1030.34,787.484,699,
22000000000,944.472,1136.73,806.532,685,
23000000000,933.816,1076.09,827.968,668.496,
24000000000,972.029,1043.42,792.592,703.936,
25000000000,907.102,1021.93,759.808,686.436,
26000000000,868.008,1005.89,789.585,677.932,
27000000000,861.34,1013.97,784.364,669.136,
28000000000,878.96,997.1,747.884,663.972,
29000000000,882.124,1034.86,767.016,639.92,
30000000000,861.878,1080.86,755,659.07,
31000000000,907.925,1136.6,733.948,673.016,
32000000000,970,1220.56,755.072,724.08,
33000000000,1000.04,1367.34,737.08,753.488,
34000000000,1080.02,1388.86,745.04,785.084,
35000000000,1124.43,1499.46,755.952,788.108,
36000000000,1180.05,1535.07,749.12,824.968,
37000000000,1204.03,1582.21,763.164,832.09,
38000000000,1163.03,1580.96,771.944,837.1,
39000000000,1140,1259.18,783.028,832.086,
40000000000,1089.98,1250,783.02,786.95,
41000000000,1079.53,1388.23,788.406,754.536,
42000000000,1027.01,1267.66,812.56,738.52,
43000000000,1024.06,1258,783.94,718.6,
44000000000,928.954,1185.89,782.512,704.992,
45000000000,932.96,1127.82,793.512,691.018,
46000000000,905.1,1072.1,770.46,692.012,
47000000000,919.432,1039.88,761.12,697.944,
48000000000,911.52,1082.93,758.503,689.05,
49000000000,962.448,1021.06,751.513,689.984,
50000000000,925,1118.03,750.988,733.98,
51000000000,1007.97,1125.19,763.969,753.058,
52000000000,976.48,1154,744.045,780.952,
53000000000,1000.9,1104.25,736.99,811.47,
54000000000,1017.61,1144.12,723.556,803.536,
55000000000,1020.9,1134.83,724.6,832.032,
56000000000,939.94,1171.11,709.924,811.026,
57000000000,1029.12,1217.45,692.016,803.94,
58000000000,1023.36,1178.37,703.973,802.504,
59000000000,1019.96,1142.56,717.97,765.086,
60000000000,1058.9,1162.07,696.028,733.976,
61000000000,950.098,1138.55,720.976,723.012,
62000000000,951.94,1066.52,718.432,727.968,
63000000000,915.04,1072.97,711.064,690.064,
64000000000,880.968,1044.8,705.5,685.45,
65000000000,901.2,1045.18,687.005,679.54,
66000000000,875.923,970.948,693.918,673.04,
67000000000,859.045,961.02,705.45,679,
68000000000,850.917,955.112,693.043,658.024,
69000000000,813.54,964.92,672.896,672.048,
70000000000,835.576,971.616,662.934,681.984,
71000000000,860.984,986.904,685.952,680.953,
72000000000,832.04,934.912,686.096,690.95,
73000000000,850.154,928.928,685.91,669.96,
74000000000,816.03,990.112,693.92,665.05,
75000000000,883.055,923.89,698.97,682.9,
76000000000,888.088,957.836,692.942,717.08,
77000000000,882.511,1004.12,706.112,685.92,
78000000000,881.52,967.042,692.856,693.97,
79000000000,913.992,943.82,680.912,691.968,
80000000000,876.092,955.184,681.92,689.95,
81000000000,838.944,965.816,676.436,694.1,
82000000000,901.94,982.02,690.072,688.06,
83000000000,862.817,916.02,662.08,686.02,
84000000000,857.984,902.796,660.9,680,
85000000000,860.096,926.052,663.92,676.94,
86000000000,858.998,933.72,653.449,666.98,
87000000000,833.082,966.834,664.492,663.04,
88000000000,811.828,885.416,657.088,654.07,
89000000000,821.496,937.12,651.532,679.488,
90000000000,823.96,910.192,650.468,662.018,
91000000000,797.555,888.104,653.456,649.04,
92000000000,833.48,880.088,656.476,657.008,
93000000000,784.032,849.96,662.536,633.025,
94000000000,785.488,854.16,658.997,647.02,
