Frame number,1000000000,
0.000000,446.012,
1.000000,455.016,
2.000000,457.04,
3.000000,468.991,
4.000000,464.006,
5.000000,464.436,
6.000000,465.996,
7.000000,443.996,
8.000000,439.012,
9.000000,436.042,
10.000000,429.976,
11.000000,417.006,
12.000000,433.992,
13.000000,435.024,
14.000000,437.016,
15.000000,426.993,
16.000000,430.976,
17.000000,434.964,
18.000000,440.026,
19.000000,448,
20.000000,444.035,
21.000000,450.994,
22.000000,436.988,
23.000000,438.01,
24.000000,450.024,
25.000000,432.003,
26.000000,434.019,
27.000000,435.5,
28.000000,433.488,
29.000000,434.001,
30.000000,429.508,
31.000000,431.5,
32.000000,427.5,
33.000000,432.002,
34.000000,437.5,
35.000000,444.018,
36.000000,440.008,
37.000000,433.492,
38.000000,435.028,
39.000000,442.052,
40.000000,432.5,
41.000000,436.008,
42.000000,431.484,
43.000000,429.488,
44.000000,434.004,
45.000000,430.512,
46.000000,422.008,
47.000000,426.985,
48.000000,429.484,
49.000000,431.454,
50.000000,432,
51.000000,436.5,
52.000000,437.482,
53.000000,441,
54.000000,444.5,
55.000000,428,
56.000000,430.488,
57.000000,434.99,
58.000000,430,
59.000000,438.044,
60.000000,434,
61.000000,433,
62.000000,432.981,
63.000000,435.024,
64.000000,429.987,
65.000000,427.016,
66.000000,445,
67.000000,437.504,
68.000000,444.528,
69.000000,450.502,
70.000000,439.986,
71.000000,441.5,
72.000000,439.484,
73.000000,438.992,
74.000000,432.992,
75.000000,432.504,
76.000000,444.958,
77.000000,425.98,
78.000000,436.024,
79.000000,433,
80.000000,438.5,
81.000000,436.07,
82.000000,448.48,
83.000000,444.504,
84.000000,445.972,
85.000000,452.516,
86.000000,443.532,
87.000000,448.496,
88.000000,451.502,
89.000000,442.05,
90.000000,443,
91.000000,440.972,
92.000000,438.032,
93.000000,439.976,
94.000000,440.008,
