Time [ms],1000000000,1000000001,
0,1138.88,1600.68,
1000000000,1210.57,1182.67,
2000000000,1398.57,1006.04,
3000000000,1530.32,1000.78,
4000000000,1630.09,1025.26,
5000000000,1244.99,1031,
6000000000,1218.3,1145.01,
7000000000,1114.79,1025.83,
8000000000,1134.17,984.9,
9000000000,992.95,914.904,
10000000000,982.85,933.056,
11000000000,901.932,881.936,
12000000000,873.05,859.92,
13000000000,861.142,838.96,
14000000000,853.996,762.072,
15000000000,844.934,820.956,
16000000000,823.95,818.96,
17000000000,856,789.86,
18000000000,867.092,807.064,
19000000000,823,877.984,
20000000000,871.04,900.094,
21000000000,898.863,883.94,
22000000000,921.968,909.04,
23000000000,900.888,871.18,
24000000000,902.218,888.098,
25000000000,939.076,870.92,
26000000000,880,876.026,
27000000000,862.003,858,
28000000000,832.981,826.04,
29000000000,788.932,815.092,
30000000000,775,788.138,
31000000000,777.192,774.052,
32000000000,756.932,762.045,
33000000000,738.084,776.944,
34000000000,765.896,772.544,
35000000000,701.978,801.977,
36000000000,753.061,750.052,
37000000000,764.003,721,
38000000000,751.955,801.995,
39000000000,756.18,785.1,
40000000000,747.036,764.948,
41000000000,699.496,756.096,
42000000000,717.954,708.96,
43000000000,683.924,749.04,
44000000000,667.954,726.93,
45000000000,658.992,673.12,
46000000000,662.008,693,
47000000000,687.104,673,
48000000000,668.9,659.164,
49000000000,631.944,686.04,
50000000000,632.488,681.082,
51000000000,608.5,647.954,
52000000000,605.952,653.034,
53000000000,621.95,651.056,
54000000000,619,658.97,
55000000000,615.9,665.944,
56000000000,589.96,631.48,
57000000000,596.944,630.925,
58000000000,616.056,639.895,
59000000000,595.492,619.02,
60000000000,597.528,647,
61000000000,624.028,616.924,
62000000000,616,613.965,
63000000000,617.1,625.989,
64000000000,589.996,615.935,
65000000000,556.508,595.128,
66000000000,561.475,562.988,
67000000000,578.528,589.992,
68000000000,545.506,579.982,
69000000000,558.024,594.984,
70000000000,538.997,585.973,
71000000000,539.512,570.062,
72000000000,545.032,575.968,
73000000000,567.04,559.925,
74000000000,548,564.97,
75000000000,562.972,575.998,
76000000000,568.94,568.504,
77000000000,565.04,552.004,
78000000000,548.06,582.5,
79000000000,548.072,564.95,
80000000000,529.972,531.07,
81000000000,548.012,548.92,
82000000000,535.975,553.034,
83000000000,536.976,556.072,
84000000000,530.045,555.975,
85000000000,515.027,522.974,
86000000000,516.965,511.024,
87000000000,503.955,522.96,
88000000000,518.05,521.958,
89000000000,507.048,522.932,
90000000000,527.036,524.987,
91000000000,528.008,526.447,
92000000000,526.064,509,
93000000000,524.028,526.068,
94000000000,528.936,532.968,
95000000000,510.948,521.006,
