Time [s],1000000000,
0.000000,847.96,
1.000000,543.058,
2.000000,475.51,
3.000000,453.992,
4.000000,447.02,
5.000000,436.995,
6.000000,429.99,
7.000000,426.952,
8.000000,438.972,
9.000000,446.036,
10.000000,445.49,
11.000000,449.52,
12.000000,464.976,
13.000000,495.988,
14.000000,521.991,
15.000000,484.975,
16.000000,464.024,
17.000000,452.007,
18.000000,446.014,
19.000000,442.015,
20.000000,440.97,
21.000000,432.048,
22.000000,433.984,
23.000000,430.037,
24.000000,446.013,
25.000000,442.98,
26.000000,441.984,
27.000000,458.013,
28.000000,468.982,
29.000000,500.008,
30.000000,489.001,
31.000000,490.04,
32.000000,460.008,
33.000000,441.99,
34.000000,440.002,
35.000000,420.988,
36.000000,416.016,
37.000000,434.008,
38.000000,425.02,
39.000000,432.04,
40.000000,443.032,
41.000000,445.97,
42.000000,436.988,
43.000000,446.97,
44.000000,457.97,
45.000000,479.994,
46.000000,484.04,
47.000000,496.96,
48.000000,462.088,
49.000000,447.992,
50.000000,439.021,
51.000000,430.02,
52.000000,424.979,
53.000000,421.972,
54.000000,430.028,
55.000000,402.996,
56.000000,443.024,
57.000000,435.936,
58.000000,433.95,
59.000000,448.962,
60.000000,451.979,
61.000000,464.98,
62.000000,476.996,
63.000000,477.972,
64.000000,465.985,
65.000000,440.998,
66.000000,428.96,
67.000000,428.98,
68.000000,428.994,
69.000000,431.045,
70.000000,422.026,
71.000000,416.981,
72.000000,446.988,
73.000000,433.992,
74.000000,442.048,
75.000000,445.92,
76.000000,439.961,
77.000000,453.05,
78.000000,480.956,
79.000000,472.956,
80.000000,453.984,
81.000000,442.04,
82.000000,430.98,
83.000000,426.952,
84.000000,428.96,
85.000000,425.022,
86.000000,420.015,
87.000000,422.976,
