Frame number,1000000000,1000000001,1000000002,1000000003,1000000004,1000000005,1000000006,
0.000000,724.939,570.14,721.295,793.128,933.08,685.65,709.083,
1.000000,579.629,803.618,923.895,917.736,618.681,836.98,718.246,
2.000000,600.076,849.9,729.073,878.66,649.833,876.868,654.765,
3.000000,622.532,796.8,697.704,918.588,676.377,859.675,678.46,
4.000000,608.4,807.825,702.014,742.388,593.765,745.425,630.209,
5.000000,537.792,596.773,633.689,643.926,596.327,581.832,654.889,
6.000000,470.805,600.557,566.826,542.356,567.005,509.496,519.472,
7.000000,475.724,538.339,517.54,515.014,545.593,496.655,502.892,
8.000000,472.022,508.036,508.464,528.258,516.408,503.638,495.414,
9.000000,457,496.836,522.844,528.461,611.302,461.204,471.712,
10.000000,459.99,513.186,505.271,517.164,584.76,468.08,466.621,
11.000000,461.143,523.3,521.824,498.952,496.347,454.13,479.501,
12.000000,479.088,521.424,520.943,484.975,478.182,459.743,504.876,
13.000000,481.78,541.712,527.072,485.018,491.118,464.854,557.862,
14.000000,518.18,647.461,538.083,502.975,522.669,529.016,520.424,
15.000000,650.914,792.762,766.358,575.472,584.752,650.893,570.621,
16.000000,672.306,1056.81,872.421,699.71,701.413,750.756,685.78,
17.000000,721.053,1232.15,1023.46,964.976,758.18,879.37,794.029,
18.000000,883.4,1261.28,975.247,993.935,709.035,1005.38,832.735,
19.000000,830.313,1147.54,870.79,891.64,700.275,1043.46,842.35,
20.000000,799.488,1046.7,788.6,848.542,652.314,926.891,637.87,
21.000000,660.282,768.112,665.11,817.62,669.895,847.238,593.642,
22.000000,601.782,717.832,670.735,730.724,624.153,728.018,536,
23.000000,563.966,675.364,589.482,621.541,569.789,667.106,552.182,
24.000000,546.83,612.312,554.03,644.038,574.958,569.292,496.68,
25.000000,518.798,588.816,562.02,591.855,530.708,551.02,509.063,
26.000000,521.34,509.14,541.006,561.027,563.698,527.366,473.984,
27.000000,488.016,511.008,515.576,553.979,527.329,504.872,489.62,
28.000000,480.024,516.66,501.481,542.941,552.338,501.506,466.142,
29.000000,539.288,548.024,503.97,562.862,599.849,500.464,477.157,
30.000000,616.208,617.13,576.987,612.039,620.104,585.548,546.795,
31.000000,675.542,857.47,612.725,850.707,667.953,698.85,588.151,
32.000000,800.162,1097.89,704.067,940.722,787.799,852.25,687.154,
33.000000,790.743,1147.72,821.52,1201.48,744.25,1005.48,722.485,
34.000000,738.95,1215.82,651.803,1310.32,737.46,901.102,697.77,
35.000000,717.316,1262.44,659.865,1299.99,779.481,835.12,670.497,
36.000000,747.796,1012.05,718.532,1243.83,716.14,702.056,649.212,
37.000000,702.943,903.849,659.962,856.056,653.659,699.048,595.484,
38.000000,625.145,806.71,637.62,870.1,607.459,639.02,558.5,
39.000000,526.104,646.267,550.115,773.448,627.359,608.904,505.732,
40.000000,507.01,607.79,519.818,696.488,563.934,554.232,472.201,
41.000000,507.716,561.072,524.172,605.944,556.862,525.195,509.788,
42.000000,484.948,511.7,482.975,550.322,520.949,565.2,455.037,
43.000000,482.572,476.436,497.119,543.618,551.246,483.154,471.553,
44.000000,465.422,497.524,492.092,533.35,532.234,494.1,474.546,
45.000000,483.805,500.64,489.05,503.15,558.915,515.924,484.093,
46.000000,520.279,556.3,515.897,544.648,650.805,548.722,471.44,
47.000000,576.154,602.716,580.17,621.532,684.169,667.193,499.52,
48.000000,641.72,693.124,693.02,653.401,770.938,687.638,564.312,
49.000000,657.396,789.992,715.338,760.136,814.422,682.644,618.687,
50.000000,659.61,1060.89,785.567,795.236,782.48,746.173,628.215,
51.000000,645.507,828.753,742.31,801.887,689.563,713.35,683.83,
52.000000,607.886,807.755,677.874,665.59,726.099,738.005,652.732,
53.000000,575.786,733.666,728.909,547.223,587.661,726.784,588.987,
54.000000,546.849,707.32,638.361,540.805,622.782,726.327,569.57,
55.000000,561.16,626.688,567.725,527,568.96,554.975,516.516,
56.000000,547.9,579.12,552.164,523.865,564.909,547.6,502.819,
57.000000,522,545.266,510.926,549.061,535.791,511.648,477.996,
58.000000,497.996,536.446,467.588,523.056,533.81,522.529,492.19,
59.000000,478.04,517.774,486.998,514.5,509.895,496.514,468.896,
60.000000,504,514.372,484.532,496.14,508.102,491.108,470.112,
61.000000,524.956,485.576,493.45,501.9,528.85,521.957,472.34,
62.000000,528.432,499.54,495.951,550,576.34,534.128,505.044,
63.000000,561.788,535.624,537.929,554.936,606.597,563.632,481.058,
64.000000,609.984,589.024,568.723,567.468,651.483,608.775,578.328,
65.000000,595.888,605.226,605.37,623.272,635.138,661.046,577.18,
66.000000,606.012,649.052,605.504,671.132,677.383,713.314,581.082,
67.000000,644.772,647.232,654.375,665.857,634.362,733.022,592.332,
68.000000,662.22,697.825,629.29,665.612,632.635,744.15,597.25,
69.000000,634.956,676.028,560.516,644.595,591.3,686.894,599.942,
70.000000,613.9,638.78,560.355,603.709,575.148,649.587,544.755,
71.000000,558.532,631.3,548.066,593.962,534.349,633.71,515.206,
72.000000,528.532,598.85,509.817,579.208,526.19,541.52,509.202,
73.000000,528.02,583.758,527.256,547.42,507.809,547.008,465.078,
74.000000,494.008,517.034,513.223,523.128,515.913,505.312,467.902,
75.000000,476.092,518.744,484.568,508.606,523.951,489.136,465.024,
76.000000,489.784,501.928,469.14,501.436,509.087,495.028,478.136,
77.000000,482.506,480.78,471.481,492.998,520.644,482.459,478,
78.000000,490.46,499.168,493.553,520.3,532.184,493.564,458.998,
79.000000,532.164,483.272,489.95,537.874,542.392,529.496,481.504,
80.000000,557.18,520.48,500.884,624.748,540.961,520.008,475.032,
81.000000,560.248,528.06,532.949,616.598,578.169,531.866,502.914,
82.000000,568.976,545.7,575.018,610.025,563.536,593.274,516.482,
83.000000,556.8,565.06,603.09,655.863,548.019,609.749,522.535,
84.000000,609.188,591.993,607.363,596.792,562.032,554.237,529.74,
85.000000,576.248,608.65,584.725,571.09,552.991,554.894,527.061,
86.000000,596.242,605.8,559.115,534.105,537.932,554.491,528.81,
87.000000,550.203,590.329,532.97,511.25,531.717,527.865,509.231,
88.000000,518.85,573.83,568.28,560.392,525.155,514.702,506.288,
89.000000,533.06,558.632,506.161,506.744,515.221,477.05,477.811,
90.000000,517.05,520.428,523.902,522.832,490.028,489.213,483.608,
91.000000,501.984,524.072,495.04,495.1,478.042,474.78,470.96,
92.000000,482.92,492.802,487.07,489.86,479.252,510.983,456.052,
93.000000,468.058,517.254,523.055,500.882,493.88,485.93,475.002,
