Time [ms],1000000000,1000000001,1000000002,
0,52190,65534.9,49401.9,
1000000000,15003,22036.1,14571.1,
2000000000,7382.09,10503.4,7263.22,
3000000000,4484.36,7018.76,5159.99,
4000000000,3392.21,5621.68,4041.75,
5000000000,2624.9,4571.19,3801.74,
6000000000,2238.12,4174.42,3384.86,
7000000000,2031.83,4011.33,4472.11,
8000000000,1955.88,2986.65,3992.13,
9000000000,1875.86,2578.84,3450.38,
10000000000,1747.51,2137.09,2554.51,
11000000000,1424.88,1910.27,2212.9,
12000000000,1253.08,1765.05,2091.96,
13000000000,1224.13,1662.82,2140.02,
14000000000,1252.76,1809.26,2196.84,
15000000000,1410.64,1999.86,2364.56,
16000000000,1497.66,2170.03,2726.72,
17000000000,2002.88,1886.72,3171.12,
18000000000,2098.93,2476.08,3389.89,
19000000000,2120.86,2731.88,3758.09,
20000000000,2119.34,2567.49,3719.61,
21000000000,1731.88,2350.2,3249.53,
22000000000,1673.94,2224.4,2809.88,
23000000000,1667.11,1889.28,2405.41,
24000000000,1633.01,1738.8,2344.26,
25000000000,1409.02,1571.95,2308.04,
26000000000,1461.08,1449.2,2134.08,
27000000000,1289.43,1346.62,1943.24,
28000000000,993.084,1272.98,1847.15,
29000000000,995.28,1194.1,1748.81,
30000000000,1072.03,1185.21,1684.1,
31000000000,1189.02,1265.76,1604.06,
32000000000,1308.9,1271.19,1641.73,
33000000000,1269.02,1408.14,1836.66,
34000000000,1419,1363.86,1799.77,
35000000000,1532.73,1555.69,1933.18,
36000000000,1516.26,1647.75,2099.24,
37000000000,1727.17,1664.92,2095.88,
38000000000,1695.91,1769.76,2171.31,
39000000000,1731.94,1916.91,2220.88,
40000000000,1405.29,1802.72,2054.94,
41000000000,1513.56,1728.86,2006.84,
42000000000,1553.93,1686.2,1985.44,
43000000000,1748.2,1599.9,1919.6,
44000000000,1411.19,1567.37,1726,
45000000000,1347.98,1491.91,1756.87,
46000000000,1410.14,1426.61,1699.11,
47000000000,1423.93,1406.7,1600.02,
48000000000,1409.12,1491.62,1530.81,
49000000000,1406.86,1354.82,1520.95,
50000000000,1286.09,1334.88,1359.77,
51000000000,1320.03,1381.38,1400.11,
52000000000,1236.92,1271.81,1508.83,
53000000000,1255.11,1390.9,1511.88,
54000000000,1290.91,1232.86,1477.48,
55000000000,1406.04,1274.88,1478.15,
56000000000,1337.04,1287.93,1588.75,
57000000000,1277.03,1288.57,1623.88,
58000000000,1329.82,1346.9,1518.3,
59000000000,1349.89,1488.77,1651.05,
60000000000,1318.16,1570.78,1550.99,
61000000000,1324.98,1574.23,1546.74,
62000000000,1362.03,1501.05,1532.87,
63000000000,1283.44,1467.03,1559.02,
64000000000,1299.49,1388.05,1520.12,
65000000000,1379.63,1490.11,1506.77,
66000000000,1372.5,1470.77,1576.68,
67000000000,1423.58,1535.7,1532.43,
68000000000,1315.96,1453.81,1474.8,
69000000000,1361.86,1450.08,1482.33,
70000000000,1343.55,1407.17,1362.85,
71000000000,1382.87,1307.96,1476.21,
72000000000,1287.89,1273.65,1405.01,
73000000000,1261.91,1306.17,1377.18,
74000000000,1269.99,1340.72,1342.7,
75000000000,1210.4,1382.97,1324.72,
76000000000,1215.9,1308.97,1309.07,
77000000000,1286.52,1392.4,1429.47,
78000000000,1253.44,1339.19,1465.81,
79000000000,1179.92,1375.34,1446.1,
80000000000,1193.33,1406.97,1446.82,
81000000000,1203.48,1346.7,1444.02,
82000000000,1257.98,1284.08,1515.24,
83000000000,1179.99,1294.1,1423.84,
84000000000,1253.98,1284.11,1565.05,
85000000000,1254.59,1229.87,1508.06,
86000000000,1238.4,1249.01,1546.14,
87000000000,1296.98,1324.17,1495.93,
88000000000,1310.44,1336.99,1467.91,
89000000000,1300.9,1383,1430.91,
90000000000,1226.93,1381.19,1396.1,
91000000000,1169,1354.79,1352.05,
92000000000,1152.92,1284.78,1394.13,
93000000000,1148,1310.3,1359.93,
94000000000,1184.48,1329.08,1315.04,
95000000000,1162.4,1241.12,1292.1,
