Frame number,1000000000,
0.000000,422.488,
1.000000,414.476,
2.000000,416.002,
3.000000,420.512,
4.000000,414.008,
5.000000,408.512,
6.000000,408,
7.000000,406.006,
8.000000,410.492,
9.000000,417,
10.000000,409.008,
11.000000,401.988,
12.000000,412.517,
13.000000,408.036,
14.000000,409.496,
15.000000,415.972,
16.000000,402.992,
17.000000,413.05,
18.000000,419.488,
19.000000,415.497,
20.000000,413.98,
21.000000,416.992,
22.000000,415.04,
23.000000,411,
24.000000,408.996,
25.000000,419.036,
26.000000,409.496,
27.000000,407,
28.000000,409.52,
29.000000,397.977,
30.000000,404.016,
31.000000,406.508,
32.000000,405.016,
33.000000,404.492,
34.000000,412.5,
35.000000,406.992,
36.000000,418.982,
37.000000,409.984,
38.000000,406.992,
39.000000,403.52,
40.000000,409.477,
41.000000,414.984,
42.000000,411.974,
43.000000,414.48,
44.000000,405.964,
45.000000,413,
46.000000,404.5,
47.000000,407.508,
48.000000,403.486,
49.000000,412.98,
50.000000,403.512,
51.000000,418.509,
52.000000,419.5,
53.000000,408.488,
54.000000,407.48,
55.000000,409.488,
56.000000,414,
57.000000,409.968,
58.000000,411.976,
59.000000,411.97,
60.000000,422.002,
61.000000,406.01,
62.000000,409.04,
63.000000,409.016,
64.000000,410.978,
65.000000,410.996,
66.000000,412.997,
67.000000,404.98,
68.000000,411.972,
69.000000,406.996,
70.000000,416.008,
71.000000,405.006,
72.000000,415.96,
73.000000,408,
74.000000,413.064,
75.000000,409.986,
76.000000,414.984,
77.000000,401.952,
78.000000,410.03,
79.000000,407.94,
80.000000,401.06,
81.000000,413.012,
82.000000,404.963,
83.000000,414.025,
84.000000,409.002,
85.000000,409.968,
86.000000,408,
87.000000,417.003,
88.000000,414.003,
89.000000,417,
90.000000,416.996,
91.000000,414.008,
92.000000,422.014,
93.000000,410.992,
94.000000,415,
