Time [ms],1000000000,1000000001,1000000002,
0,857.048,774.85,663.924,
1000000000,844.95,788.956,743.948,
2000000000,824.052,743.9,769.08,
3000000000,946.29,778.244,826.24,
4000000000,1071.85,862.928,933.844,
5000000000,1092.43,864.83,911.087,
6000000000,1145.75,967.91,915.9,
7000000000,1081.93,869.69,880.85,
8000000000,1084.08,861.27,868.065,
9000000000,977.229,841.76,829,
10000000000,923.076,813.488,726.948,
11000000000,813.945,753.98,704.88,
12000000000,774.126,689.902,647.928,
13000000000,784.963,611.995,587.901,
14000000000,695.074,636.805,596.178,
15000000000,688.868,668.904,554.996,
16000000000,640.929,628.95,544.96,
17000000000,631.122,577.999,527.06,
18000000000,602.074,545.08,517.472,
19000000000,592.986,603.059,549.512,
20000000000,607.075,604.861,575.04,
21000000000,691.03,651.846,637.844,
22000000000,679.995,688.951,650.208,
23000000000,772.934,651.979,732.071,
24000000000,736.988,690.974,710.597,
25000000000,838.163,683.871,789,
26000000000,756.855,682.988,727.94,
27000000000,700.974,730.885,747,
28000000000,775.967,668.961,662.174,
29000000000,774.964,674.967,642.648,
30000000000,662.934,656.981,616.04,
31000000000,668.038,594.994,590.542,
32000000000,648.992,593.096,565.072,
33000000000,614.014,578.062,527.984,
34000000000,599.914,533.034,524.524,
35000000000,585.921,546.99,528.489,
36000000000,554.982,513.864,516.996,
37000000000,553.978,538.874,484.58,
38000000000,544.11,529.932,507.494,
39000000000,591.973,532.958,542.5,
40000000000,593.03,570.086,563.68,
41000000000,620.076,573.932,613.525,
42000000000,666.976,602.026,644.031,
43000000000,655.06,599.888,646.941,
44000000000,714.328,632.932,674.78,
45000000000,678.044,613.868,632.552,
46000000000,678.1,629.925,635.02,
47000000000,676.076,602.936,629.056,
48000000000,640.959,572.885,589.088,
49000000000,621.908,575.124,559.962,
50000000000,617.88,559.891,546.02,
51000000000,614.964,548.049,504.06,
52000000000,577.96,546.942,513.956,
53000000000,591.024,511.951,506.088,
54000000000,561.994,523.954,501.16,
55000000000,563.074,544.984,510.06,
56000000000,566.044,529.069,494.04,
57000000000,557.12,542.955,501.983,
58000000000,566.995,537.942,524.071,
59000000000,554.931,562.087,534.955,
60000000000,574.1,566.091,569.098,
61000000000,624.022,578.153,574.091,
62000000000,610.072,591.972,565.203,
63000000000,601.409,596.934,617.089,
64000000000,625.06,611.052,588.916,
65000000000,593.55,584.097,598.839,
66000000000,615.04,563.224,538.816,
67000000000,582.11,557.864,550.072,
68000000000,595.1,562.061,554.038,
69000000000,556.88,528,530.908,
70000000000,569.016,534.991,501.008,
71000000000,557,510,498.947,
72000000000,565.048,532.97,495.95,
73000000000,544.92,507.92,483.059,
74000000000,550.932,508.063,489.032,
75000000000,515.072,492.934,485.064,
76000000000,530,519.934,492.986,
77000000000,546.872,513.04,502.058,
78000000000,549.022,520.094,507.107,
79000000000,570.086,537.896,544.926,
80000000000,570.936,540,553.924,
81000000000,605.028,556.977,549.91,
82000000000,611.97,549.112,555.776,
83000000000,579,582.943,533.107,
84000000000,597.948,550.064,569.968,
85000000000,580.88,571.006,547.065,
86000000000,578.018,568.926,526.888,
87000000000,564.004,545.935,525.12,
88000000000,560.038,531.2,533,
89000000000,534.96,541.996,529.981,
90000000000,553.92,537,489.986,
91000000000,545.096,533.018,501.996,
92000000000,525.048,509.996,491.904,
93000000000,513.082,521.069,480.538,
94000000000,523.904,514.938,482.467,
95000000000,532.896,520.088,468.05,
