Frame number,1000000000,1000000001,1000000002,
0.000000,13363.2,8673.03,15254.9,
1.000000,4172.05,4695.77,7574.68,
2.000000,4877.02,5721,6619.74,
3.000000,7434.11,9207.16,7325.64,
4.000000,9680.34,11265.8,8689.38,
5.000000,9025.47,9726,7119.94,
6.000000,6569.12,7382.56,5243.8,
7.000000,5201.96,5613.98,4511.05,
8.000000,4234.99,4225.49,4005.38,
9.000000,3359.03,3210.25,3751.5,
10.000000,2542.8,2496.69,3224.44,
11.000000,2139.03,1905.96,2563.2,
12.000000,1837.31,1644.3,2162.32,
13.000000,1633.3,1471.26,1935.79,
14.000000,1561.2,1442.07,1864.41,
15.000000,1386.86,1431.72,1684.91,
16.000000,1235.13,1392.22,1662.56,
17.000000,1390.08,1565.97,1767.02,
18.000000,1723.94,2184.29,2075.83,
19.000000,3007.72,3535.06,2627.37,
20.000000,4013.97,5134.74,3290.32,
21.000000,4295.35,5331.84,3556.46,
22.000000,3518.95,4359.02,3094.43,
23.000000,2992.98,3638.52,2784.96,
24.000000,2619.51,3087.19,2541.32,
25.000000,2214.76,2663.47,2334.96,
26.000000,1983.34,2094.77,2099.4,
27.000000,1713.19,1640.18,1805.93,
28.000000,1406.89,1344.9,1535.02,
29.000000,1162.14,1154.13,1343.96,
30.000000,1088.9,1026.5,1198.58,
31.000000,1009.09,983.04,1112.5,
32.000000,1006.86,966.944,1016.44,
33.000000,1114.9,1052.04,1026.11,
34.000000,1257.2,1382.66,1108.17,
35.000000,1809.23,2131.64,1508.2,
36.000000,2598,3177.85,1998.83,
37.000000,2992.64,3920.88,2515.67,
38.000000,2769.14,3470.92,2231.23,
39.000000,2242.56,2760.85,2146.23,
40.000000,2001.46,2404.32,1955.65,
41.000000,1796.37,2023.05,1843.62,
42.000000,1602.64,1696.66,1761.93,
43.000000,1407.63,1401.75,1539.86,
44.000000,1197.9,1131.47,1339.94,
45.000000,1025.66,984.96,1139.99,
46.000000,896.436,880,1072.98,
47.000000,843.027,817.536,950.92,
48.000000,816.056,765.952,905.96,
49.000000,790.08,819.448,849.064,
50.000000,840.896,939.986,922.088,
51.000000,1046.21,1278.25,1121.99,
52.000000,1413.27,1924.34,1532.79,
53.000000,1941.76,2528.04,1918.27,
54.000000,2112.32,2549.65,2062.54,
55.000000,1929.13,2155.76,1897.26,
56.000000,1898.99,1963.54,1744.84,
57.000000,1695.77,1738.37,1628.12,
58.000000,1554.82,1502.1,1574.86,
59.000000,1385.74,1335.25,1430.11,
60.000000,1217.95,1109.83,1258.86,
61.000000,1102.01,952.94,1119.19,
62.000000,926.96,812.034,1055.12,
63.000000,911.01,792.04,959.955,
64.000000,816.87,722.008,873.959,
65.000000,774.926,681.08,818.96,
66.000000,791.112,690.9,808.988,
67.000000,862.956,814.464,970.076,
68.000000,1066.81,996.584,1180.96,
69.000000,1303.28,1528.98,1475.33,
70.000000,1743.2,2046.1,1674.67,
71.000000,1716.23,1963.31,1754.81,
72.000000,1681.17,1777.88,1613.97,
73.000000,1535.02,1542.95,1475.15,
74.000000,1396.94,1361.56,1394.09,
75.000000,1345.21,1182.92,1260.19,
76.000000,1174.13,1018.89,1142.93,
77.000000,1045.02,919.988,1027.97,
78.000000,950.95,835.049,930.044,
79.000000,880.912,720.04,873.976,
80.000000,794,676.52,788,
81.000000,752.04,646.954,754.046,
82.000000,729.076,634.995,770.938,
83.000000,745,678.96,830.996,
84.000000,772.029,832.056,973.928,
85.000000,983.83,1176.37,1129.83,
86.000000,1222.64,1525.98,1253.98,
87.000000,1593.1,1592,1414.58,
88.000000,1668.85,1500.22,1353.57,
89.000000,1606.71,1384.22,1338.54,
90.000000,1424.93,1235.97,1255.5,
91.000000,1309.84,1105,1198.51,
92.000000,1226.93,945.848,1071.98,
93.000000,1106.13,872,984.005,
94.000000,1034.9,809.147,928.084,
95.000000,895.1,719.124,832.44,
