Frame number,1000000000,1000000001,1000000002,1000000003,1000000004,1000000005,1000000006,
0.000000,995.448,655.096,674.954,601.376,688.854,557.848,593.896,
1.000000,692.324,539.992,523.901,496.94,693.08,508.12,459.936,
2.000000,565,544.528,507.015,485.48,650.96,454.56,448.476,
3.000000,577.914,517.448,536.068,488.936,636.916,454.992,441.528,
4.000000,539.968,508.517,500.88,470.92,477.003,446.04,438.076,
5.000000,509.956,499.972,490.072,466.056,490.991,443.056,436.044,
6.000000,553.882,484.996,497.004,453.012,495.48,444.958,444.982,
7.000000,537.968,466.518,472.974,468,490.42,458.532,448.884,
8.000000,560.02,475.52,473.992,460.936,460.011,457.956,435.88,
9.000000,544.064,466.544,465.98,484.028,454.11,461,429.99,
10.000000,563.068,467.504,466.01,456.96,447.984,447.988,444,
11.000000,538.968,464,481.968,469.048,439.04,463.02,438.94,
12.000000,577.925,482.53,465.955,478.9,447.996,447.956,442.06,
13.000000,544.04,480.064,486.02,465.928,455.978,471.48,452.003,
14.000000,593.965,503.576,497.975,506.082,456.024,471.926,457.028,
15.000000,673.184,527.476,528.09,530.06,470,509.944,453.056,
16.000000,728.212,576.624,565.052,554.872,485.088,515.055,476,
17.000000,762.08,626.448,616,621.316,505.884,550.88,490.872,
18.000000,763.236,635.998,618.112,694.784,495.112,544.104,513.88,
19.000000,775.702,633.75,613.074,605.076,524.024,589.964,505.948,
20.000000,723.764,632.9,632,589.04,516.5,585.046,488.88,
21.000000,704.23,607.002,588.075,543.88,500.984,590.084,490.932,
22.000000,672.94,592.896,596.112,529.816,496.51,521.1,489.924,
23.000000,650.736,570.956,560.016,489.848,483.012,492.492,470.04,
24.000000,638.98,543,565.98,520.062,485.49,504.1,478.994,
25.000000,592.873,522.874,573.1,472.806,464.44,509.576,479.964,
26.000000,605.062,497.046,528,489.07,454,532.86,475.958,
27.000000,570.888,484.088,520.017,461.972,444.086,511.922,451,
28.000000,540.039,489.92,483.988,467.926,439.052,528.06,446.087,
29.000000,537.05,484.018,501,457.034,439,498.05,439.024,
30.000000,561.882,491.094,482.987,468.996,450,481.832,446.97,
31.000000,565.1,497.944,503.932,486.475,440.116,518.004,447.916,
32.000000,631.888,539.091,525.901,514.504,474.036,523.082,458.965,
33.000000,681.24,552.076,591.069,548.512,489.927,555.061,495.052,
34.000000,712.644,555.848,605.142,552.044,507.19,588.768,488.05,
35.000000,709.156,599.978,605.024,585.98,510.114,598.008,507.1,
36.000000,690.04,610.08,597.056,586.463,503.112,580,498.918,
37.000000,663.64,574.008,573.016,520.08,501.922,588.052,493,
38.000000,645.056,553.862,547.104,495.972,513,546.122,497.08,
39.000000,641.162,546.068,533.444,487.424,479,536.924,469.508,
40.000000,600.32,547.02,490.52,476.048,470,530.938,440.46,
41.000000,562.936,505.01,506.532,489.88,446.06,499.008,459.05,
42.000000,547.54,500.042,495.012,465,458,518.054,449.029,
43.000000,531.54,483.97,489.48,450,442.98,482,458.926,
44.000000,519.556,462.968,459.509,442.07,445.96,475,459.016,
45.000000,504.02,463.948,468.006,438.976,435.088,467.904,444.516,
46.000000,508.12,458.02,446.56,438.944,436.96,444.054,446.49,
47.000000,478.964,451.046,452.974,444.02,433.496,463.971,443,
48.000000,514.86,459.04,475,436.96,451.035,465.949,428.08,
49.000000,526.1,469.008,495.52,444.496,443.028,478,442.54,
50.000000,561.944,477.992,508.06,447.992,438.986,523,460.97,
51.000000,573.844,501.104,524.474,487.988,466.096,501.076,458.032,
52.000000,600.18,538.88,525.08,482.98,477.032,541.987,480.964,
53.000000,596.296,521.12,552.568,484.032,475.544,545.98,465.92,
54.000000,604.16,524.216,532.996,484.992,467.416,503.926,459.5,
55.000000,568.048,528.999,526.496,480.46,465.988,509.966,481.003,
56.000000,563.088,524.104,488.56,463.478,454,503.924,457.002,
57.000000,560.952,480,483.512,469.036,458.946,480.176,458.448,
58.000000,542.836,474.92,464.48,454.988,445.964,505.988,441.512,
59.000000,518.08,470.918,452.936,445.472,441,497.046,427.52,
60.000000,509.008,468.006,444.504,454.972,449.036,502.898,430.504,
61.000000,482.886,465.033,448.964,425.472,428.468,459,433.496,
62.000000,497.1,452.096,433.456,432.504,436.496,467,420.502,
63.000000,497.026,468.974,434.98,433.967,433.52,454.952,417.496,
64.000000,496.078,463.464,430.52,439.044,426.482,454.948,423.52,
65.000000,462.966,453,428.476,428.024,422.976,450.971,427.996,
66.000000,487.96,439.018,449.004,448.984,425.986,455.96,434.98,
67.000000,496.024,437.02,457.976,437.968,436.022,455.984,433.004,
68.000000,546.076,480.048,460.966,460.998,429,472,436.004,
69.000000,543.875,473.104,484.54,476.956,444.464,481.018,454.902,
70.000000,566.912,498.922,504.96,465,431.014,512.104,496.04,
71.000000,590.987,512.06,492.044,450.992,451.052,510.904,476.034,
72.000000,545.015,536.544,497.046,485.936,456.98,487.99,477.033,
73.000000,554.025,533.022,491.898,470.952,447.039,514.806,463.026,
74.000000,541.052,531.534,477,462.048,446.93,472.06,464.088,
75.000000,562.932,504.486,468.501,454.048,446.044,470.074,445.496,
76.000000,503.998,491.488,457.032,449.928,427,463.04,435.014,
77.000000,484.967,476.078,447.1,436.012,426.94,463.008,439.488,
78.000000,475.112,452.932,448.04,442.06,429,454.07,435.02,
79.000000,472.096,443.01,435.94,442.048,425.02,460.416,433.485,
80.000000,472.992,434.956,426.9,437.96,426.016,460.44,430.016,
81.000000,460.978,444.06,427.984,426.044,426.02,441.064,431.52,
82.000000,477,444.002,424.018,428.044,426.008,449.96,425.012,
83.000000,458.025,434.024,426.036,432.016,425.022,447.992,430.961,
84.000000,458.068,433.002,430.978,440.092,418.976,441.036,426.01,
85.000000,476.996,444.956,427,441.952,419.992,445.02,437.5,
86.000000,478.07,451.06,433.552,458.06,425.965,452.53,429.02,
87.000000,483.05,445.036,434,455.104,436.012,468.448,460.027,
88.000000,523.892,444.946,443.904,495.024,432.058,493.992,449.992,
89.000000,538.04,473.914,449.944,482.024,433.95,492.04,471.564,
90.000000,545.128,477.944,464.988,475.02,434.056,496.5,474.517,
91.000000,546.92,474.116,460.034,492.892,437.028,492,468.956,
92.000000,555.09,508.52,454.032,510.948,433.996,497.508,462.539,
93.000000,553.98,512.584,445.064,464.94,441.032,480,447.505,
