
Intensity Median
 ==================== 
Time [s],1000000000,1000000001,1000000002,1000000003,
0.000000,3851.6,5797.42,6729.83,2906.4,
1.000000,1516.01,2238.1,1806.98,1375.85,
2.000000,1023.02,1366.16,945.116,837.06,
3.000000,1216.1,1540.97,904.04,1026.09,
4.000000,1354.85,2052.94,1082.86,1291.62,
5.000000,1413.98,2338.04,1269.04,1435.97,
6.000000,1439.12,2361.98,1297.84,1381.03,
7.000000,1441,2407.85,1273.2,1412.16,
8.000000,1357.1,2339.68,1116.95,1324.96,
9.000000,1263.05,2152.03,1005.02,1228.83,
10.000000,1244.24,2073.9,982.022,1158.15,
11.000000,1126.04,1859.09,942.972,1142.09,
12.000000,1057.44,1754.94,865.036,1076.03,
13.000000,1029.97,1609,870.08,1098.01,
14.000000,910.86,1462.97,807.424,1007.18,
15.000000,853.512,1350.96,765.968,1022.88,
16.000000,806.024,1281.98,740.5,974.06,
17.000000,794,1167.99,707.99,941.35,
18.000000,822.024,1143,779.932,968.084,
19.000000,858.026,1350.99,895.992,1087.97,
20.000000,991.156,1560.93,985.016,1202.86,
21.000000,1051.04,1712.08,1049.95,1251.12,
22.000000,1094.85,1846,1041.08,1340.17,
23.000000,1127.91,1885.11,1165.85,1203.54,
24.000000,1103.95,1863.6,1078.01,1185.32,
25.000000,994.04,1775.89,1024.11,1196.88,
26.000000,978,1685.12,991.964,1148.98,
27.000000,977,1551.08,959.46,1057,
28.000000,890.95,1367.94,886.996,1005.14,
29.000000,895.928,1322.02,845.956,951.915,
30.000000,836.944,1217.05,798.992,871.967,
31.000000,772.927,1102.94,745.992,860.472,
32.000000,758.056,1055.98,731.98,832.496,
33.000000,786.004,1038.98,759.076,843.056,
34.000000,820.024,1169.07,776.012,858.06,
35.000000,803.496,1298.96,780.054,861.84,
36.000000,852.023,1400.03,801.936,930.932,
37.000000,876.04,1441.05,809.034,962.88,
38.000000,896.04,1479.05,819.924,1006.98,
39.000000,857.984,1458.97,836.02,1004.13,
40.000000,883.476,1409.07,833.088,957.904,
41.000000,818.97,1359.06,821,904.936,
42.000000,764.916,1297.04,781.044,836.056,
43.000000,749.5,1225.98,756.95,844,
44.000000,735.525,1144.05,731.08,823.04,
45.000000,711.064,1076.02,718.984,787.944,
46.000000,682.016,1029.02,702.056,703.072,
47.000000,674,948.969,667.924,735.072,
48.000000,668.01,927.992,671.016,734.056,
49.000000,655.488,985.956,661.05,704.016,
50.000000,659.023,1010.04,681.475,703.012,
51.000000,636.1,1019.96,690.008,739.95,
52.000000,682.026,1064.98,680.05,744.976,
53.000000,677.916,1062.03,669.984,753.014,
54.000000,696.956,1073.98,697.016,771.08,
55.000000,685.015,1065.96,650.976,741.044,
56.000000,665.034,1002.04,663.054,707.912,
57.000000,676.016,988.056,682.07,723.032,
58.000000,628.968,928.964,675.04,694.004,
59.000000,620.076,931.012,641.011,668.964,
60.000000,622.983,855.048,630.056,651.948,
61.000000,603.01,818.02,614.976,648.052,
62.000000,602.038,786.016,631.023,645,
63.000000,599.046,791.487,617.5,606.96,
64.000000,605.05,778.516,595.952,627.004,
65.000000,594,789.994,610.975,634.052,
66.000000,603.5,815.968,633.454,639.01,
67.000000,601.04,838.99,607.488,639.048,
68.000000,605.523,827.032,604.526,649.068,
69.000000,613.036,827.95,621.488,639.056,
70.000000,598.996,785.052,583.94,626.044,
71.000000,588.464,800.984,601.516,645,
72.000000,589,790.073,603.082,641.94,
73.000000,578.478,759.964,587.52,629.968,
74.000000,576.008,746.04,582.5,596.066,
75.000000,583.017,704.032,569.48,606.04,
76.000000,551.944,713.014,567.52,594.004,
77.000000,538.008,663.092,563.988,568.968,
78.000000,548.952,664.966,570.518,579,
79.000000,554.992,653.059,568,587.03,
80.000000,546.034,657.969,559.992,583.98,
81.000000,548.98,669.998,555.992,588.994,
82.000000,544,652.042,547.484,589.568,
83.000000,542.004,658.946,560.001,578.024,
84.000000,560.029,668,545.004,604.496,
85.000000,550,644.056,537.964,588.994,
86.000000,541.981,649.976,541.004,569.532,
87.000000,549.058,638.984,546.524,574.472,
88.000000,533.017,621.984,541.959,582.44,
89.000000,513.976,614.02,551.024,574.512,
90.000000,512.008,601.004,533.003,551.022,
91.000000,504.96,579.028,529.987,554.02,
92.000000,515.504,579.992,526.024,562.984,
93.000000,497,573.032,523.024,536,
94.000000,519,570.08,526,555.988,
95.000000,512.488,576.056,527.996,538.012,
96.000000,513.488,572.996,523.51,546.03,
97.000000,522.507,583.048,525.964,543.968,
