Time [ms],1000000000,1000000001,1000000002,
0,21639.4,21976.6,30224.3,
1000000000,8497.92,7782.6,13885.4,
2000000000,4306.85,3926.26,6954.47,
3000000000,2893,2491.14,3636.78,
4000000000,2303.65,1991.94,2209.84,
5000000000,1890.91,1729.5,1474.58,
6000000000,1520.26,1486.44,1135.86,
7000000000,1296.11,1342.58,950.084,
8000000000,1109.5,1217.01,868.968,
9000000000,1008.07,1123.52,838.096,
10000000000,948.742,1108.9,828.092,
11000000000,857.928,1009.99,825.464,
12000000000,849.9,1011.93,836.498,
13000000000,822.082,961.04,838.109,
14000000000,876.152,951.997,857.188,
15000000000,1089.95,941.9,1008.78,
16000000000,1369.53,991.814,1141.66,
17000000000,1446.72,1004.08,1244.88,
18000000000,1663.15,1115.82,1338.07,
19000000000,1739.51,1298.85,1281.01,
20000000000,2017.9,1328.04,1280.88,
21000000000,1890.1,1312.66,1195,
22000000000,1703.9,1274.08,1106.93,
23000000000,1581.14,1284.08,1071.88,
24000000000,1335.23,1135.16,1024.95,
25000000000,1270.37,1041.81,1054.52,
26000000000,1144.88,1001.92,1082.03,
27000000000,1152.87,916.085,1176.03,
28000000000,966.432,925.96,1166.68,
29000000000,1049.56,864.952,1147.88,
30000000000,1046.07,861.956,1113.74,
31000000000,992.44,823.862,1061.05,
32000000000,1005.02,839.061,1159.17,
33000000000,1101.58,836,1109.07,
34000000000,1253.84,839.46,1088,
35000000000,1291.9,849.04,1055.23,
36000000000,1448.73,859.528,1115.94,
37000000000,1450.2,894.424,1054,
38000000000,1459.18,950.608,1044.82,
39000000000,1414.94,949.132,1010.11,
40000000000,1478.22,879.98,1095.14,
41000000000,1427.41,838,1050.98,
42000000000,1355.85,863.9,1036.5,
43000000000,1284.43,862.012,1063.48,
44000000000,1264.36,864.045,1011.09,
45000000000,1191.74,834.872,1016.91,
46000000000,1128.55,785.82,1042.03,
47000000000,1022.21,803.572,999.985,
48000000000,1024.22,758.2,961.859,
49000000000,1088.2,706.528,951.069,
50000000000,966.34,729.94,960.99,
51000000000,1028.17,745.035,924.945,
52000000000,1014.05,721.962,918.02,
53000000000,1102.21,749.544,896.944,
54000000000,1102.82,762.46,887.055,
55000000000,1162.91,753.472,870.08,
56000000000,1216.74,753.984,840.02,
57000000000,1235.69,739.964,843.02,
58000000000,1209.2,739.072,858.115,
59000000000,1236.02,769.16,816.42,
60000000000,1251,770.008,833.946,
61000000000,1122.86,718.944,838.008,
62000000000,1047.17,731.936,846.164,
63000000000,1038,741.08,838.997,
64000000000,1074.1,721.066,852.962,
65000000000,1007.87,726.056,839.904,
66000000000,984,719.064,848.944,
67000000000,921.978,678.112,826.078,
68000000000,900.741,685.11,840.94,
69000000000,927.831,669.016,838.026,
70000000000,824.015,672.07,802.48,
71000000000,851.416,678.096,813.044,
72000000000,843.247,684.032,807.416,
73000000000,894.948,699.024,810.52,
74000000000,928.028,694.024,805.516,
75000000000,963.904,690.98,781.996,
76000000000,905.948,701.95,780.928,
77000000000,929.536,727.912,826.048,
78000000000,945.57,697.96,825.98,
79000000000,907.576,709.045,796.036,
80000000000,892.08,702.068,746.484,
81000000000,909.54,715.06,754.95,
82000000000,889.896,700.994,772.44,
83000000000,821.888,702.02,736.526,
84000000000,835.85,674.142,734.044,
85000000000,786.836,699.04,762.44,
86000000000,805.12,661,789,
87000000000,763.4,672,766.915,
88000000000,771.878,634.005,782.124,
89000000000,811.008,662.04,748.015,
90000000000,817.468,626.043,738.966,
91000000000,831.344,641.04,752.506,
92000000000,803.495,653,712.072,
93000000000,855.024,625.99,736.04,
94000000000,881.528,620.006,747.502,
95000000000,824.084,660.015,730.923,
