Frame number,1000000000,1000000001,
0.000000,1101.74,1561.64,
1.000000,1028.89,1126.76,
2.000000,1357,1309,
3.000000,1567.96,1395.92,
4.000000,1762.82,1523.2,
5.000000,1792.81,1594.22,
6.000000,1663.2,1570.78,
7.000000,1683.92,1454.25,
8.000000,1588.97,1383.83,
9.000000,1463.94,1273,
10.000000,1368.97,1214.04,
11.000000,1310.07,1200.12,
12.000000,1268.1,1186.24,
13.000000,1216.06,1102.03,
14.000000,1187.92,1110,
15.000000,1156.08,1133.82,
16.000000,1152.9,1034.23,
17.000000,1126,1012.04,
18.000000,1152.93,991.062,
19.000000,1156.81,962.88,
20.000000,1196.05,989.992,
21.000000,1287.14,1042.08,
22.000000,1296.15,1034.03,
23.000000,1343.07,1046.51,
24.000000,1316.04,1037.45,
25.000000,1283.03,1025.95,
26.000000,1157.05,981.952,
27.000000,1133.11,1000.59,
28.000000,1119.78,930.1,
29.000000,1021,884.988,
30.000000,996.984,903.924,
31.000000,971.987,864.488,
32.000000,923.064,848.532,
33.000000,921.12,874.528,
34.000000,886.016,842.876,
35.000000,886.98,800.932,
36.000000,863.912,807.12,
37.000000,857.034,833.51,
38.000000,869.84,821.926,
39.000000,890.92,829.024,
40.000000,945.04,802.404,
41.000000,912.12,863.02,
42.000000,887.862,841.464,
43.000000,924.992,817.024,
44.000000,861.91,829.56,
45.000000,904,781.964,
46.000000,867.48,756.552,
47.000000,820.923,739,
48.000000,781.969,742.072,
49.000000,787.482,734.034,
50.000000,790,737.008,
51.000000,800.994,698.086,
52.000000,787.124,702.916,
53.000000,773.046,679.6,
54.000000,782.972,697.9,
55.000000,778.96,673.12,
56.000000,806.961,666.92,
57.000000,796.076,671.916,
58.000000,829.91,672,
59.000000,810.88,685.896,
60.000000,852.032,684.472,
61.000000,864.984,653.512,
62.000000,837.984,622.938,
63.000000,813.96,623.92,
64.000000,789.942,620.496,
65.000000,757.92,614.042,
66.000000,760.966,608.95,
67.000000,740.995,612.985,
68.000000,723.964,581,
69.000000,743.039,599.044,
70.000000,776.06,572.016,
71.000000,743.904,578.976,
72.000000,705.016,592,
73.000000,780.072,585.104,
74.000000,728.088,579.944,
75.000000,755.08,586.05,
76.000000,748.084,601.024,
77.000000,740.96,601.492,
78.000000,711.912,617.002,
79.000000,761.944,587,
80.000000,719.936,589.468,
81.000000,710.976,573.512,
82.000000,705.514,578.964,
83.000000,658.5,569.968,
84.000000,652.56,568.488,
85.000000,673.036,561.012,
86.000000,656.928,553,
87.000000,636.948,568.016,
88.000000,672,539.992,
89.000000,677.04,550,
90.000000,652.964,557.508,
91.000000,675.016,566.068,
92.000000,679,572,
93.000000,674.07,568.054,
94.000000,688.004,578,
95.000000,671.988,552.984,
