Frame number,1000000000,1000000001,1000000002,
0.000000,33391.5,26256,54758.6,
1.000000,19084,26652.9,18955.1,
2.000000,15727.6,23458,11796.3,
3.000000,15483.8,24409.3,25620.7,
4.000000,15204.2,26658,25020.3,
5.000000,15301.4,27465.8,13559.1,
6.000000,14903.4,26928.4,12074.3,
7.000000,17258.2,24537,12340.3,
8.000000,15430.6,22304.1,11982.7,
9.000000,13669.1,20008.4,12045,
10.000000,12414.6,16905.7,8331.9,
11.000000,12399.8,16169.9,8113.18,
12.000000,11735.9,15187.2,9516.82,
13.000000,11385.8,13981.3,8840.6,
14.000000,11192.4,12231.3,8257.14,
15.000000,11350.8,11018.3,8229.43,
16.000000,9918.18,9027.24,8208.06,
17.000000,9937.45,9034.1,8289.1,
18.000000,10808.6,9636.42,9252.03,
19.000000,11068,12117.8,7166.86,
20.000000,12063.7,14187.8,6177.14,
21.000000,12209.6,14949,6798.68,
22.000000,12196.5,15052.3,7286.03,
23.000000,11653.6,15139.1,7665.59,
24.000000,11346.4,13516,7895.87,
25.000000,10807.3,12040.7,8558.5,
26.000000,9581.32,10592.7,9379.15,
27.000000,8599.65,8931.28,8518.85,
28.000000,7807.79,7725.03,8241.1,
29.000000,7236.94,7270.62,8129.92,
30.000000,6794.13,6335.79,7679.08,
31.000000,6104.08,5598.06,7883.94,
32.000000,5710.83,5743.77,8160.46,
33.000000,5777.9,5630.38,8289.74,
34.000000,6167.63,6316.22,8222.07,
35.000000,7163.9,7587.92,8848.52,
36.000000,7949.13,9485.1,8267.39,
37.000000,8195.76,10725.2,8539.28,
38.000000,8542.59,11204.6,8750.81,
39.000000,8195.07,10525.6,8824.61,
40.000000,8118.59,10129.2,9050.46,
41.000000,7580.5,9291.57,8423.8,
42.000000,6869.58,8116.5,8545.44,
43.000000,6017.74,7303.1,8357.8,
44.000000,5508.14,6391.9,8333.54,
45.000000,4944.58,5146.46,8306.15,
46.000000,4301.48,4622.35,7782.04,
47.000000,4026.02,4113.95,7382.4,
48.000000,4058.14,4308.81,7233.32,
49.000000,4116.19,4551.95,7207.03,
50.000000,4182.77,5157.23,7735.26,
51.000000,4917.7,6526.78,7616.5,
52.000000,5729.2,8047.44,8079.14,
53.000000,6395.89,9436.13,7567,
54.000000,6571.5,9578,8273.36,
55.000000,6620.28,9620.84,8148.57,
56.000000,6736.6,9138.88,8447.58,
57.000000,6192.52,8283.57,8757.57,
58.000000,5543.35,7222.98,8421.86,
59.000000,4634.5,6082.72,8580.86,
60.000000,4167.36,5355.2,8049.76,
61.000000,3694.76,4821.5,7710.03,
62.000000,3308.13,4092.28,7344.44,
63.000000,2973.01,3784.55,7635.7,
64.000000,3011.95,3624.42,6942.69,
65.000000,3125,3803.41,6595.18,
66.000000,3621.3,4574.26,6808.86,
67.000000,4218.73,6227.12,7091.95,
68.000000,5018.02,7389.51,7012.71,
69.000000,5715.24,8089.92,6994.22,
70.000000,5926.59,8464.07,7076.2,
71.000000,5939.3,8371.84,7408.17,
72.000000,5637.87,8001.52,7286.12,
73.000000,5145.16,6906.91,7471.19,
74.000000,4475,6266.59,7938.43,
75.000000,4019,5217.07,8347.38,
76.000000,3364.84,4529.99,7144.57,
77.000000,3015.74,3949.89,6494.81,
78.000000,2622.55,3426.12,6250.37,
79.000000,2464.56,3055.16,5746.1,
80.000000,2663.96,3242.13,5485.26,
81.000000,3098.49,3509.55,5159.34,
82.000000,3740.68,4038.15,5189.42,
83.000000,4615.85,5500.46,6050.27,
84.000000,5223.82,6784.08,6042.54,
85.000000,5559.7,7729.22,6283.31,
86.000000,5629,7788.67,6041.92,
87.000000,5418,8262.89,5956.51,
88.000000,5129,7362.61,5416.38,
89.000000,4531.22,6524.92,6172.56,
90.000000,3783.12,5394.7,6460.66,
91.000000,3173.2,4768.15,6761.51,
92.000000,2967.39,4314.62,5914.9,
93.000000,2444.38,3681.09,5559.36,
94.000000,2325.77,3173.84,5467.5,
95.000000,2356.59,2945.27,5818.36,
