
Intensity Median
 ==================== 
Time [s],1000000000,1000000001,1000000002,1000000003,
0.000000,1597.92,1058.23,1012.43,790.35,
1.000000,1215.51,1214.33,1090.05,1084.24,
2.000000,1208.2,1235.2,1140.36,1016,
3.000000,884.681,1085.08,1097.1,1109.14,
4.000000,1043.29,1096.92,889.895,916.972,
5.000000,1086.26,1124.01,778.97,813.064,
6.000000,833.954,855.072,687.08,720.496,
7.000000,894.68,772.125,630.072,797.156,
8.000000,829.408,718.125,665.4,705.905,
9.000000,688.088,692.548,630.992,641.968,
10.000000,684.144,673.08,664.04,620.98,
11.000000,570.028,667.059,624.902,556.111,
12.000000,565.98,658.572,602,508.989,
13.000000,562.12,597.008,590.98,530.02,
14.000000,557,587.984,604.916,504,
15.000000,587.96,608.99,620.02,515.032,
16.000000,568.892,632.99,765.16,543.998,
17.000000,652,820.24,840.875,551.008,
18.000000,656.06,925.664,957.3,631.08,
19.000000,712.15,1025.7,978.64,614,
20.000000,636.86,1064.68,970.8,629.885,
21.000000,639.904,879.05,922.928,588.98,
22.000000,648.048,846.203,874.193,588.028,
23.000000,585.08,789.236,806.853,585.943,
24.000000,587.032,757.212,763.1,556.522,
25.000000,546.036,780.032,617.418,535.988,
26.000000,533.008,705.12,642.94,549.028,
27.000000,517.988,674.014,577.056,531.955,
28.000000,510.568,666.968,566.026,507.063,
29.000000,493.963,640.972,547.994,530.92,
30.000000,480.98,697.972,563.948,497.979,
31.000000,500.985,615.112,578.976,509.042,
32.000000,498.06,642.904,565.118,541.941,
33.000000,500.988,653.107,615.032,504.974,
34.000000,486.986,693.125,644.128,552.008,
35.000000,512.06,832.064,577.034,614.93,
36.000000,518.992,792.83,612,589.965,
37.000000,511.045,685.144,642.98,584.987,
38.000000,527.5,712.364,607.92,540.96,
39.000000,506.006,727.36,649.992,550.08,
40.000000,507.049,666.978,627.88,538.952,
41.000000,497.976,679.084,591.022,547.98,
42.000000,484.026,658.041,602.45,553.996,
43.000000,497.996,614.08,638.136,514.996,
44.000000,475.48,592.092,572.091,532.04,
45.000000,475.992,606.94,570.979,534.048,
46.000000,475.1,630.908,541.057,519.032,
47.000000,473.978,602.904,537.031,509.916,
48.000000,446.952,609.076,551.013,518.952,
49.000000,463.01,600.041,567.005,545.088,
50.000000,453.98,584.034,545.059,528.972,
51.000000,457.03,599.872,562.151,549.97,
52.000000,468.48,633,595.971,556,
53.000000,466.982,675.976,600.093,583.024,
54.000000,464.976,676.976,618.159,560.924,
55.000000,478.908,692.048,663.917,592.04,
56.000000,477.032,716.945,634.196,548.468,
57.000000,487.979,740.976,609.065,558.943,
58.000000,477.01,708.14,655.11,518.065,
59.000000,460.028,671.12,582.993,530.075,
60.000000,460.49,648.992,573.93,539.887,
61.000000,448.488,645.512,576.938,519.02,
62.000000,463.98,670.926,571.956,517.025,
63.000000,441.952,645.968,559.884,526.055,
64.000000,464.028,613.94,604.015,506,
65.000000,452.979,595.468,580.99,508.034,
66.000000,456.996,579.53,584.004,518.032,
67.000000,449,598.976,576.975,505.44,
68.000000,451.968,598.02,567.956,521.056,
69.000000,453.018,619.472,612.954,525.52,
70.000000,451.505,668.464,591.003,504.06,
71.000000,449,654.576,619.025,488.955,
72.000000,462.008,642.968,638.039,525.48,
73.000000,453.98,637.056,623.958,504.948,
74.000000,452,616.02,606.862,498.901,
75.000000,446.034,631.064,639.063,504.004,
76.000000,444.996,608,623.895,539.048,
77.000000,442.012,593.983,580.013,511.944,
78.000000,439.976,615.1,584.091,496.952,
79.000000,435.03,616.058,577.012,509.944,
80.000000,446,588.54,561.1,516.038,
81.000000,443.016,612.464,599.933,493.952,
82.000000,445.012,606.508,586.956,499.992,
83.000000,437,572.48,612.01,504.944,
84.000000,436.982,558.532,562.971,506.091,
85.000000,432.031,609.568,601.957,537.036,
86.000000,436.503,589.048,580.013,504.955,
87.000000,441.49,590.044,604.952,541.946,
88.000000,447.544,603.02,613.93,516.024,
89.000000,434.016,551.036,571.117,530.996,
90.000000,440.52,577.096,624.959,491.004,
91.000000,448.04,548.952,617.988,507.056,
92.000000,443.96,565.048,594.06,507,
93.000000,445.021,605,587.928,502.024,
94.000000,447.964,616.96,596.016,502.96,
95.000000,447.991,593.988,579.008,497.964,
96.000000,446.978,574,556.016,504,
97.000000,446.001,583.05,557.055,500.024,
