Frame number,1000000000,1000000001,
0.000000,636.976,604.005,
1.000000,588.766,790.5,
2.000000,841.4,932,
3.000000,726.96,931.776,
4.000000,1032.23,961.118,
5.000000,998.688,1022.8,
6.000000,1200.89,753.24,
7.000000,787.109,706.77,
8.000000,799.021,662.288,
9.000000,751.381,691.874,
10.000000,727.912,684.003,
11.000000,680.193,632.112,
12.000000,681.09,623.07,
13.000000,659.955,613.956,
14.000000,615,588.971,
15.000000,615.048,619.524,
16.000000,564.04,586.97,
17.000000,586.892,584.48,
18.000000,566.508,555.04,
19.000000,543.1,558.094,
20.000000,551.066,590.056,
21.000000,612.021,601.04,
22.000000,565.956,611.968,
23.000000,620.12,665,
24.000000,586.103,736.933,
25.000000,608.871,681.949,
26.000000,572.905,644.035,
27.000000,567.126,656.039,
28.000000,605.975,582.98,
29.000000,526.035,564.992,
30.000000,518.097,516.004,
31.000000,510.942,517.93,
32.000000,507.053,505.035,
33.000000,523.015,489.969,
34.000000,510.03,491.008,
35.000000,505.04,484.056,
36.000000,502.969,482.958,
37.000000,505.004,498.536,
38.000000,501.984,489.932,
39.000000,498.033,507.032,
40.000000,527.975,513.054,
41.000000,558.985,514.942,
42.000000,561.031,526.992,
43.000000,547.98,533.931,
44.000000,519.002,516.034,
45.000000,526.032,511,
46.000000,517.947,498.963,
47.000000,505.96,496.998,
48.000000,500.02,502.504,
49.000000,490.998,505,
50.000000,492.049,501.016,
51.000000,490.018,486.984,
52.000000,488.016,475.012,
53.000000,478.999,484.992,
54.000000,475.968,479.011,
55.000000,484.002,485.005,
56.000000,491.996,489.97,
57.000000,501.968,479.01,
58.000000,493.982,488.971,
59.000000,508.52,496.966,
60.000000,486.04,516.52,
61.000000,514.962,507.964,
62.000000,490,503,
63.000000,487,498.483,
64.000000,487.508,504.032,
65.000000,490.028,497.976,
66.000000,491.012,479.019,
67.000000,478.99,481.002,
68.000000,486.012,467.001,
69.000000,461.992,476.018,
70.000000,465.986,474.996,
71.000000,471.992,454.992,
72.000000,465.993,473.008,
73.000000,475.01,461.984,
74.000000,483.021,464.006,
75.000000,473,469.004,
76.000000,490.997,473.992,
77.000000,485.994,473.02,
78.000000,484.995,474.02,
79.000000,475.998,479.032,
80.000000,487.023,480.01,
81.000000,478.98,466.004,
82.000000,482.008,469.984,
83.000000,481.992,466,
84.000000,469.985,460.026,
85.000000,469,466.996,
86.000000,459,456.996,
87.000000,467.012,459.996,
88.000000,458.018,452,
89.000000,461,451.984,
90.000000,470.991,447.992,
91.000000,472.99,451.996,
92.000000,481.01,458.999,
93.000000,458.012,457.008,
94.000000,470.006,450.019,
95.000000,482.016,456.989,
