Frame number,1000000000,1000000001,1000000002,1000000003,
0.000000,575.95,617.468,750,667.544,
1.000000,655.964,763.792,830.281,833.243,
2.000000,904.804,1004.42,1277.65,1264.35,
3.000000,1004.78,1414.32,1672.55,1654.3,
4.000000,1204.24,1152.18,1024.64,1368.84,
5.000000,1264.04,1142.49,1107.6,1501.17,
6.000000,1299.25,1015.51,1027.42,1341.81,
7.000000,1050.3,927.3,794.772,1138.21,
8.000000,999.216,902.322,778.208,1137.51,
9.000000,938.898,933.918,720.752,956.098,
10.000000,846.964,829.132,725.484,888.234,
11.000000,794.122,740.984,750.88,895.952,
12.000000,748.06,695.827,731.88,820.071,
13.000000,665.6,663.984,630.976,768.429,
14.000000,642.048,607.058,630.84,690.959,
15.000000,614.06,568.031,645.932,693.582,
16.000000,571.04,602.088,650.964,702.548,
17.000000,570.02,581.904,652.964,678.048,
18.000000,617.95,619.484,684.016,735.04,
19.000000,630.068,663.506,750.844,743.54,
20.000000,608.92,732.138,755.992,828.06,
21.000000,763.952,839.24,907.86,913.858,
22.000000,742.096,882.246,925.912,970.766,
23.000000,770.944,834.04,941.708,952.978,
24.000000,755.2,872.398,841.552,925.05,
25.000000,701.1,734.928,867.952,960.824,
26.000000,720.5,729.208,845.009,836.896,
27.000000,644.96,710.096,829.54,758.48,
28.000000,660.08,674.075,721.402,753.848,
29.000000,599.921,639.925,717.944,733.072,
30.000000,618.973,650.05,643.992,667.524,
31.000000,540.096,624.985,640.016,670.14,
32.000000,543.992,604.9,611.98,656.6,
33.000000,539.104,625.1,611.092,624.088,
34.000000,531,601.028,594.034,639.98,
35.000000,529.521,544.12,570.016,625.968,
36.000000,585.02,587.492,564.536,636.996,
37.000000,534.944,543.428,579.502,646.995,
38.000000,570.088,607.5,595,651.996,
39.000000,552.48,632.488,612.128,682.001,
40.000000,572.648,688.528,644.5,717.188,
41.000000,559.071,751.876,670.9,700.176,
42.000000,563.982,687.152,629.504,745.986,
43.000000,589.04,683.624,624.898,740.068,
44.000000,575.904,644.016,600.996,692.868,
45.000000,571,642.02,583.44,658.932,
46.000000,580.5,623.523,552.072,668,
47.000000,548.544,576.914,528.897,611.859,
48.000000,562.9,586.48,542.456,624.101,
49.000000,547.936,594.924,524.976,629.104,
50.000000,515.876,595.064,551.512,603.966,
51.000000,539.57,564.544,529,602.058,
52.000000,522.96,584.016,556.9,586.96,
53.000000,529.956,570.54,551.976,598.938,
54.000000,563.98,584.072,570.984,588.934,
55.000000,534.968,607.037,561.042,602.892,
56.000000,557.996,614.08,544.998,618.064,
57.000000,579.54,654.072,556.992,603.072,
58.000000,576.96,692.192,580.9,637.019,
59.000000,553.016,635.988,585.896,649.192,
60.000000,598.16,640.1,567.089,634,
61.000000,562.091,638.96,558.056,657.56,
62.000000,566.972,626.04,543.124,635.005,
63.000000,551.971,607.1,562.998,627,
64.000000,581.064,587.1,544.016,616.066,
65.000000,549.88,568.128,531.044,587.03,
66.000000,532.024,577.99,521.947,579.1,
67.000000,530.056,589.108,549.024,578.04,
68.000000,515.04,536.02,547.016,582.024,
69.000000,527.04,531.948,517.036,577.94,
70.000000,520.988,557.968,552.008,569.064,
71.000000,512.026,549.952,563.992,561.464,
72.000000,512.06,557.94,538.944,547.034,
73.000000,541.024,553.956,546,574.872,
74.000000,533.07,621.088,547.008,572.93,
75.000000,510.056,562.118,534.976,584.008,
76.000000,526.948,566.12,532.008,561.935,
77.000000,518.024,565.942,521.048,586.004,
78.000000,519.988,568.875,524.958,599.1,
79.000000,531.05,599.064,542.078,584.95,
80.000000,522.033,574.994,544.022,596.46,
81.000000,510.063,566,528.01,569,
82.000000,525.014,545.915,531.928,578.498,
83.000000,495.058,559,518.958,560.068,
84.000000,498.002,559,539.03,561.004,
85.000000,509.009,535.998,516.932,548.96,
86.000000,524.022,533.102,520.052,552.509,
87.000000,486.116,526.136,502,542.98,
88.000000,496.03,531.966,524.032,513.08,
89.000000,487.98,555.968,523.064,543.496,
90.000000,502.02,557,516.061,547.994,
91.000000,510.046,567.884,533.028,542.936,
92.000000,507.947,545.072,528.946,560.52,
93.000000,516.976,536.944,523.052,545.039,
94.000000,487.965,550.056,515.94,550.04,
