Frame number,1000000000,1000000001,
0.000000,1432.95,1285.59,
1.000000,1346.37,1495.23,
2.000000,1577.26,1609.52,
3.000000,1538.7,1016.77,
4.000000,1365.8,1008.66,
5.000000,1209.97,1299.22,
6.000000,990.356,1219.64,
7.000000,914.018,1053.74,
8.000000,785.009,935.04,
9.000000,751.56,852,
10.000000,691.074,846.974,
11.000000,711.002,782.944,
12.000000,660.018,696.888,
13.000000,599.088,696.06,
14.000000,603.485,640.984,
15.000000,594.944,646.061,
16.000000,670.03,768.03,
17.000000,837.187,884,
18.000000,977.68,1008.99,
19.000000,1119.15,1146.21,
20.000000,1247.01,1155,
21.000000,976.328,1139.45,
22.000000,915.92,1143.12,
23.000000,848.075,985.3,
24.000000,752.929,997.134,
25.000000,678.798,930.944,
26.000000,608.016,821.92,
27.000000,655.032,714.973,
28.000000,583.96,716.056,
29.000000,580.96,679.009,
30.000000,564,638.952,
31.000000,544.051,677.98,
32.000000,563.006,683.064,
33.000000,595.028,755,
34.000000,657.04,829.147,
35.000000,736.008,920.982,
36.000000,846.016,1122.19,
37.000000,905.02,1286.74,
38.000000,1025,1254.97,
39.000000,1001.27,1255.15,
40.000000,888.89,1065.77,
41.000000,767,1009.92,
42.000000,745.956,905.13,
43.000000,693.932,844.92,
44.000000,653.96,861.168,
45.000000,634.016,778.1,
46.000000,620.08,714,
47.000000,570.976,699.04,
48.000000,587.056,676,
49.000000,579.962,660.896,
50.000000,586.014,673.956,
51.000000,620.056,730.924,
52.000000,670.016,857.08,
53.000000,695.899,943.875,
54.000000,869.05,998.302,
55.000000,880.097,1163.8,
56.000000,856.887,1249.16,
57.000000,927.901,1152.37,
58.000000,867.147,1065.93,
59.000000,691.995,986.869,
60.000000,724.059,857.933,
61.000000,643.982,757.11,
62.000000,626.049,704.188,
63.000000,563.935,654.92,
64.000000,588.008,682.95,
65.000000,588.1,656.092,
66.000000,554.092,647.956,
67.000000,560.048,679.955,
68.000000,571.997,680.03,
69.000000,596.95,745.88,
70.000000,616.008,831.252,
71.000000,682.951,867.012,
72.000000,779.967,915.81,
73.000000,831.979,974.162,
74.000000,816.888,967.194,
75.000000,731.154,805.272,
76.000000,662.884,740.62,
77.000000,643.968,682.916,
78.000000,559.116,712.872,
79.000000,547.164,606.064,
80.000000,545.935,567.016,
81.000000,525.983,601.031,
82.000000,539.897,579.064,
83.000000,514.962,555.013,
84.000000,535.025,543.028,
85.000000,515.068,553.04,
86.000000,524.952,557.159,
87.000000,544.936,572.908,
88.000000,607,658.247,
89.000000,624.02,686.954,
90.000000,670.006,685.809,
91.000000,685.008,674.999,
92.000000,706.12,674.002,
