Time [ms],1000000000,1000000001,1000000002,1000000003,1000000004,1000000005,1000000006,1000000007,
0,524.065,546.92,596.039,677.832,631.206,597.928,558.856,602.04,
1000000000,536.441,541.982,548.075,616.986,557.035,543.11,525.086,519.076,
2000000000,556.022,536.96,536.081,661.18,616.066,548.88,515.128,540.884,
3000000000,610.953,529.96,559.99,627.03,601.93,641.102,526.944,548.136,
4000000000,655.588,612.044,590.928,654.885,660.031,632.116,562.976,547.962,
5000000000,633.936,680.906,582.945,711.8,661.04,656.075,557.866,572.045,
6000000000,654.428,636.928,668.85,697,691.136,732.074,567.04,601.121,
7000000000,681.908,670.128,632.875,727.15,727.808,753.296,569.889,585.1,
8000000000,655.528,636.072,697.128,702.118,715.835,730.96,563.082,585.009,
9000000000,659.936,623.19,694.086,687.004,693,766.11,574.882,603.912,
10000000000,641.168,623.016,651.064,685.064,693.84,720.846,576.976,574.919,
11000000000,627.153,626.14,652.116,638,644.12,660.178,594.086,564.094,
12000000000,587.99,585.022,628.972,712.876,602.128,717.05,555.03,544.916,
13000000000,587.955,601.916,602.95,674.092,656.087,649.824,597.98,548.042,
14000000000,573.945,588.862,586.975,676.84,673.105,597.015,582.982,543.15,
15000000000,552.067,558.963,561.952,643.08,598.808,631.456,550.05,530.04,
16000000000,530.174,558,552.914,619.92,602.088,601.894,547.459,513.068,
17000000000,522.971,543.102,544.01,594,562.902,601.036,534.031,514.035,
18000000000,499.939,516.93,532.452,605.96,563.04,564.02,530.022,515.017,
19000000000,525.912,556.842,522.62,608.004,550.002,561.452,524.56,527.944,
20000000000,520.91,515.013,511.944,598.083,563.136,575.608,516.036,509.085,
21000000000,496.927,520.896,526.6,635.004,557.042,555.404,513.001,501.97,
22000000000,515.04,529.929,526.498,613.94,549.934,614.016,538.984,509.992,
23000000000,540.927,514,547.544,648.068,580.966,640,542.05,501.905,
24000000000,553.996,531.152,542.528,645.1,582.97,611.92,551.064,498.038,
25000000000,587.063,563.095,537,611.056,610.14,658.988,548.076,513.07,
26000000000,577.896,569.911,581.945,647,641.046,707.896,560.608,535.95,
27000000000,591.157,528.9,555.052,625.918,621.065,680.164,561.125,539,
28000000000,592.066,575.844,561.538,557.57,640.9,692.968,533.109,532.09,
29000000000,567.028,533.628,554.636,585.594,615.135,676.887,503.089,529.986,
30000000000,576.1,534.534,563.378,564.4,586.08,695.1,523.048,526.104,
31000000000,543.976,517.576,556.64,560.658,595.946,632.02,538,502.991,
32000000000,549.054,525.554,548,566.944,575,614.992,507.965,512.038,
33000000000,509.976,510.99,520.604,548.052,564.882,582.504,499.048,483.124,
34000000000,498.051,516.468,531.008,551.53,564.007,575.006,493.936,496.941,
35000000000,499.109,484.976,523.922,517.944,546.927,566.24,522.046,478.952,
36000000000,490.994,506.016,504.939,518.976,545.979,532.12,492.075,479.977,
37000000000,487.068,490.102,475.042,537.506,514.984,537.94,500.012,467.988,
38000000000,468.918,483.966,505.982,526.976,505.038,538.08,490.95,471.01,
39000000000,479.938,491.568,494.979,521.504,505,532.96,470.008,463.016,
40000000000,468.996,476.992,488.04,513.936,496.96,527.928,475.92,463,
41000000000,474.02,500.5,476.996,514.487,514.049,545.02,468.025,459.931,
42000000000,478.052,471.024,491.492,515.004,515.06,535.96,473.027,449.986,
43000000000,481.101,511.068,501.976,504.06,503,549.992,485.998,467.986,
44000000000,492.973,512.067,497.484,515.44,530.059,587.108,460,466.98,
45000000000,493.925,500.904,503.52,527.478,532,573.96,483.944,480.048,
46000000000,505.991,501.108,527.456,511.984,550,581.063,509.073,472.965,
47000000000,485.998,500.944,541.972,505.974,520.04,570.076,486.014,468.078,
48000000000,506.114,493.062,535,521.968,537.048,579.868,515.042,467.976,
49000000000,508.908,489.09,503.04,519.48,511.053,572.2,489.057,461.982,
50000000000,486.009,479.973,512.98,498.976,526.014,573.132,499.049,464.022,
51000000000,507.052,494,532.94,527.969,507.992,566.84,492.01,471,
52000000000,485.009,505.022,485.112,525.02,503.96,572.96,509.968,463.04,
53000000000,485.972,479.978,509.952,526.04,513.1,561.888,498.969,462.981,
54000000000,483.084,465.99,499.08,529.963,511.022,553.104,495.009,466.074,
55000000000,488.951,457.024,475.05,507.048,499.978,534.06,491.07,459.074,
56000000000,482,462.948,488.928,509.94,493.936,532.016,481.013,460,
57000000000,475.976,461.04,486.04,517.024,477,524.961,458.032,441.982,
58000000000,488.062,459.976,482,489.944,489.019,513.923,477.024,449.975,
59000000000,468.94,449.032,466.976,492.024,484.104,496,472.96,448.026,
60000000000,457.96,449.982,492.988,483.014,471.96,482.004,463.967,454.012,
61000000000,455.978,457.06,468.938,475.008,484.044,485.904,463.987,455,
62000000000,465.036,462.99,480.017,479.978,494.036,503,458.952,461.036,
63000000000,463.951,453.1,478,487.066,484.03,499.996,443.93,448.528,
64000000000,474.008,465.035,491.08,478.949,505.968,492.03,477.991,462.954,
65000000000,459.954,464.978,499,492.982,490.048,523.04,464.022,442.992,
66000000000,467,471.952,517.044,497.053,495.064,514.038,482.04,452.025,
67000000000,472.974,473.808,494,485.966,494,520.05,479.922,443.93,
68000000000,473.036,473.952,487.072,491.031,506.028,513.964,479.95,443.05,
69000000000,458.066,471.057,488.076,473.08,492.949,489.045,459.96,443.989,
70000000000,463,474.924,480.032,481.013,498.042,499.976,462,457.488,
71000000000,452.062,452.091,479.98,484.076,487,497.063,453.953,438.508,
72000000000,479.968,457.988,467.05,499.004,473.058,494.038,452.045,448.088,
73000000000,463.98,447.944,452.067,483.053,474.896,503.03,456.996,460.52,
74000000000,458.978,450.068,470.99,484.054,470.97,493.974,450.976,456.025,
75000000000,465,466,455.04,483,478,500.028,467.03,451.536,
76000000000,455,446.052,456.098,462.044,468.02,479.05,458.008,456.008,
77000000000,455.952,450.04,462.955,465.005,458.009,487.016,456.072,443.992,
78000000000,459,440.026,456.977,474.99,468.992,480.08,452.023,448.04,
79000000000,462.965,450.022,471.964,464.064,469.962,477.096,454.996,442.496,
80000000000,447.026,453.02,476.039,455.98,480.05,482.048,454.973,455,
81000000000,445.02,469.072,459.52,464.014,499.032,467.013,460.016,456.036,
82000000000,454.984,449.992,469.973,471.02,485.066,507.989,465.99,456.48,
83000000000,450.52,471.08,479.05,470.973,486.054,512.953,470.005,442.53,
84000000000,452.984,471.974,485.016,478.984,493.994,515.93,487.05,451.986,
85000000000,462.008,461,482.952,469.028,497.068,504.04,459.952,463.456,
86000000000,456.544,443.975,470.936,472.016,486.016,525,466.004,456.52,
87000000000,465.466,456,488.035,456.99,475.996,488.962,465.973,455.024,
88000000000,455.528,461.001,469.986,480.013,480.052,496,473.025,440.5,
89000000000,459.508,448.995,471.971,475.032,468.98,485.079,459.056,448.52,
90000000000,446.51,457.047,477.958,467.93,468.986,485.016,448.972,442.478,
91000000000,447,454.84,456.033,461.998,487.044,491.98,464.016,445,
92000000000,450.975,451.98,459,464.002,470.984,492.02,443.96,447,
93000000000,454.008,438.976,453.026,465.975,460.054,487.028,456.964,441.504,
94000000000,445.032,440,443.987,458.983,460.96,475.968,443.034,430.998,
95000000000,453.512,433.976,452.984,449,451.032,466.9,449.97,438.503,
