Frame number,1000000000,1000000001,1000000002,1000000003,1000000004,
0.000000,15646.1,4442.37,45857.7,40842.1,41409.2,
1.000000,10581.6,3581.42,29022.9,19921.9,18299.9,
2.000000,15480.1,2973.26,30953.7,27482.4,16120.2,
3.000000,19075.1,3275.08,27368.2,27211.3,11056.6,
4.000000,16784,3648.76,25412.9,17320.8,15712.1,
5.000000,13527.5,4001.6,14846.3,20441.5,15191,
6.000000,9842.65,3738.75,13131,13040.3,12270.1,
7.000000,7511.2,3701.72,9108.92,13946.6,8858.76,
8.000000,5633.23,3664.13,7715.51,12128.7,2673.37,
9.000000,4523.91,3218.29,7592,10185.6,5521.55,
10.000000,3980.54,2812.66,5342.75,10224.2,5055.96,
11.000000,3687.79,2606.13,4586,7895.02,4301.85,
12.000000,3543.58,2117.29,5250.89,7222.54,3747.76,
13.000000,3286.21,2168.12,4232.08,6971.18,3238.99,
14.000000,2958.89,2051.04,4856.8,6241.87,3324,
15.000000,2970.89,1952.97,3199.24,5514.73,3428.48,
16.000000,3091.42,1916.97,4446.27,7203.19,3287.5,
17.000000,4120.84,1840.55,5640.99,9118.9,4172.56,
18.000000,4941.97,1767.06,6523.68,11539.8,5002.87,
19.000000,6385.26,1897.46,7842.16,12836.9,5512,
20.000000,6986.27,2011.66,8566.71,13380.5,6098.03,
21.000000,7210.96,2136.64,7586.81,13996.3,3491.88,
22.000000,7534.72,2152.82,8609.35,14192.8,7229.11,
23.000000,7041.23,2169.62,7565.12,14227.7,6884.23,
24.000000,6660.31,2103.19,7898.44,13306,7279.17,
25.000000,5790.7,1937.04,6996.44,12751.5,6447.84,
26.000000,6265.33,1708.39,6212.26,12798.4,5567.14,
27.000000,5624.22,1811.42,6101.77,12415.9,5662.86,
28.000000,5335,1234.04,5887.9,11817.9,4851.19,
29.000000,4699.05,885.676,6150.99,11114.8,4162.9,
30.000000,4197.88,1557.1,5821.84,9614.99,4101.48,
31.000000,4134.27,1740.99,5193.65,8747.84,3977.81,
32.000000,4112.73,1617.54,4951.35,7267.23,3351.39,
33.000000,3958.49,1822.85,5072.1,7505.64,3137.85,
34.000000,3956.84,1565.49,3697.99,7757.48,3118.23,
35.000000,3949.01,1480.15,4097.97,7748.17,3246.76,
36.000000,4021.26,1415.93,4590.14,8000,3429.21,
37.000000,4524.31,1465.29,4817.77,8503.74,3300.2,
38.000000,4944.01,1731.05,4502.68,8812.61,3603.05,
39.000000,5296.69,1524.81,5409.16,8877.64,4023.04,
40.000000,5380,1662.36,5231.64,8998.28,3728.26,
41.000000,5361.85,1693.14,5648.04,8865.81,3825.97,
42.000000,5509.83,1817.45,5502.22,8356.7,4074.3,
43.000000,5306.45,1545.39,5431.21,7638.76,3989.22,
44.000000,5356.21,1576.44,5208.25,7445.54,4071.73,
45.000000,5124.71,1564.75,5252.05,7250.04,3567.29,
46.000000,4911.49,1462.93,5000.75,6541.5,2870.07,
47.000000,4648.13,1338.18,4983.16,6648.15,3775.4,
48.000000,4307.74,1452.78,4789.53,5803,3249.89,
49.000000,3940.42,1431.84,4423.87,5698.82,3276.8,
50.000000,3360.3,1471.44,4116.44,5535.74,3023.1,
51.000000,3397.4,1406.99,3770.84,5585.62,2894.14,
52.000000,3527.93,1339.63,3356.44,5581.9,2855.94,
53.000000,3500.13,1389.24,3875.02,5466.12,2724.58,
54.000000,3513.75,1292.18,3843.82,5360.49,2916.51,
55.000000,3578.46,1189.63,4138.01,5398.31,2872.45,
56.000000,3730.61,1354.66,3657.77,5516.79,2646.9,
57.000000,3759.8,1189.77,3499.56,5561.5,2217.98,
58.000000,4081.81,1176.67,3714.45,5541.27,2452.21,
59.000000,3867.58,1315.62,3878.08,5488.86,2490.25,
60.000000,3972.4,1370.64,3904.42,5504.13,2348.01,
61.000000,4198.47,1430.78,4185.74,5567.07,2677.54,
62.000000,4005.51,1451.39,3150.61,5527.8,2807.1,
63.000000,3917.66,1539.53,3129.57,5163.5,2854.53,
64.000000,3927.48,1470.38,3418.47,4976.4,2118.18,
65.000000,3764,1418.8,3293.03,4800.76,2663.38,
66.000000,3768.3,1439.88,3243.23,4504.02,2553.92,
67.000000,3678.69,1312.25,3242.16,4514.72,2588.96,
68.000000,3647.65,1415.43,3258.49,4485.08,2597.47,
69.000000,3329.43,1365.77,3375.16,4350.99,2509.54,
70.000000,3296.38,1336.76,3082.15,4315.24,2151.12,
71.000000,3163.16,1275.6,3199.83,4185.29,2516.11,
72.000000,3225.16,1285.41,3016.84,4064.56,2264.04,
73.000000,3137.11,1305.55,3112.94,4029.94,2145.24,
74.000000,3042.47,1217.67,3056.55,4048.08,1991.32,
75.000000,3048.69,1295.76,3107.12,4128.81,1979.58,
76.000000,3139.14,1413.48,2963.22,4207.29,1849.97,
77.000000,3044.6,1393.61,3102.13,4228.38,1854.03,
78.000000,3007.32,1513.04,3267.38,4295.35,2002.88,
79.000000,3086.27,1428.71,3238.54,4225.28,2137.71,
80.000000,3201.13,1475.28,3037.68,4162.65,1817.26,
81.000000,3434.63,1327.16,3045.38,4002.13,1955.75,
82.000000,3170.97,1403.78,3079.29,3870.34,2256.39,
83.000000,3098.76,1370.4,2965.56,3685.22,2048.28,
84.000000,2924.46,1417.4,2978,3511.75,1999,
85.000000,2767.44,1523.94,2930.87,3422.27,1993.67,
86.000000,2581.68,1554.63,2779.74,3273.09,2195.4,
87.000000,2673.42,1193.88,2886.99,3265,2218.35,
88.000000,2570.13,1375.27,2812.68,3258.52,1921.32,
89.000000,2488.54,1420.66,2768.44,3161.18,2163.35,
90.000000,2409.51,1447.2,2765.85,3194.65,1792.45,
91.000000,2332.81,1436.15,2607.28,3223.83,1775.24,
92.000000,2341.72,1407.01,2613.95,3253.1,1736.52,
93.000000,2268,1432.36,2815.6,3300.46,1740.61,
94.000000,2490.63,1339.24,2800.63,3420.07,1614.18,
