Time [ms],1000000000,1000000001,1000000002,
0,2237.72,6328.27,2516.44,
1000000000,2619.57,5947.58,2776.96,
2000000000,3802,5824.72,3505.33,
3000000000,4787.4,6049.44,5055.7,
4000000000,5907.32,5751.32,6317.4,
5000000000,5892.03,5440,5660.2,
6000000000,4773.88,4411,4575.7,
7000000000,3715.62,3695.02,3588.72,
8000000000,2994.44,3019.94,2792.46,
9000000000,2384.66,2483.61,2047,
10000000000,1983.36,2022.21,1805.84,
11000000000,1674.08,1714.23,1601.15,
12000000000,1441.96,1515.18,1258.15,
13000000000,1361.24,1359.31,1207.69,
14000000000,1303.08,1205.45,1135.62,
15000000000,1190.35,1144.23,1053.06,
16000000000,1154.22,1139.24,974.68,
17000000000,1154.82,1395.71,1138.6,
18000000000,1209.88,1954.57,1548.85,
19000000000,1463.27,2666.07,2044.12,
20000000000,1897.68,3373,2672.26,
21000000000,2465.62,3179.79,2906.1,
22000000000,2739.56,2945.07,2847.86,
23000000000,2841.37,2566.66,2225.16,
24000000000,2554.01,2068,1967.3,
25000000000,2142.33,1877.08,1653.06,
26000000000,1947.9,1569.93,1320.53,
27000000000,1716.93,1372.27,1104.24,
28000000000,1518.06,1223.4,1082.96,
29000000000,1380.12,1162.09,1011.13,
30000000000,1168.66,1151.81,909.104,
31000000000,1108.04,1052.18,851.924,
32000000000,1061.12,1097.82,801,
33000000000,1040.82,1150.77,926,
34000000000,985.04,1406.74,1032.14,
35000000000,1032.46,1924.48,1235.69,
36000000000,1229.88,2279.1,1593.24,
37000000000,1601.76,2569.94,1877.5,
38000000000,1900.22,2507.22,2092.42,
39000000000,1987.66,2268.41,1980.31,
40000000000,2013,2051.48,1882.8,
41000000000,1922.02,1791.71,1643.86,
42000000000,1802.73,1495.43,1407.09,
43000000000,1663.58,1392.12,1316.19,
44000000000,1460.7,1251.03,1184.06,
45000000000,1203.32,1124.77,1099.84,
46000000000,1155.08,1072.91,1050.65,
47000000000,1051.1,990.292,982.192,
48000000000,983.1,962.922,905.156,
49000000000,913.44,996.69,895.428,
50000000000,904,1098.97,916.968,
51000000000,874.875,1435.24,1125.93,
52000000000,921.982,1742.7,1341.94,
53000000000,999.834,1897.01,1542.04,
54000000000,1142.31,2068.66,1731.93,
55000000000,1312.93,2014.23,1782.14,
56000000000,1468.17,1890.44,1651,
57000000000,1564.31,1571.16,1578.51,
58000000000,1551.24,1542.6,1306.58,
59000000000,1445.4,1305.54,1173,
60000000000,1373.88,1133.15,1027.5,
61000000000,1176.94,1045.06,945.408,
62000000000,1102.24,947.976,880.786,
63000000000,1003.77,888.054,779.932,
64000000000,965.848,886.032,755.304,
65000000000,909.12,920.112,748.56,
66000000000,834.124,1009.14,804.584,
67000000000,820.184,1117.06,892.176,
68000000000,840.908,1261.7,1041.63,
69000000000,860.168,1470.11,1185.54,
70000000000,885.18,1709.21,1362.95,
71000000000,1037.74,1815.89,1467.37,
72000000000,1135.53,1768.82,1463.6,
73000000000,1282.01,1640.99,1447,
74000000000,1331.96,1537.92,1274.4,
75000000000,1356.14,1413.97,1168.38,
76000000000,1300.18,1125.35,1045.77,
77000000000,1247.12,1050.08,918.416,
78000000000,1109.08,914.997,849.2,
79000000000,1061.22,850.416,818.38,
80000000000,997.728,812.936,770.928,
81000000000,944.64,833.064,754.12,
82000000000,928.94,848.976,753.764,
83000000000,850.88,973.496,789.148,
84000000000,856.824,1063.18,961.084,
85000000000,839.464,1238.9,1078,
86000000000,850.868,1428.18,1249.7,
87000000000,981.26,1457,1367.97,
88000000000,1065,1486.99,1424.46,
89000000000,1195.81,1543,1450.3,
90000000000,1352.82,1503.99,1528.89,
91000000000,1290.82,1393,1360.48,
92000000000,1275.82,1253.45,1211.9,
93000000000,1274.78,1189.87,1090.01,
94000000000,1212.4,1083.4,1026.25,
95000000000,1076.71,1004.96,916.732,
