Time [ms],1000000000,1000000001,1000000002,
0,10605.4,16683.9,21226.6,
1000000000,4026.36,3489.88,6003.28,
2000000000,3154.25,1810.47,2500.8,
3000000000,2871.02,1497.8,2068.26,
4000000000,2360.36,1801.15,1901.67,
5000000000,1591.93,1659.8,1624.84,
6000000000,1573.72,1481.76,1545.03,
7000000000,1464.52,1518.8,1606.05,
8000000000,1340,1351.91,1337.46,
9000000000,1255.13,1182.03,1284.11,
10000000000,1211,1298.88,1269.26,
11000000000,1132.22,1192.99,986.24,
12000000000,1069.08,1153.5,1086.74,
13000000000,1034.87,1280.91,1031.82,
14000000000,969.64,1591.5,981.111,
15000000000,1092.44,1909.62,1031.09,
16000000000,1014,2547.61,1043.84,
17000000000,1114.38,3047.57,1065.7,
18000000000,1172.14,3326.88,1291.1,
19000000000,1260.1,3486.33,1674.92,
20000000000,1338.35,3355.14,1950.47,
21000000000,1263.57,3290.52,2190.08,
22000000000,1203.97,2979,2172.96,
23000000000,1004.24,2636.48,1878.65,
24000000000,1027.69,2281.3,1697.21,
25000000000,1035.84,2027.97,1603.89,
26000000000,1273.55,1851.6,1357.95,
27000000000,1338.16,1630.98,1259.99,
28000000000,1441.58,1569.14,1250.94,
29000000000,1405.97,1448.05,1217.95,
30000000000,1253.4,1379,1182.91,
31000000000,1262.17,1343.26,1186.18,
32000000000,1295.5,1370.06,1240.91,
33000000000,1285.4,1583.06,1305.2,
34000000000,1490.11,1858.1,1310.44,
35000000000,1484.5,2159.8,1408.29,
36000000000,1601.28,2581.71,1419.97,
37000000000,1497.3,2628.95,1532.73,
38000000000,1686.01,2786.52,1554.27,
39000000000,1792.42,2673.6,1590.16,
40000000000,1568.27,2626.36,1618.94,
41000000000,1571.14,2309.87,1602.18,
42000000000,1416.04,2145.13,1573.91,
43000000000,1288.08,1928.88,1510.91,
44000000000,1280.29,1704.86,1452.1,
45000000000,1301.08,1486.98,1345.14,
46000000000,1241.84,1393.04,1292.13,
47000000000,1243.25,1291.76,1329.85,
48000000000,1206.16,1164.78,1272.18,
49000000000,1213.95,1259.9,1200.72,
50000000000,1237.26,1277.02,1263.04,
51000000000,1334.09,1258.12,1221.13,
52000000000,1292.16,1515.31,1313.48,
53000000000,1352.48,1626.11,1301.16,
54000000000,1414.7,1709.49,1342.5,
55000000000,1469.05,1875.74,1398.89,
56000000000,1421.62,1850,1367.03,
57000000000,1410.57,2020.08,1390.97,
58000000000,1402.74,1769.42,1325.06,
59000000000,1328.84,1674.02,1327.3,
60000000000,1355.46,1665.8,1287.05,
61000000000,1306.84,1625.97,1290.35,
62000000000,1279.03,1564.74,1230.78,
63000000000,1257.66,1456,1280.73,
64000000000,1205.82,1400.83,1207.17,
65000000000,1131.05,1313.98,1233.01,
66000000000,1258.01,1226.03,1227.17,
67000000000,1132.84,1213.4,1214,
68000000000,1179.25,1127.96,1243.85,
69000000000,1212.19,1072.02,1203.13,
70000000000,1117.94,1092.1,1231.14,
71000000000,1253.02,1077.9,1241.52,
72000000000,1233.04,1202.01,1221.6,
73000000000,1231.99,1231.15,1225.82,
74000000000,1165.1,1252.17,1200.75,
75000000000,1200.06,1276.19,1243.5,
76000000000,1180.75,1311.01,1228.59,
77000000000,1123.95,1290.76,1214.02,
78000000000,1156.95,1361.87,1179.18,
79000000000,1162.11,1370.93,1167.9,
80000000000,1232.22,1340.8,1093.42,
81000000000,1153.95,1297.05,1100.1,
82000000000,1198.25,1275.95,1093.52,
83000000000,1286.97,1231.2,1132.01,
84000000000,1215.1,1261.78,1133.99,
85000000000,1227.83,1189.95,1103.74,
86000000000,1234.2,1148.08,1135.44,
87000000000,1197.69,1121.86,1155.5,
88000000000,1221.95,1141.09,1131.98,
89000000000,1186.1,1111.04,1128.02,
90000000000,1173.22,1141.94,1162.88,
91000000000,1215.08,1101.81,1142.61,
92000000000,1219.9,1037.07,1175.98,
93000000000,1171.22,1003.04,1167.81,
94000000000,1154.98,946.88,1196.98,
95000000000,1085.92,1010.49,1214.03,
