
Intensity Median
 ==================== 
Time [s],1000000000,1000000001,1000000002,1000000003,
0.000000,5150.16,3640.49,4156.04,7420.41,
1.000000,4851.61,4521,5653.66,5490.72,
2.000000,4737.31,4648.32,5421.79,5560.46,
3.000000,4475.3,4456.67,5414.67,3850.4,
4.000000,4066.18,4306.07,4453.24,3427.76,
5.000000,3959.16,2725,3783.4,3156.56,
6.000000,3435.43,2670,3909.43,2858.68,
7.000000,3399.28,4307.8,4139.18,2820.48,
8.000000,3248.92,4017.08,3917.01,2528.96,
9.000000,3050.78,3586.43,3572.9,2627.23,
10.000000,2735.87,3271.36,3109.8,2423.84,
11.000000,2628,3206.24,2853.1,2484.93,
12.000000,2500.81,3122.34,2466.62,2389.94,
13.000000,2343.76,3206.06,2569.58,2350.55,
14.000000,2589.15,3910.6,3021.8,2441.4,
15.000000,2884.27,4809.37,3482.65,2470.78,
16.000000,3115.66,5560.61,3851.02,2375.7,
17.000000,3524.85,5783.95,3409,2120.18,
18.000000,3282.89,5059.4,3334.52,2114.12,
19.000000,3145.37,4721.48,3540.24,2035.27,
20.000000,2984.75,4723.88,3715.1,1976.87,
21.000000,3265.04,4726.74,3744.26,1909.78,
22.000000,3505.86,4628.33,3756.04,1909.41,
23.000000,3421.79,4540.17,3615.76,1841.44,
24.000000,3245.89,3921.2,3502.6,1623.28,
25.000000,3053.86,3676.6,3191.46,1551.1,
26.000000,2899.88,3421.26,2956.92,1528.03,
27.000000,2697.11,3353.89,3059.09,1435.77,
28.000000,2800.11,3226.48,3160.8,1516.67,
29.000000,2853.93,3319.31,3780.53,1795.74,
30.000000,2974.02,3700.39,3990.28,1775.26,
31.000000,3174.19,4089.37,4121.61,1851.8,
32.000000,3268.92,4164.97,4234.9,1854.92,
33.000000,3064.39,4071.79,3449.48,1819.2,
34.000000,2942.8,3712.54,2997.58,1752.29,
35.000000,2909.06,3599.67,3091.73,1744.16,
36.000000,3145.3,3760.31,3035,1762.02,
37.000000,3045.63,3862.48,3242.01,1652.04,
38.000000,3114.3,3669.04,3130.23,1562.68,
39.000000,3018.8,3518.14,3057.5,1446.19,
40.000000,2965.59,3039.11,2784.82,1405.5,
41.000000,2770.42,3009.63,2679.85,1353.06,
42.000000,2699.97,2839.28,2471.29,1331.12,
43.000000,2616.98,2776.08,2442.96,1324.89,
44.000000,2598.05,2870.79,2391.27,1396.52,
45.000000,2673.89,3114.19,2504.26,1555.52,
46.000000,2805.68,3220.1,2734.7,1602.42,
47.000000,2968.49,3431.8,2714.3,1536.61,
48.000000,2689.32,3315.11,2521.99,1339.48,
49.000000,2664.77,2997.85,2298.71,1360.44,
50.000000,2584.3,2900.03,2123.87,1294.54,
51.000000,2825.74,2923.16,2100.23,1405.8,
52.000000,2874.08,3026.02,2322.08,1367.55,
53.000000,3022.88,2952.93,2344.51,1355.48,
54.000000,2962.13,2818.23,2188.69,1268.13,
55.000000,2899.87,2676.86,2066.05,1151.51,
56.000000,2684.28,2497.14,1956.24,1131.34,
57.000000,2517.06,2447.67,1887.2,1043.41,
58.000000,2329.9,2378.66,1809.27,1083.52,
59.000000,2391.92,2365.5,1766.08,982.008,
60.000000,2433.32,2437.88,1793.92,1041.94,
61.000000,2522.79,2572.7,1861.25,1045.58,
62.000000,2531.6,2528.8,1893.91,1027,
63.000000,2454.2,2571.14,1806.95,1086.58,
64.000000,2377.13,2450.06,1644.88,1050.92,
65.000000,2350.09,2324.73,1582.04,994.56,
66.000000,2389.09,2296.16,1560.04,1056.8,
67.000000,2602.5,2311.52,1682.93,1068.05,
68.000000,2625.1,2308.41,1691.04,1016.21,
69.000000,2603.17,2188.07,1627.42,997.172,
70.000000,2594.24,2152.92,1570.9,976.036,
71.000000,2442.03,2090.54,1536.06,938.01,
72.000000,2341.64,2056.15,1483.98,928.168,
73.000000,2247.46,1939.23,1389.86,890,
74.000000,2138.44,1878.64,1490.1,852.992,
75.000000,2170.52,1877.26,1461.02,845.544,
76.000000,2152,1947.36,1526.02,860.912,
77.000000,2163.99,1955.23,1491.08,839.924,
78.000000,2098.86,1987.71,1521.98,850.92,
79.000000,2071.07,1825.22,1502.95,807.868,
80.000000,1990.21,1684.87,1347.03,823.56,
81.000000,2021.09,1776.01,1281.92,806.974,
82.000000,2071.04,1710.83,1346.96,794.042,
83.000000,2174.06,1729.36,1413.02,805.028,
84.000000,2260,1695.95,1363.06,815.904,
85.000000,2214.82,1658.26,1332.95,817.122,
86.000000,2224.88,1591.85,1259.94,813.11,
87.000000,2112.9,1562.81,1227.02,804.012,
88.000000,2024.8,1461,1265,737.904,
89.000000,1977.14,1480.67,1220.04,763.067,
90.000000,1937.96,1479.07,1239.92,713.032,
91.000000,2010.13,1443.92,1259,751.078,
92.000000,2002.9,1499.16,1342.94,728.04,
93.000000,1927.26,1488.06,1344.81,726,
94.000000,1856.78,1539.97,1397.04,713,
95.000000,1820.17,1474.77,1250.1,790.536,
96.000000,1835.19,1417.98,1223.08,748.896,
97.000000,1942.13,1426.1,1220.05,755.038,
