Frame number,1000000000,1000000001,1000000002,1000000003,1000000004,1000000005,1000000006,
0.000000,542.514,490.9,578.032,598.49,603.028,569.944,616.952,
1.000000,499.018,519.976,554.104,533.05,502.06,518.036,516.985,
2.000000,506.016,538.024,546.456,606.135,526.912,551,649.883,
3.000000,533.04,566.04,599.246,658.911,586.94,529.248,624.134,
4.000000,535.008,525.082,532.904,623.006,565.44,515,614.552,
5.000000,526.058,521.012,532,578.15,597.04,496.96,554.54,
6.000000,508.008,507.048,511.536,515.993,558.144,505.92,549.01,
7.000000,495.544,494.95,525.894,501,504.918,501.992,511.976,
8.000000,462.996,476.006,519.072,489,517.564,469.02,535.988,
9.000000,483.012,479.016,508.99,494.064,523.114,499.946,500.057,
10.000000,472.96,457.98,486.954,495,522.98,473.072,534.444,
11.000000,453,463.984,466.032,488.98,508.924,480.936,553.554,
12.000000,450.026,468.006,465,481.092,475,479.06,524.479,
13.000000,473.986,474.992,459.05,516.993,479,480.058,509.944,
14.000000,472.032,457.956,470.035,518.534,489.024,468.05,505.06,
15.000000,488.036,477,483.048,594.015,501,464.02,569.1,
16.000000,503.024,513.972,509.039,645.049,530.936,493.944,623.032,
17.000000,520.986,554.86,552.035,697.007,555.008,561.093,665.112,
18.000000,530.069,602.928,649.175,559.068,594.252,549.834,698.096,
19.000000,554.05,583.976,689.116,577.434,583,665.48,743.96,
20.000000,588.94,638.064,754.229,585.974,593.148,655.604,790.168,
21.000000,574.988,591.072,769.003,597.206,595.318,645.836,847.21,
22.000000,547.891,570.78,743.234,598.996,632.034,653.592,812.675,
23.000000,522.082,549.2,733.213,555,576,638,765.68,
24.000000,541.094,564.064,617.222,564.964,629.84,599.576,671.888,
25.000000,495.048,517,641.166,549,579.057,599.45,619.924,
26.000000,497.942,527.062,589.52,532,564.972,553,616.92,
27.000000,489.996,487.944,562.032,522.928,520.552,544.985,546.997,
28.000000,455.024,486.04,529.084,516.988,520.038,517.94,568.989,
29.000000,457.992,460.028,532.077,493.964,510.055,495.05,532.986,
30.000000,458.06,480.056,507.092,527.048,512.997,504.048,515.97,
31.000000,481.024,474.008,539.031,513,544.98,503,546.541,
32.000000,496.008,505,516.961,517.95,584.537,526.894,586.505,
33.000000,531.916,513.04,538.102,516.088,608.005,561.097,659.092,
34.000000,556.934,543.412,566.025,571,660.03,633.1,634.53,
35.000000,571.92,548.016,574.969,570,669.022,691.312,627.188,
36.000000,609.132,545.024,600.902,596.98,637.194,708.16,617.708,
37.000000,607.108,555.024,658.132,632.048,661.52,671,623.528,
38.000000,604.032,529,677.829,635.551,612.934,623,605.856,
39.000000,547.944,528.008,731.778,586.122,609.04,581.944,601.44,
40.000000,530,524.96,730.215,602.114,579.476,559.095,603.5,
41.000000,544.096,517.112,665.177,579.135,578.12,512.538,591.5,
42.000000,505,525.04,621.927,553.542,518.076,488,574.976,
43.000000,497.034,496.932,555,514.958,529.856,513.524,539,
44.000000,482.9,471.004,559.055,485.986,508.92,487.991,548,
45.000000,502,472.928,536.911,532.04,484,498.104,529.062,
46.000000,500,472.04,544.922,520.064,527.452,490.925,550.968,
47.000000,489.08,465.99,498.882,487.09,534.464,475.966,518,
48.000000,510.968,444.952,504.948,532.944,562.12,442.996,533.985,
49.000000,540.932,469.94,554.01,528.098,634.019,448.976,564.054,
50.000000,544.02,490.04,544.063,513.984,734.278,514.52,567.932,
51.000000,595.528,484.044,534.976,522.056,831.971,498.524,611.581,
52.000000,600.552,524.944,559.08,555.988,910.984,504.56,634.97,
53.000000,581.7,517.68,541.548,587.7,829.31,481.064,648.208,
54.000000,617.568,588.144,611.48,534.868,791.292,530,665.118,
55.000000,565.2,615.006,640.26,552.28,758.146,511.912,656.024,
56.000000,648.268,599.47,598.88,524.872,705.92,480.06,591.48,
57.000000,598.968,579.884,606.96,544.892,696.118,493.002,582.612,
58.000000,573.932,531.148,586.516,523.48,645.872,449,573.586,
59.000000,526.556,512.96,538.992,549.004,606.092,447.972,548.04,
60.000000,540.952,503,533.92,539.292,587.104,446.96,533.516,
61.000000,508.536,499.52,514,523.02,557.924,465.995,524.984,
62.000000,528.988,467.965,540.97,515.44,585.108,453.02,515.974,
63.000000,518.424,488.047,522.03,600.912,546.048,477.016,526.066,
64.000000,503.548,522.012,502.012,553.886,534.216,490.5,525.04,
65.000000,544.856,559.114,544.584,604.96,515.22,472.48,527.91,
66.000000,561.52,504.196,534.1,545.125,540.036,475.04,520.16,
67.000000,636.148,611.778,559.94,629.261,641.188,479.104,589.87,
68.000000,687.048,597,570.084,632.92,639.226,517.068,599.076,
69.000000,755.392,687.288,715.44,546.148,681.976,525.04,616.055,
70.000000,723.392,652,904.948,657.14,763.092,511.024,654.48,
71.000000,728.892,637,627.105,624,756.514,504.04,591.038,
72.000000,666.544,663.136,665.985,597.016,748.417,516.988,581,
73.000000,669.664,609.708,653.408,632.14,727.75,516.964,545.034,
74.000000,629.816,576.988,541.526,639.821,687.799,519.046,564.516,
75.000000,604.54,551.856,560.107,618.092,715.784,529.998,535.516,
76.000000,603.004,536.96,544.96,580.154,639.18,511,538.462,
77.000000,552.312,525.936,521.088,586.934,567.92,521.972,509.05,
78.000000,545.96,496.124,522.26,550.95,585,525.064,518.005,
79.000000,581.584,518,675.933,573,568.12,527.96,492.072,
80.000000,609.936,527.048,563.88,561.008,552.792,528.92,518,
81.000000,678.216,508.514,600.076,553.2,558,528.98,490.96,
82.000000,670.832,557.164,545.168,523.928,612.058,537.08,493,
83.000000,716.028,545.01,529.96,509.024,570.896,505.968,509.908,
84.000000,766.708,581.166,552.85,490.108,590.88,520.12,506.02,
85.000000,743.736,589.042,492.959,503.048,571.04,529.9,497.48,
86.000000,698.812,664.284,534.95,474.024,639.292,569.404,510,
87.000000,649.968,706,543.86,501.048,732.925,542.048,476.032,
88.000000,685.42,726,462.532,492,737.848,582.984,484.488,
89.000000,765.3,705.242,533.6,495,641.116,564.072,486.896,
90.000000,683.028,634.226,538.071,492.96,666.904,595.08,566.97,
91.000000,682.04,641.216,555.882,495,628.9,590.12,538.942,
92.000000,608.112,635,475.013,494.985,612.972,577.4,567.962,
93.000000,619.168,637.584,461.97,489.96,563.416,579.94,529,
94.000000,641.9,629.84,470.052,496.976,568.832,585.136,542.01,
