Frame number,1000000000,1000000001,
0.000000,4063.34,4283.45,
1.000000,4532.48,4168,
2.000000,4353.42,4209.99,
3.000000,3581.68,4082.3,
4.000000,3107.14,3573.03,
5.000000,2616.38,3103.07,
6.000000,2078.9,2580.38,
7.000000,1625.99,2128.54,
8.000000,1315.26,1859.77,
9.000000,1074.88,1643.18,
10.000000,961.077,1403.09,
11.000000,900.079,1244.91,
12.000000,810.014,1166.15,
13.000000,823.132,1111.74,
14.000000,867.951,1148.08,
15.000000,1055.02,1409.87,
16.000000,1420.88,1999.89,
17.000000,2015.39,2701.07,
18.000000,2498.24,3316.4,
19.000000,2447.76,3229.6,
20.000000,2186,2766.53,
21.000000,1888.41,2579.74,
22.000000,1531.04,2126.86,
23.000000,1251.15,1751.64,
24.000000,992.912,1466.76,
25.000000,896.136,1311.07,
26.000000,761.976,1131.16,
27.000000,739.45,1010.93,
28.000000,712.112,939.8,
29.000000,691.9,905.08,
30.000000,765.088,928.97,
31.000000,917.08,1058.27,
32.000000,1200.85,1540.96,
33.000000,1612.78,2202.01,
34.000000,2028.28,2877,
35.000000,2248.41,3048.67,
36.000000,2023.42,2813.92,
37.000000,1717.48,2574.92,
38.000000,1460.72,2127.17,
39.000000,1204.08,1757.66,
40.000000,990.768,1455.87,
41.000000,880.065,1168,
42.000000,769.48,1043.08,
43.000000,717.08,946.83,
44.000000,690.005,902.956,
45.000000,653.536,811.904,
46.000000,693.028,850.969,
47.000000,859.105,983.944,
48.000000,1081.97,1251.84,
49.000000,1534.9,1789.23,
50.000000,1915.21,2481.02,
51.000000,2008.81,2778.6,
52.000000,1807.23,2541.59,
53.000000,1591.85,2214.22,
54.000000,1371.15,1916.26,
55.000000,1152.44,1594.87,
56.000000,1010.35,1491.73,
57.000000,908.052,1390.95,
58.000000,797.96,1231.09,
59.000000,759.07,1083.81,
60.000000,714.065,1081.03,
61.000000,677.996,1002.94,
62.000000,724.456,1015.56,
63.000000,828.048,1092.95,
64.000000,988.56,1287.1,
65.000000,1268.29,1737,
66.000000,1495.8,2299.5,
67.000000,1639.87,2686.01,
68.000000,1686.95,2638.3,
69.000000,1418.96,2302.83,
70.000000,1301.87,2098.1,
71.000000,1146.9,1822.68,
72.000000,1001,1593.03,
73.000000,897.011,1358.17,
74.000000,835.892,1231.98,
75.000000,780.994,1065.13,
76.000000,765.51,1027.92,
77.000000,746.45,917.03,
78.000000,752,888.944,
79.000000,827.952,912.064,
80.000000,1026.03,1080.97,
81.000000,1344.39,1356.99,
82.000000,1483.72,1758.25,
83.000000,1581.9,1993.94,
84.000000,1500.36,2109.01,
85.000000,1419.04,1993.49,
86.000000,1303.94,1751.17,
87.000000,1177.97,1580.91,
88.000000,1037.09,1321.97,
89.000000,937.996,1156,
90.000000,894.019,1013.1,
91.000000,800.004,946.964,
92.000000,810.008,914.092,
