Time [ms],1000000000,1000000001,
0,587.008,592.028,
1000000000,711.94,645.958,
2000000000,892.984,717.114,
3000000000,1103.11,847.19,
4000000000,1299.28,999.062,
5000000000,1391.17,1056.33,
6000000000,1201.13,964.955,
7000000000,1068.85,929,
8000000000,882.068,831.984,
9000000000,788,777.896,
10000000000,668.961,737.46,
11000000000,616.055,643.048,
12000000000,591,598.036,
13000000000,593.96,568.03,
14000000000,558.09,561.488,
15000000000,535.916,545.013,
16000000000,517.998,529.5,
17000000000,516.972,516.496,
18000000000,526.968,510.04,
19000000000,525.006,524.515,
20000000000,545,548.482,
21000000000,601,572.532,
22000000000,656.952,611.088,
23000000000,709.954,621.554,
24000000000,733.96,620.448,
25000000000,746.96,634.006,
26000000000,717.132,599.932,
27000000000,665.868,593.932,
28000000000,632.992,593.976,
29000000000,607,596.997,
30000000000,584.008,566.044,
31000000000,571.46,533.1,
32000000000,541.55,537.468,
33000000000,522.012,522.009,
34000000000,527.968,512.52,
35000000000,514.486,493.93,
36000000000,507.484,492.472,
37000000000,509.504,485.512,
38000000000,525.951,480.996,
39000000000,517.894,501.484,
40000000000,539.05,491.973,
41000000000,552.46,491.522,
42000000000,551.506,513.976,
43000000000,589.5,507.025,
44000000000,577.524,538.516,
45000000000,592.48,530.968,
46000000000,580.945,538,
47000000000,564.504,536.005,
48000000000,546.954,524.016,
49000000000,556.892,500.984,
50000000000,541.94,510.968,
51000000000,511.458,492.004,
52000000000,526.028,499.04,
53000000000,511.515,497.05,
54000000000,516.485,475.982,
55000000000,506.026,479.014,
56000000000,513,490.994,
57000000000,509.94,473.512,
58000000000,535.954,470.984,
59000000000,509.026,483.538,
60000000000,514.054,473.504,
61000000000,514,489.02,
62000000000,538.98,479.02,
63000000000,531.953,503.945,
64000000000,526.96,506.961,
65000000000,529.04,499.982,
66000000000,522.02,508.991,
67000000000,508.026,489.96,
68000000000,495.928,508.526,
69000000000,507.96,493.992,
70000000000,490.032,491.024,
71000000000,480.96,483.512,
72000000000,498.028,481.512,
73000000000,492.02,475.5,
74000000000,482.024,469.979,
75000000000,486.008,467.496,
76000000000,489.02,460.024,
77000000000,483.07,455.5,
78000000000,480.99,464.484,
79000000000,466.005,453,
80000000000,477.025,451.98,
81000000000,480.042,451,
82000000000,483.04,451.061,
83000000000,487.018,465,
84000000000,482.014,467.495,
85000000000,483.048,477.496,
86000000000,490.968,476.004,
87000000000,475.009,480.52,
88000000000,476.969,471.012,
89000000000,481,476.484,
90000000000,479.02,475.012,
91000000000,472.974,466.48,
92000000000,489.045,469,
93000000000,478.965,470.967,
94000000000,472.02,458.958,
95000000000,479.024,470.008,
