Frame number,1000000000,1000000001,1000000002,
0.000000,14972.5,16412.6,30978.1,
1.000000,13360.2,10680.6,21538,
2.000000,11108.8,7929.59,17540.3,
3.000000,8554.66,6350.58,12388.2,
4.000000,6931.94,4491.97,7829.27,
5.000000,5758.83,3384.57,5731.85,
6.000000,4488.4,2865.87,4438.78,
7.000000,3772.93,2550.02,3750.11,
8.000000,3079.71,2454.64,2965.62,
9.000000,2776.45,2121.52,2443.36,
10.000000,2425.32,2070.41,2428.29,
11.000000,2237.33,1996.3,2409.12,
12.000000,2128.31,1850.43,2196.33,
13.000000,1976.13,1849.8,2018.77,
14.000000,1914,1824.8,1971.32,
15.000000,1873.16,1818,2237.22,
16.000000,2000.66,1847.16,2541.24,
17.000000,2320.4,1936.1,2901.1,
18.000000,2496.37,2063.62,3086.27,
19.000000,2490.48,2245.64,3027.61,
20.000000,2412.25,2130.3,2883.41,
21.000000,2310.56,1962.2,2753.84,
22.000000,2157.78,1946.05,2494.44,
23.000000,2027.32,1874.39,2203.14,
24.000000,1807.68,1694.24,1902.13,
25.000000,1417.1,1494.82,1686.11,
26.000000,1395.49,1340.85,1404.93,
27.000000,1201.17,1225.79,1465.13,
28.000000,1106.15,1094.1,1358.88,
29.000000,1043.76,1116.92,1282,
30.000000,976.912,1051.03,1298.04,
31.000000,996.984,1056.94,1308.01,
32.000000,972.916,1075.02,1518.66,
33.000000,1124.17,1056.08,1852,
34.000000,1383.88,1198.14,2311.12,
35.000000,1624.79,1247.89,2537.52,
36.000000,1785.8,1473.82,2551.56,
37.000000,1751.9,1561.15,2314.38,
38.000000,1627.17,1433.27,2111.79,
39.000000,1460.11,1455.9,1863.2,
40.000000,1423.45,1313.28,1581.24,
41.000000,1298.82,1265.92,1388.92,
42.000000,1090.09,1138.84,1223.97,
43.000000,1013.13,1083.95,1102.1,
44.000000,901.07,1008.96,1002.53,
45.000000,899.911,914.86,940.804,
46.000000,813.968,863.09,903.036,
47.000000,817.172,820.156,925.472,
48.000000,853.032,826.86,982.512,
49.000000,885.972,848.14,1148.84,
50.000000,948.016,864.932,1397.5,
51.000000,1146.15,877.948,1809.65,
52.000000,1282.24,980.044,1998.7,
53.000000,1321.77,1090.06,2083.16,
54.000000,1400.76,1207.32,2008.37,
55.000000,1383.16,1246.55,1849.22,
56.000000,1309.42,1233.63,1628,
57.000000,1232.2,1203.87,1381.15,
58.000000,1145.21,1156.66,1239.88,
59.000000,1054.68,1097.16,1052.17,
60.000000,946.06,964.972,968.088,
61.000000,909.16,942.872,892.976,
62.000000,859.037,881.988,856.952,
63.000000,834.936,830.992,829.016,
64.000000,854.896,817.027,804.091,
65.000000,837.875,785.996,850.065,
66.000000,831.916,769.474,1009.36,
67.000000,883.92,766.032,1308.08,
68.000000,1018,787.014,1704.21,
69.000000,1144.2,902.103,1968.16,
70.000000,1240.02,975.5,2067,
71.000000,1282,1072.48,1974.26,
72.000000,1275.24,1093.84,1738.34,
73.000000,1238.24,1084.18,1433.4,
74.000000,1185.97,1050.96,1196.82,
75.000000,1113.97,1063.53,1059.03,
76.000000,983.944,961.103,950.88,
77.000000,921.576,930.132,849.032,
78.000000,892.144,893.504,805.024,
79.000000,913.02,817.112,754.044,
80.000000,847.887,827.952,753.88,
81.000000,865.07,794.552,766.05,
82.000000,876.952,778.952,810.92,
83.000000,873.064,726.53,989.944,
84.000000,902.892,731.055,1245,
85.000000,908.52,748.011,1616.2,
86.000000,1039,801,1899.27,
87.000000,1082.76,922.975,1838.92,
88.000000,1169.16,954.072,1694,
89.000000,1185.85,1019.82,1559.85,
90.000000,1148,1019.9,1332.26,
91.000000,1081.12,988.97,1135.94,
92.000000,1000.12,966.081,1015.06,
