Time [ms],1000000000,1000000001,1000000002,1000000003,
0,3430.8,3771,5379.93,3681.9,
1000000000,2997.21,2365.16,3024,2351.23,
2000000000,1752.52,1445.28,1920.14,1310.1,
3000000000,1129.29,1036.92,1353.76,919.206,
4000000000,924.376,830.184,1101.18,764.068,
5000000000,800.328,800.876,870.844,761.25,
6000000000,748.585,775.904,823.19,723.02,
7000000000,651.582,703.064,751.98,646.144,
8000000000,654,658.088,697.04,605.984,
9000000000,591.992,605.95,647.088,563.112,
10000000000,563.55,555.976,573.95,561.464,
11000000000,530.52,552,532.062,527.54,
12000000000,519.05,541.112,527.116,509.034,
13000000000,483.022,513.934,516.516,510,
14000000000,497.06,475.936,500.96,490.008,
15000000000,491.992,479.038,481.999,484.024,
16000000000,473.016,470.047,462.952,482.996,
17000000000,465.034,484.032,500.96,478.502,
18000000000,472.99,491.072,474.06,471.04,
19000000000,497.02,505.016,484.008,496,
20000000000,485.05,538.044,506,514.072,
21000000000,521.96,556.934,547.136,560.62,
22000000000,555.856,561.532,588.944,589.1,
23000000000,577,568.04,617.944,589.065,
24000000000,580.96,596.048,657.018,581.064,
25000000000,586.036,577.987,607.917,574.976,
26000000000,578.968,553.926,630.434,596.046,
27000000000,584.012,550.974,571.84,575.96,
28000000000,570.088,551.039,571.93,545.969,
29000000000,546,542.985,595.96,536.952,
30000000000,538.943,512.95,565,533.944,
31000000000,536.951,536.928,553.016,505.998,
32000000000,523.087,520.496,528.973,516.97,
33000000000,524.008,500.484,529.013,488.036,
34000000000,489.968,509.984,504.977,493.95,
35000000000,479.128,490.968,504,482.936,
36000000000,493.044,494.98,514.124,483.952,
37000000000,492.004,498.05,499.482,492.928,
38000000000,482.92,500.994,510.996,522.956,
39000000000,500.024,507.992,522.008,514.992,
40000000000,519.08,538.96,536.988,543.964,
41000000000,518,546.98,556.928,579.048,
42000000000,526,548.056,548.096,586.978,
43000000000,553.025,575.056,575.144,562.112,
44000000000,568.048,538.12,558.924,550.064,
45000000000,576.548,523.508,542.078,544.075,
46000000000,544.497,527.016,540.96,545.034,
47000000000,534.464,510.044,536.92,524.032,
48000000000,524.01,506.978,533.977,509.08,
49000000000,512.488,489.942,508.024,507.004,
50000000000,505.456,512.076,500.057,491.956,
51000000000,499.504,510,506.027,475.058,
52000000000,502.063,475,482.991,476.956,
53000000000,479.512,486.576,483.96,475.063,
54000000000,472.006,481.448,468,464.05,
55000000000,474.48,476.02,488.994,465.974,
56000000000,472.008,467.504,464.958,458.015,
57000000000,476.48,486.46,469.04,462.988,
58000000000,481.502,476.056,468.986,461.953,
59000000000,481.03,482,480,462.068,
60000000000,487.008,511.932,497.02,482.06,
61000000000,491.5,509.024,492.032,497.985,
62000000000,521.029,508.98,504.024,495.034,
63000000000,525.52,493.562,510.026,513.024,
64000000000,523.048,504.48,508.047,501.975,
65000000000,508.025,514.944,499.448,479.002,
66000000000,523.93,489.476,474.995,497.056,
67000000000,502.038,504.04,497.031,488.032,
68000000000,511.039,482.5,490.997,480.004,
69000000000,501.009,489.976,479.96,477,
70000000000,486.98,494.068,482,485.501,
71000000000,489.952,473,482.005,470.48,
72000000000,474.026,468.02,462.99,460.973,
73000000000,467.02,477.056,475.96,471.984,
74000000000,476.01,464.54,470.036,465,
75000000000,457.906,477.52,456.02,459.009,
76000000000,464.029,465.02,461.044,457.04,
77000000000,456.05,469.996,461.99,461,
78000000000,473,477.52,471.025,461.01,
79000000000,474.002,485.52,462.008,461.944,
80000000000,477.012,488.568,471.989,462.04,
81000000000,487,472.548,477.97,473.957,
82000000000,491,480.008,476.946,467.981,
83000000000,476.05,481.024,495.968,470.997,
84000000000,483.05,485.48,487.04,480.996,
85000000000,487,491.08,489.988,474.985,
86000000000,491.954,491.98,477.048,490.032,
87000000000,497.94,476.512,483.961,477.035,
88000000000,495.002,479.512,492.056,479.022,
89000000000,494.016,475.543,486.05,487.952,
90000000000,479.99,481.484,465.992,471.996,
91000000000,480.01,476.972,469.01,462.995,
92000000000,479.98,476.979,474.018,461.006,
93000000000,476.924,476.08,471.017,448.024,
94000000000,469.968,474.984,469.056,455.013,
95000000000,465,457,462.008,450.99,
