Frame number,1000000000,1000000001,1000000002,
0.000000,578.063,582.024,507.995,
1.000000,661.1,656.44,552.959,
2.000000,728.176,699.935,584.16,
3.000000,874.764,756.101,629.499,
4.000000,797.11,845.91,677.5,
5.000000,738.053,835.19,672.992,
6.000000,700.91,763.869,608.036,
7.000000,620.154,638.084,549.928,
8.000000,573.005,558.06,530.018,
9.000000,534.07,538.008,496.98,
10.000000,509.06,514.999,471.056,
11.000000,492.93,507.957,472.972,
12.000000,487.51,490.07,458,
13.000000,478.552,485.997,462.984,
14.000000,481.98,472.975,456.518,
15.000000,475.024,472.99,452.494,
16.000000,487.016,470.025,454.5,
17.000000,479.928,475.977,460.005,
18.000000,503.027,491.001,462.536,
19.000000,518.04,510.958,476.55,
20.000000,535.013,536.078,474.008,
21.000000,572.94,540.053,500.008,
22.000000,597.089,570.61,526.53,
23.000000,609.075,596.792,542.512,
24.000000,622.936,598.924,550.412,
25.000000,562.96,613.069,528.048,
26.000000,520.914,520.959,504.008,
27.000000,493.452,527.47,487.965,
28.000000,478.5,500.012,468.058,
29.000000,466.024,495.495,454.015,
30.000000,453.05,480.95,450,
31.000000,459.506,474.504,445.025,
32.000000,462,471.036,444.024,
33.000000,456.034,464.5,445.04,
34.000000,472.04,480.956,446.032,
35.000000,461.018,459.016,444.054,
36.000000,468.512,476.509,443.996,
37.000000,463.52,466,456.954,
38.000000,469.468,470.035,451.97,
39.000000,482.048,489.031,459.004,
40.000000,511.02,508.974,465.96,
41.000000,541.482,501.055,479.984,
42.000000,547.52,517.088,478.964,
43.000000,571.476,537.945,493.502,
44.000000,537.04,538.008,476.015,
45.000000,490.024,513.992,474.012,
46.000000,488.528,515.928,470.48,
47.000000,466.512,478.944,454.996,
48.000000,454.012,475.48,457.49,
49.000000,455.504,462,447.5,
50.000000,445.995,454.532,451.008,
51.000000,463.001,453.5,438.024,
52.000000,463.5,461.966,436.516,
53.000000,451.008,444.5,443.054,
54.000000,448.539,448.985,435.48,
55.000000,455,452.524,441.524,
56.000000,468.944,462.492,447.998,
57.000000,468.06,477.507,454.004,
58.000000,473.01,472.472,456.008,
59.000000,483.024,474.02,459.513,
60.000000,491.926,472.479,462.04,
61.000000,494.966,470.499,459.46,
62.000000,495.045,483.996,462.994,
63.000000,487.976,479.51,466.98,
64.000000,475.072,490.976,465.467,
65.000000,490,476.54,459.05,
66.000000,462.006,459.008,456.957,
67.000000,467.009,469.999,447,
68.000000,456.512,464.998,443.021,
69.000000,451.032,449.984,442,
70.000000,458.028,459.984,441.024,
71.000000,448.962,452.998,442.004,
72.000000,443.001,450,437.049,
73.000000,450.004,444.95,436.02,
74.000000,448.992,454.458,431.976,
75.000000,448.024,460.48,442.978,
76.000000,454.516,462.52,440.019,
77.000000,461.5,461.52,448.984,
78.000000,474.472,464.008,440.008,
79.000000,468.512,457.032,446.976,
80.000000,466.52,453.994,446.984,
81.000000,469.01,443.035,444.06,
82.000000,465.536,460.988,442.011,
83.000000,476.012,460.032,456.02,
84.000000,474.056,454.48,441.007,
85.000000,469.04,454.024,453.004,
86.000000,470,457.464,444.008,
87.000000,463.992,453.55,438.01,
88.000000,451.992,457.492,435.04,
89.000000,443.996,452.02,440,
90.000000,454.04,454.512,436.02,
91.000000,452.984,443.03,439.032,
92.000000,460.025,452.998,438.993,
93.000000,456,450.006,439.952,
94.000000,454.973,460.504,443.028,
