Time [s],1000000000,1000000001,1000000002,
0.000000,3533.26,10940.7,3091.63,
1.000000,3757.51,12254.9,3289.63,
2.000000,2831.24,9684.84,2490.18,
3.000000,2312.8,8464.27,2055.3,
4.000000,1968.77,6432.22,1740.54,
5.000000,1825.64,5633.99,1472.6,
6.000000,1781.5,4725.48,1327.33,
7.000000,1641.85,4032.45,1151.51,
8.000000,1435.95,3395.52,1025.48,
9.000000,1524.15,3681.85,1121.82,
10.000000,1654.29,6667.58,1564.71,
11.000000,1773.24,6720.71,1711.33,
12.000000,2164.04,8837.93,2135.1,
13.000000,2500.32,10026.1,2669.65,
14.000000,2851.44,9761.82,3025.59,
15.000000,2643.51,8934.44,2700.5,
16.000000,2125.02,7601.03,2280.29,
17.000000,1551.25,5813.76,1677.23,
18.000000,1243.9,4671.65,1261.14,
19.000000,1167.08,4307.49,1216.19,
20.000000,1171.23,4251.38,1143.66,
21.000000,1186.88,3824.18,1137.82,
22.000000,1125.92,3683.08,1008.39,
23.000000,1039.01,3443.19,985.112,
24.000000,1007.56,3198.6,893.136,
25.000000,1045.47,3334.99,1024.2,
26.000000,1318.92,4665.82,1304.64,
27.000000,1323.14,5001.54,1316.67,
28.000000,1513.92,5096.36,1497.92,
29.000000,2029.71,6101.17,2010.07,
30.000000,1979.54,8167.42,2308.17,
31.000000,1898.97,8558.89,2324.89,
32.000000,1673.83,7031.11,2034.45,
33.000000,1276.86,5211.6,1583.5,
34.000000,976.092,4249.64,1232.7,
35.000000,896.84,3881.92,1129.38,
36.000000,889.076,3733.03,1041.08,
37.000000,876.074,3590.03,1050,
38.000000,840.066,3385.27,915.24,
39.000000,837.877,3209.45,905.052,
40.000000,832.12,2837.14,843,
41.000000,907.29,3003.02,916.805,
42.000000,1089.07,3679.26,1181.5,
43.000000,1095.99,3704.7,1252.24,
44.000000,1236.37,4820.58,1395.72,
45.000000,1498.82,5545.17,1697.82,
46.000000,1639.57,5549.54,2046.88,
47.000000,1640.26,6441.33,2044.4,
48.000000,1465.93,6447.45,1938.65,
49.000000,1163.07,4541.31,1484.44,
50.000000,1019.02,3715.01,1221.09,
51.000000,885.14,3308.52,1117.65,
52.000000,839.815,3189.33,969.712,
53.000000,828.011,2970.7,904.984,
54.000000,774.99,2864.67,907.694,
55.000000,764.001,2783.39,831.979,
56.000000,700.14,2472.29,785.649,
57.000000,831.12,2707.98,858.672,
58.000000,1050.04,3620.28,1079.07,
59.000000,991.1,3582.72,1107.6,
60.000000,1118.55,4500.32,1297.77,
61.000000,1381.35,5025.18,1549.85,
62.000000,1666.65,5392.93,1842.78,
63.000000,1702.8,6092.37,1978.95,
64.000000,1453.42,6251.06,1835.89,
65.000000,1163.45,4656.35,1401.7,
66.000000,997.63,3483.79,1158.36,
67.000000,870.418,3055.8,1042.42,
68.000000,785.444,2888.89,950.094,
69.000000,772.388,2755.9,857.443,
70.000000,727.008,2551.68,811.519,
71.000000,687.44,2411,775.594,
72.000000,644.4,2181.98,750.036,
73.000000,723.496,2238.41,787,
74.000000,907.952,3224.24,1039.99,
75.000000,958.62,3163.54,1020.47,
76.000000,1053.98,3705.16,1153.68,
77.000000,1312.9,4290.72,1273.34,
78.000000,1463,5108.42,1520.19,
79.000000,1537.99,5990,1688.06,
80.000000,1470,5750.95,1635.63,
81.000000,1219.22,4813.72,1333.63,
82.000000,961.888,3433.36,1053.57,
83.000000,862.126,2946.41,892.954,
84.000000,754.927,2781.55,829.026,
85.000000,739.19,2691.59,777.964,
86.000000,727.132,2438.92,739.9,
87.000000,681.058,2289.76,692.526,
88.000000,621.92,2084.72,685.08,
89.000000,682.985,2215.05,697.028,
