Time [ms],1000000000,1000000001,1000000002,1000000003,
0,2982.88,3403.75,2047.7,2863.31,
1000000000,2594.46,3517.64,3033.23,3657.54,
2000000000,3018.42,4189.33,5099.56,5219.86,
3000000000,3394.22,6027.91,6646.69,6173.82,
4000000000,3237.56,6382.84,6853.59,7224.14,
5000000000,3255.78,5488.69,6520.8,7091.24,
6000000000,2822.05,4906.15,6540.79,6872.17,
7000000000,2745.31,4497.96,6113.3,6826.64,
8000000000,2328.92,4139.2,5600.92,5915.03,
9000000000,2225.15,3697.87,5010.06,5439.52,
10000000000,1996.56,3349.03,4505.59,4867.86,
11000000000,1659.26,3102.26,3795.61,4139.41,
12000000000,1432.07,2681.9,3585.37,3755.73,
13000000000,1371.13,2429.65,3092.81,3368.8,
14000000000,1236.14,2330.19,2950.58,3001.94,
15000000000,1255.94,2492.2,2830.1,3028.73,
16000000000,1355.93,2857.56,2657.52,3022.53,
17000000000,1406.94,2986.59,2823.96,3102.25,
18000000000,1277.03,3191.93,2900.52,3266.92,
19000000000,1183.12,2762.01,2687.77,3115.04,
20000000000,1167.1,2661.84,2765.81,2916.75,
21000000000,1265.05,2601.99,2770.92,2965.21,
22000000000,1298,2480.97,2775.09,3041.23,
23000000000,1356.92,2300.96,2621.24,2813.92,
24000000000,1305.52,2126.06,2324.79,2708.31,
25000000000,1206.58,2022.25,2212.1,2446.88,
26000000000,1243.57,1948.37,1955.81,2308.8,
27000000000,1157.98,1850.99,1775.23,2158.78,
28000000000,1208.9,1721.08,1725.1,2028.02,
29000000000,1145.42,1768.01,1725.05,2100.97,
30000000000,1274.51,1820.86,1739.16,1965.86,
31000000000,1299.18,1830.35,1689.25,2141.08,
32000000000,1304.11,1779,1857.21,2031.91,
33000000000,1311.1,1639.07,1746,2112.7,
34000000000,1388.21,1640.03,1687,2054,
35000000000,1369.04,1580.04,1797.92,2073.92,
36000000000,1271.14,1556.77,1812.03,2069.48,
37000000000,1199,1498.5,1747.06,1986.87,
38000000000,1192.06,1420.46,1560.78,1911.22,
39000000000,1091.14,1333.01,1532,1764.86,
40000000000,1052.94,1354.43,1389.82,1653.88,
41000000000,1035.06,1325.97,1368.07,1558.08,
42000000000,1010.07,1259.95,1322.78,1530.9,
43000000000,1032.1,1258.94,1300,1584.82,
44000000000,1081.02,1272.73,1391.92,1516.24,
45000000000,1155.96,1348.32,1384.21,1537.86,
46000000000,1115.93,1237.16,1418.3,1527.14,
47000000000,1110.07,1220.83,1438.26,1467.26,
48000000000,1102.48,1311.77,1460.04,1522.74,
49000000000,1064.5,1291,1509.15,1614.75,
50000000000,1028.9,1223.98,1461.03,1543.28,
51000000000,959.904,1074,1445.15,1389.78,
52000000000,910.12,1122.2,1321,1412.94,
53000000000,912.952,1095.99,1291.24,1264.69,
54000000000,864.452,1095.06,1161.6,1252.82,
55000000000,845.992,1004.09,1159.08,1189.86,
56000000000,855.456,1036.89,1138.86,1134.4,
57000000000,820.054,1066.12,1123.96,1115.98,
58000000000,884.22,1039,1134,1113.86,
59000000000,900.84,1077.97,1180.95,1095.07,
60000000000,877.034,1043.92,1175.4,1194.25,
61000000000,857.928,1056.01,1140.46,1171.12,
62000000000,846.08,1099.5,1157.54,1137.25,
63000000000,824.96,1047.98,1195.72,1166.08,
64000000000,798.944,1050.54,1181,1115.19,
65000000000,801.032,1025.04,1119.2,1149.09,
66000000000,784.108,991.22,1080.11,1016.85,
67000000000,774.056,968.58,1025.81,1002.1,
68000000000,729.975,946.508,1039.08,1028.14,
69000000000,722.94,935.98,947.18,942.14,
70000000000,736.964,935.588,970.106,899.04,
71000000000,728.984,943.152,971.086,915.976,
72000000000,711.46,962.964,936,976.968,
73000000000,736.456,1017.99,991.049,980.792,
74000000000,721.906,993.84,973.88,921.298,
75000000000,709.04,967.42,978.937,1010.03,
76000000000,695.45,981.476,987.023,940.983,
77000000000,681.02,983.856,1012.97,998.14,
78000000000,679.014,931.128,1012.8,936.972,
79000000000,666.988,920.1,955.1,941.89,
80000000000,663.05,914.112,954.826,934.98,
81000000000,675.987,902.58,920.05,924.918,
82000000000,647.016,874.932,936.888,884.164,
83000000000,657.968,838.064,838.119,854.152,
84000000000,652.96,813.06,852.872,828.952,
85000000000,618.452,883.956,864.818,843.988,
86000000000,617.012,875.92,863.776,847,
87000000000,614.544,881.91,870.862,814.052,
88000000000,627.992,865.056,847.124,857.524,
89000000000,640,889.904,896.124,827.4,
90000000000,615.462,900.492,888.096,854.944,
91000000000,632,900.952,903.886,866.919,
92000000000,610.485,847.008,855.6,886.004,
93000000000,614.012,851.98,891.992,887,
94000000000,616.02,837.948,849.518,856.004,
95000000000,598.984,842.928,855.576,833.112,
