Time [ms],1000000000,1000000001,1000000002,1000000003,
0,6439.22,2782.54,4194.21,1261.2,
1000000000,4135.92,2218.83,3690.68,1181.5,
2000000000,3402.33,2336.96,4002.72,1369.06,
3000000000,3729.48,2682.32,3700.24,1642.8,
4000000000,4392.83,3192.04,4238.23,1846.3,
5000000000,4729.95,3600.13,4641.52,2075.69,
6000000000,4592.8,3549.11,4021.97,1864.83,
7000000000,4126.53,3303.56,3775.27,1946.97,
8000000000,3876.63,3489,4246.11,2201.95,
9000000000,3605.54,3257.64,4204.2,2157.85,
10000000000,3125.4,2995.78,3813.83,2185.53,
11000000000,2708.96,2776.17,3619.4,2237.22,
12000000000,2456.8,2523.96,3527.42,2246.15,
13000000000,2164.95,2208.03,3244.9,2163.87,
14000000000,2090.15,2004.11,2961.37,1981.01,
15000000000,1951.81,1879,2756.64,1898.96,
16000000000,1783.78,1796.8,2507.4,1660.06,
17000000000,1741.86,1775.07,2703.83,1678.01,
18000000000,1884.76,1829.48,2576.06,1651.58,
19000000000,2109.92,2028.98,2883.32,1997.26,
20000000000,2509,2295.46,3323,2180.82,
21000000000,2777.61,2586.12,3470.75,2265.71,
22000000000,2736.14,2327.86,3257.49,2394.29,
23000000000,2446.05,2118.45,2984.72,2201.44,
24000000000,2372,2093.96,2946.36,2153.5,
25000000000,2265.95,2049.94,2859.31,2001.01,
26000000000,2298.08,1999.99,2693.34,2013.05,
27000000000,2242.79,1891.44,2544.09,1819.02,
28000000000,2095.06,1732.63,2357.94,1746.18,
29000000000,1873.88,1647.13,2179.19,1551.16,
30000000000,1767.11,1534.06,2008.99,1403.98,
31000000000,1643,1426.04,1905.95,1408.02,
32000000000,1551.11,1366.98,1964.25,1270.01,
33000000000,1453.47,1336.95,1834.14,1315.46,
34000000000,1413.02,1325.01,1896.91,1334.51,
35000000000,1459.1,1465.42,2012.89,1683.94,
36000000000,1826.95,1634.9,2222.3,1749.01,
37000000000,2018,1689,2350.68,2020.72,
38000000000,1934.1,1614.84,2298.28,1888.83,
39000000000,1792,1557.94,2154.03,1945.22,
40000000000,1781.4,1518,2079.91,1776.53,
41000000000,1725.96,1469.96,2049.42,1879,
42000000000,1606.16,1444.08,1891.22,1619.83,
43000000000,1584.14,1366.96,1787.86,1553.23,
44000000000,1478.06,1300.5,1603.88,1316.01,
45000000000,1362.15,1267.55,1568.51,1239.03,
46000000000,1327.94,1227.04,1448.96,1204.84,
47000000000,1266.05,1174.92,1376.67,1082.89,
48000000000,1179.02,1129.05,1275.74,999.008,
49000000000,1126.94,1114.5,1235.51,984.056,
50000000000,1095.98,1118.53,1181,1011.9,
51000000000,1102.08,1194.06,1280.49,1151.06,
52000000000,1176.84,1358.98,1381.49,1323.1,
53000000000,1256.27,1346.06,1503.25,1417.86,
54000000000,1379.94,1327.51,1486.98,1398.05,
55000000000,1335.48,1257.06,1493.1,1315.9,
56000000000,1371.05,1243.92,1487.07,1307.11,
57000000000,1330.41,1212.9,1420.95,1273.98,
58000000000,1279.35,1196.96,1422,1201.03,
59000000000,1271.93,1134.98,1320,1144.01,
60000000000,1213.53,1098.97,1278.91,1124.92,
61000000000,1195.54,1083.99,1226.13,1091.88,
62000000000,1115.52,1054.97,1184.99,1069.88,
63000000000,1100.58,1048.08,1150.86,1028.96,
64000000000,1077.55,1028.13,1091.07,999.96,
65000000000,1050.94,1069.09,1051.11,931.984,
66000000000,1021.97,1076.92,1069.84,947.501,
67000000000,1044.01,1164.96,1163.97,1048.56,
68000000000,1124.96,1201.1,1256.15,1116.64,
69000000000,1178.93,1209.05,1326.18,1195.02,
70000000000,1212.95,1179.98,1317.9,1180.92,
71000000000,1263.1,1136.09,1323.96,1117.93,
72000000000,1225.83,1098.07,1292.9,1145.02,
73000000000,1260.12,1086.09,1298.62,1105.06,
74000000000,1220.56,1058.11,1223.02,1036.96,
75000000000,1170.09,1051,1202.66,966.879,
76000000000,1150.49,1021.1,1211.41,931.064,
77000000000,1102.5,1069.97,1165.49,925.016,
78000000000,1133.05,1052.9,1111.84,901.096,
79000000000,1107.86,1045.93,1137.99,893.038,
80000000000,1091.86,1044.03,1067.9,897.096,
81000000000,1051.95,1043,1062.51,861.504,
82000000000,1009.8,1105.09,1111.08,954.996,
83000000000,1076.2,1155.93,1167.96,1042.03,
84000000000,1144.92,1232.92,1275.41,1067.9,
85000000000,1189.96,1224.02,1290.61,1109.6,
86000000000,1275.26,1240.41,1326.04,1176.06,
87000000000,1242.09,1218.05,1270.96,1128.88,
88000000000,1276.05,1126.12,1296.03,1115.94,
89000000000,1257.16,1094.92,1286.96,1108.44,
90000000000,1249,1086.05,1231.95,1029.43,
91000000000,1220.07,1064.45,1227.9,1016.52,
92000000000,1165.89,1041.9,1164.14,979.078,
93000000000,1153.92,1067.02,1135.24,951.984,
94000000000,1139.92,1097.1,1144.88,950.424,
95000000000,1123.09,1125.06,1112.99,946.56,
