Time [ms],1000000000,1000000001,1000000002,
0,1428.56,1703.14,1440.46,
1000000000,1423.91,1574.76,1700.22,
2000000000,1744.67,1651.83,1177.02,
3000000000,2009.41,2107.2,1132.56,
4000000000,2688.63,2949.07,989.398,
5000000000,3095.23,3251.35,958.765,
6000000000,2560.6,4198.77,1860.74,
7000000000,2786.38,2608.55,1929.94,
8000000000,2949.67,2460.16,2142.35,
9000000000,2097.4,1728.79,2622.53,
10000000000,2453.4,1370.75,3473.94,
11000000000,2033.5,1252.67,2600.46,
12000000000,1858.9,1377.35,2257.37,
13000000000,1980.61,1675.61,1718.47,
14000000000,1884.47,1761.78,1680.01,
15000000000,1853.7,1407.59,1428.16,
16000000000,1734.42,1270.93,1165.39,
17000000000,1468.42,1118.18,1081.13,
18000000000,1510.65,1339.32,905.28,
19000000000,1360.25,1284.52,1010.94,
20000000000,1367.83,1329.16,1063.8,
21000000000,1484.26,1418.85,938.052,
22000000000,1461.11,1409.79,1115,
23000000000,1585.51,1529,1036.08,
24000000000,1614.05,1690.62,1115.97,
25000000000,1486.33,1903.34,1173.61,
26000000000,1695.97,1994.2,1105.07,
27000000000,1860.74,2064.47,923.784,
28000000000,1693.29,2002.88,973.64,
29000000000,1618.2,1944.55,851,
30000000000,1449.14,1936.88,809.106,
31000000000,1481.5,1815.7,754.116,
32000000000,1264,1681.58,719.24,
33000000000,1204.1,1547.25,586.652,
34000000000,1114.64,1615.17,683.128,
35000000000,1112.6,1532,653.016,
36000000000,1091.03,1451.98,737.572,
37000000000,1030.67,1399.81,641.886,
38000000000,1023.18,1270.05,692.04,
39000000000,1005.99,1139.08,682.976,
40000000000,1112.04,1255.2,647,
41000000000,928.492,1287.07,623.134,
42000000000,1086.02,1239.11,660.108,
43000000000,1428.52,1191.11,598.12,
44000000000,1454.18,1368.49,600.166,
45000000000,1561.89,1283.14,549.984,
46000000000,1619.15,1185.29,612.188,
47000000000,1140.68,1138.96,611.068,
48000000000,1174.21,1116.92,641.016,
49000000000,1056.89,1093.08,610.912,
50000000000,948.048,1081.26,610.934,
51000000000,1112.84,1043.83,586.96,
52000000000,1095.13,934.888,581.122,
53000000000,1093.98,812.947,564.04,
54000000000,1107.84,808.918,574.916,
55000000000,1014.87,916.192,553.016,
56000000000,986.08,878.516,545.456,
57000000000,1047.16,857.98,541.964,
58000000000,943.538,821.028,525.56,
59000000000,983.526,854.555,510.028,
60000000000,999.96,954.94,486.072,
61000000000,1076.64,949.02,517,
62000000000,1190.67,937.496,506.008,
63000000000,1172.44,984.271,485.039,
64000000000,1173.59,1009.1,475.98,
65000000000,1144.98,973.008,470.064,
66000000000,1112.93,955.224,525.544,
67000000000,1020.85,888.954,512.968,
68000000000,1049.16,867.904,515.532,
69000000000,932.167,884.17,517.96,
70000000000,1025.16,865.14,531.044,
71000000000,924.17,843.91,510.512,
72000000000,929.088,722.848,504.04,
73000000000,956.978,688.017,491,
74000000000,983.97,664.12,480.9,
75000000000,888.967,651.16,476.52,
76000000000,936.88,681.08,470.94,
77000000000,878,651.048,452.984,
78000000000,853.175,698.08,453.994,
79000000000,850.961,622.964,458.96,
80000000000,928.026,623.106,452.033,
81000000000,889.905,670.9,468.502,
82000000000,791.147,685.872,468.992,
83000000000,810.684,685.04,486.989,
84000000000,780.289,720.084,473.88,
85000000000,820.064,732.08,491.082,
86000000000,722.14,680.128,493.994,
87000000000,761.082,688.005,471.028,
88000000000,776.088,671.952,461.982,
89000000000,716,739.034,460.04,
90000000000,727.59,685.072,460.08,
91000000000,725.4,693.946,457.993,
92000000000,757.496,693.942,459,
93000000000,684.924,644.98,452.995,
94000000000,685.944,668.004,451.003,
95000000000,662.25,648.936,434.002,
