Time [ms],1000000000,1000000001,1000000002,1000000003,
0,3448.29,1742.04,1432.01,2340.53,
1000000000,1444.02,1259.13,1307.09,1605.8,
2000000000,1189.9,1165.04,1174.02,1714.08,
3000000000,1214.04,1337.57,1603.22,1838.05,
4000000000,1292.37,1573.52,1919.3,1962.83,
5000000000,1331.86,1612.18,1919.86,2077.93,
6000000000,1370.96,1579.37,1807.99,2148.52,
7000000000,1276,1633.4,1877.4,2162.19,
8000000000,1194.1,1620.09,1809.01,1999.82,
9000000000,1188.95,1514.89,1646.08,1807.18,
10000000000,1092.08,1352.95,1595.07,1681.65,
11000000000,1067.14,1209.91,1429.93,1511,
12000000000,1029.88,1164.05,1235.05,1361.85,
13000000000,1003.93,1041.88,1240.02,1316.21,
14000000000,996.533,1050.02,1152.91,1275,
15000000000,988.992,1048.43,1136.94,1315.56,
16000000000,961.448,1009.95,1175.06,1247.57,
17000000000,948.1,1056.96,1118.01,1262.91,
18000000000,983.976,1180.52,1258.05,1270.14,
19000000000,959.976,1289,1213.16,1249,
20000000000,948.024,1207.05,1342,1294.11,
21000000000,966.912,1267.41,1336.83,1303.8,
22000000000,985.02,1325.85,1426.31,1299.03,
23000000000,946.938,1261,1249.86,1314.92,
24000000000,987,1216.14,1199.96,1348.32,
25000000000,959.96,1181.99,1216.85,1288.17,
26000000000,889.535,1102.16,1181.03,1181.01,
27000000000,842.517,1078.97,1076.87,1146.08,
28000000000,801.958,1041.1,1052.01,1084.06,
29000000000,774.02,983.136,1029.97,1022.87,
30000000000,752.524,982.08,1036.9,957,
31000000000,706.986,947.02,1001.96,934.08,
32000000000,696.48,945,1037.13,893.092,
33000000000,662.48,976.924,1086.9,870.062,
34000000000,685.48,957.1,1081.9,843.966,
35000000000,683.046,960.009,1029.89,838.99,
36000000000,649.04,983.154,1051.1,861.064,
37000000000,659.068,985.698,1141.14,841.985,
38000000000,683.042,977.042,1149,821.04,
39000000000,679.1,945,1076.93,872.13,
40000000000,664.952,993.892,1090.96,886.936,
41000000000,644.048,923,1024.08,897.979,
42000000000,633.944,882.074,932.11,862.997,
43000000000,629,839.88,893.1,820.896,
44000000000,598.038,794.048,870.941,814.94,
45000000000,571.032,795.484,766.948,777.032,
46000000000,567.048,740.956,813.064,767.464,
47000000000,553.516,759.448,757,748.58,
48000000000,552.938,732,752.904,691.04,
49000000000,544,720.1,837.064,706.024,
50000000000,535.008,735.05,814.04,687.993,
51000000000,543.982,753.984,787.108,708.054,
52000000000,527.478,712.06,764.08,719.95,
53000000000,538,738.936,788.028,689,
54000000000,559.04,750.18,783.992,692.021,
55000000000,534.096,755,808.11,745.116,
56000000000,552.488,759.008,788.086,769.136,
57000000000,549.5,734.98,759.098,722.916,
58000000000,531.98,715.98,731.04,715,
59000000000,540.968,711.986,723.008,699.88,
60000000000,520.078,680,712.974,684.888,
61000000000,519.98,687.928,696.06,666,
62000000000,504.96,643.48,700,644.04,
63000000000,516,645.912,693.05,651.962,
64000000000,491.968,621.929,679.02,650,
65000000000,486.492,674.018,674.942,618.06,
66000000000,494.496,634.076,684.008,623.504,
67000000000,483.988,622,675.97,634.988,
68000000000,493.978,640.956,646.96,620.99,
69000000000,482.048,647,669.018,638.015,
70000000000,484.525,628.944,670.972,616,
71000000000,513.02,648.944,668.031,667.048,
72000000000,496.004,660.944,657,653.476,
73000000000,495.988,662.978,667.93,657.516,
74000000000,486.98,644.06,658,680.936,
75000000000,482.019,623.97,647.912,650.604,
76000000000,490.502,617.096,662.015,651.004,
77000000000,482.978,647.076,665.013,607.016,
78000000000,483.036,615.936,637.488,619,
79000000000,484.984,598.016,620.496,620.028,
80000000000,469.99,584.995,626.032,597.978,
81000000000,478.012,593.015,632.504,607.524,
82000000000,474.027,596.936,632.016,591.016,
83000000000,464.01,596.042,608.558,593,
84000000000,476.984,588.044,605.496,573.974,
85000000000,484.04,596.009,595.552,582.05,
86000000000,472.03,585.022,605.988,580.994,
87000000000,466.03,596.938,620.984,599.012,
88000000000,468,618.944,615.996,593.08,
89000000000,483.023,594.508,605.984,608.96,
90000000000,465.994,588.972,609,595.072,
91000000000,464.021,606.96,612.55,595.98,
92000000000,468.003,586.98,620.012,579.984,
93000000000,468.03,599.08,615.036,578,
94000000000,465.98,573.04,610.53,583.016,
95000000000,460.998,577.056,621.956,578.028,
