Time [ms],1000000000,1000000001,1000000002,1000000003,
0,825.088,1274.92,1010.06,917.957,
1000000000,1113.84,1846.48,1143.07,870.912,
2000000000,1653,2784.74,1587.96,1063.14,
3000000000,2691.06,4172.03,2674.06,1585.22,
4000000000,3747.72,5140.34,3241.94,2107.39,
5000000000,3889.82,5384.68,3678,2383.76,
6000000000,3468.8,5127.05,3497.3,2409.06,
7000000000,2854.54,4588.74,3226.15,2347.42,
8000000000,3310.68,3930.63,3248.45,2293.68,
9000000000,2814.03,3696.36,2893.85,2291.8,
10000000000,2369.72,2995.53,2794.95,2195.96,
11000000000,2018.24,2527.35,2296.01,1917.65,
12000000000,2050.58,2229.44,2209.01,1760.38,
13000000000,1772.17,2054.86,2022.94,1524.39,
14000000000,1788.08,1970.64,1903,1513.9,
15000000000,1703.3,1876.26,1822.13,1361.46,
16000000000,1652.48,1825.28,1755.07,1394.8,
17000000000,1700.15,2045.42,1823.01,1295.02,
18000000000,2087.05,2360.92,2104.49,1548.88,
19000000000,2335.15,2992.98,2669,1791.97,
20000000000,2540.8,3281.04,2947.37,2026.5,
21000000000,2345.23,2951.1,2952.32,1865.84,
22000000000,2633.93,2876.83,2807.21,1812.98,
23000000000,2609.65,2848.46,2687.67,1799.78,
24000000000,2416.01,2683.5,2590.14,1788.18,
25000000000,2268.82,2414.17,2708.62,1777.87,
26000000000,2085.07,2130.59,2521.38,1724.1,
27000000000,1794.12,1939.46,2271.02,1503.2,
28000000000,1685.82,1701.21,1995.73,1247.57,
29000000000,1565.95,1519.95,1737.03,1170.56,
30000000000,1511.03,1437.16,1505.98,1152.86,
31000000000,1451.03,1330.21,1434.21,1086.04,
32000000000,1469.08,1373.96,1318.06,1029.46,
33000000000,1499.99,1396.87,1313.08,1011.96,
34000000000,1785.55,1607.99,1458.97,1001.12,
35000000000,1805,1874.98,1751.01,1170.41,
36000000000,1745.17,1943.18,1857.86,1281.24,
37000000000,1819.08,1873.7,1846.81,1255.03,
38000000000,1793.86,1973.91,1793.14,1248.98,
39000000000,1788.88,1833.12,1813.19,1271.04,
40000000000,1753.88,1768.7,1747.89,1283.1,
41000000000,1591.75,1611.1,1629.06,1359.76,
42000000000,1520.82,1463.13,1466.09,1251.07,
43000000000,1461.95,1411,1334.85,1145.14,
44000000000,1376.35,1322.45,1254.14,1075.06,
45000000000,1317.16,1211.91,1162.97,1035.14,
46000000000,1222.46,1171.02,1093.84,1040.08,
47000000000,1229.33,1082.12,1069.96,976.048,
48000000000,1173.24,1091.02,1027.85,926.905,
49000000000,1286.96,1264.21,1058.99,907.986,
50000000000,1343.99,1338.05,1274.9,910.004,
51000000000,1372.01,1503.91,1345.87,934.024,
52000000000,1392.08,1457,1381.35,1007.5,
53000000000,1405.51,1417.14,1306.07,1044.56,
54000000000,1476.17,1433.16,1333.19,1033.98,
55000000000,1420.07,1410.95,1292.16,1059.98,
56000000000,1397.14,1361.08,1369.04,1069.93,
57000000000,1282.9,1312.88,1239.99,1094.92,
58000000000,1265.15,1270.51,1125.22,1044.11,
59000000000,1215.12,1247.02,1105.04,991.02,
60000000000,1120.68,1127.01,1069.05,946.02,
61000000000,1114.95,1065.94,1011,956.063,
62000000000,1057.06,1008.08,962.968,899.072,
63000000000,1125,1026.98,924.115,876.999,
64000000000,1075.9,1032,959.02,839.018,
65000000000,1124.75,1139.07,1032.92,830.072,
66000000000,1158.96,1244.09,1127.92,822.964,
67000000000,1141.96,1224.94,1141.96,856,
68000000000,1129.09,1288.15,1102.86,867.988,
69000000000,1174.05,1289.91,1115,891,
70000000000,1181.05,1247.98,1174.04,891.872,
71000000000,1174.11,1308.2,1123.04,884.102,
72000000000,1169.14,1261.04,1192.98,900.984,
73000000000,1118.05,1233.99,1046.51,930.028,
74000000000,1120.54,1201.8,1074.83,920.988,
75000000000,1062.11,1120.01,922.114,871.014,
76000000000,1034.06,1116.87,945.96,867.962,
77000000000,960.503,1017.05,935.04,834.005,
78000000000,982.872,1008.86,922.079,805.024,
79000000000,996,957.088,908.05,784.992,
80000000000,1013.54,1020.03,933.1,766.944,
81000000000,1073.99,1034.84,967.034,780.031,
82000000000,1053.42,1138.94,1094.1,736.99,
83000000000,1038.88,1161.1,1023.04,784.999,
84000000000,1009.02,1137.05,1065.07,747.472,
85000000000,1097.9,1119.88,1081,793.061,
86000000000,1056.03,1168.96,999.888,793.95,
87000000000,1000.94,1147.16,1003.08,805.02,
88000000000,1015.98,1180.91,1020.95,825.876,
89000000000,971.05,1168.03,1027.95,802.001,
90000000000,983.89,1117.07,945.93,802.974,
91000000000,948.11,1106.21,964.984,784.024,
92000000000,954.935,1025.07,895.312,771.036,
93000000000,899.988,995.004,941.128,743.522,
94000000000,909.96,946.924,909.88,753.012,
95000000000,891.976,958.04,897.065,710.872,
