Frame number,1000000000,1000000001,
0.000000,941.465,692.196,
1.000000,1047.68,707.396,
2.000000,1638.93,1129.15,
3.000000,2368.81,1560.7,
4.000000,2220.67,1485.78,
5.000000,2756.13,2012.49,
6.000000,2046.44,1467.62,
7.000000,1585.62,1202.48,
8.000000,1444.22,1054.27,
9.000000,1380.31,850.33,
10.000000,1234.32,748.462,
11.000000,1064.13,726.02,
12.000000,960.3,683.33,
13.000000,816.907,633.103,
14.000000,868.957,587.533,
15.000000,749.91,548.596,
16.000000,598.126,561.965,
17.000000,584.094,510.62,
18.000000,637.737,536.332,
19.000000,628.01,547.006,
20.000000,620.29,544.926,
21.000000,809.594,593.656,
22.000000,957.569,714.559,
23.000000,1030.18,739.12,
24.000000,1145.94,753.073,
25.000000,1082.02,701.108,
26.000000,1108.75,689.62,
27.000000,944.111,648.668,
28.000000,768.328,592.02,
29.000000,749.2,640.293,
30.000000,629.018,550.816,
31.000000,622.177,548.789,
32.000000,636.975,572.89,
33.000000,615.158,528.835,
34.000000,606.045,539.874,
35.000000,597.1,574.053,
36.000000,616.202,603.145,
37.000000,628.25,601.974,
38.000000,710.032,659.813,
39.000000,904.95,700.785,
40.000000,1055.44,753.989,
41.000000,1028.37,813.105,
42.000000,903.2,817.675,
43.000000,936.72,765.325,
44.000000,887.968,792.749,
45.000000,779.448,688.754,
46.000000,671.9,607.891,
47.000000,658.125,586.135,
48.000000,646.177,594.977,
49.000000,603.948,593.111,
50.000000,585.522,566.872,
51.000000,564.968,567.946,
52.000000,607.928,574.041,
53.000000,599.216,594.084,
54.000000,641.934,572.117,
55.000000,644.521,679.243,
56.000000,684.08,662.98,
57.000000,735.432,698.342,
58.000000,779.297,656.882,
59.000000,806.155,680.245,
60.000000,787.178,732.199,
61.000000,685.084,581.031,
62.000000,652.828,559.125,
63.000000,606.963,584.088,
64.000000,604.818,556.96,
65.000000,582.925,559.12,
66.000000,559.105,537.898,
67.000000,553.907,527.98,
68.000000,542.98,510.105,
69.000000,542.998,546.974,
70.000000,554.046,509.122,
71.000000,585.06,564.901,
72.000000,646.84,585.96,
73.000000,670.098,656.942,
74.000000,737.093,663.201,
75.000000,715.888,690.044,
76.000000,775.04,716.035,
77.000000,720.07,653.722,
78.000000,673.932,619.175,
79.000000,644.428,593.15,
80.000000,659.914,537.066,
81.000000,598.105,505.977,
82.000000,585.015,519.097,
83.000000,544.984,536.092,
84.000000,540.984,496.15,
85.000000,554.968,501.952,
86.000000,534.027,493.02,
87.000000,522.944,514.043,
88.000000,546.98,499.98,
89.000000,567,519.954,
90.000000,586.132,494.066,
91.000000,578.208,484.1,
92.000000,589.216,500.21,
93.000000,625.828,521.996,
94.000000,610.345,479.026,
95.000000,594.022,509.584,
