Time [ms],1000000000,1000000001,1000000002,1000000003,
0,1175.97,838,1256.9,625.034,
1000000000,1187.87,998,1332.24,926.96,
2000000000,1301.39,1355.34,1632.63,1128.87,
3000000000,1456.11,1680.31,1813.19,1305.67,
4000000000,1477.07,1861.36,1948.7,1543.07,
5000000000,1348.81,1655.5,1936.19,1513.11,
6000000000,1241.16,1420.14,1645.03,1390.22,
7000000000,1235.1,1195.12,1525.49,1268.19,
8000000000,1170.4,1320.82,1384.69,1126.17,
9000000000,1114.78,1247.14,1301.1,1115.14,
10000000000,1010.93,1124.12,1214.43,1022.03,
11000000000,947.982,1004.12,1102.13,901.936,
12000000000,860,968.5,1031.36,844.041,
13000000000,846.995,988.024,1005.41,769.04,
14000000000,793.908,942.45,916.096,752.48,
15000000000,790.872,883.9,874.991,703.534,
16000000000,752.003,889.044,868.198,661.376,
17000000000,774.056,869.128,902.043,666.62,
18000000000,798.062,881.192,897.068,673.52,
19000000000,849.918,1009.99,1032.94,744.445,
20000000000,877.928,1053.67,1181.22,851.9,
21000000000,866.172,1084,1221.1,935.944,
22000000000,863.996,1056.96,1212.13,982.944,
23000000000,870.58,1087.62,1081.15,945.034,
24000000000,894.368,1027.21,1128,882.14,
25000000000,874.048,1033.17,1035.2,883.971,
26000000000,841.124,1013.1,1032.06,867.842,
27000000000,803.6,1002.11,969.08,847.9,
28000000000,755.122,975.9,928.776,773.054,
29000000000,742.925,947.96,861.028,776.992,
30000000000,712.102,950.108,791.96,700.448,
31000000000,709.084,926.056,841.204,670.58,
32000000000,658.888,894,813.864,645.02,
33000000000,672.94,875.972,813.16,648.518,
34000000000,675.079,879.472,835.217,663.5,
35000000000,690.478,886.192,882,668.568,
36000000000,702.54,957.013,945.25,681.98,
37000000000,718.836,979.056,974.19,765.548,
38000000000,727.068,999.88,947.88,786.092,
39000000000,720.84,999.136,1082.12,795.995,
40000000000,745.846,1021.04,1058.82,793.458,
41000000000,726.83,987.04,1034.82,750.12,
42000000000,731.518,978.936,958.915,735.462,
43000000000,680.539,933.19,934.271,754.1,
44000000000,662.056,868.784,909.883,711.028,
45000000000,669.524,878.442,821.813,678.06,
46000000000,640.48,879.994,832.99,658.078,
47000000000,619.536,835.022,808.08,647.148,
48000000000,610.04,837.063,803.033,594.896,
49000000000,610.016,826.974,783.944,617.998,
50000000000,601.04,813.36,801.556,606.88,
51000000000,596.428,846.476,855.43,653.974,
52000000000,606.97,848.068,850.416,666.05,
53000000000,625,846.384,859.504,684,
54000000000,631.094,879.376,876.896,677.968,
55000000000,643.028,911.033,839.884,711.08,
56000000000,664.008,901.149,900.182,706.055,
57000000000,628.976,883.187,848.18,707.884,
58000000000,621.921,850.974,873.196,710.02,
59000000000,635.84,838.018,892.908,665.096,
60000000000,609.054,825.118,834.76,693.904,
61000000000,596.956,813.86,836.008,665.008,
62000000000,593.52,816.492,804.867,635.12,
63000000000,582.508,776.576,842.28,646.96,
64000000000,571.032,737.606,794.08,624,
65000000000,552.06,792.824,836.06,617.08,
66000000000,535.984,828.54,862.2,616,
67000000000,571.012,797.536,870.878,624.984,
68000000000,552.024,802.436,869.92,635.54,
69000000000,557.914,812.824,860.157,656.998,
70000000000,565.922,843.2,860.836,673.057,
71000000000,557.08,816.88,811.24,680.922,
72000000000,575.99,834.004,854.5,682.94,
73000000000,581.948,839,857.017,717.964,
74000000000,574.98,836.525,839.548,676.904,
75000000000,579.055,806.38,849.908,697.027,
76000000000,572,805.516,845,675.968,
77000000000,565.06,799,852.478,669.968,
78000000000,545.04,776.92,791.958,672.976,
79000000000,562.982,769.936,766.328,672.12,
80000000000,534.993,772.024,845,642.035,
81000000000,547.04,761.162,848.946,629.008,
82000000000,534.068,761.955,818.448,635.032,
83000000000,505.91,741.136,843.536,658.05,
84000000000,538.956,776,887,656.003,
85000000000,508.44,743.048,819.928,676.544,
86000000000,520.07,742.96,883.88,699.984,
87000000000,536.542,766.14,852.054,692.952,
88000000000,581.976,808.924,897.392,752.04,
89000000000,538.08,787.092,844.916,697.987,
90000000000,538.04,803.108,823.592,719.992,
91000000000,544.912,815.54,821.136,718.94,
92000000000,512.936,750.476,819.516,716.96,
93000000000,628.056,825.932,906.448,786.472,
94000000000,622.018,844.966,945.051,792.46,
