Frame number,1000000000,
0.000000,454.997,
1.000000,471.004,
2.000000,474.972,
3.000000,480.501,
4.000000,461.512,
5.000000,464.008,
6.000000,446.96,
7.000000,438.5,
8.000000,427.004,
9.000000,429,
10.000000,424.042,
11.000000,424.042,
12.000000,415.99,
13.000000,432.988,
14.000000,422.008,
15.000000,432.984,
16.000000,431.004,
17.000000,432.984,
18.000000,452.044,
19.000000,444.984,
20.000000,442.994,
21.000000,439,
22.000000,437.995,
23.000000,433.01,
24.000000,437.962,
25.000000,429.986,
26.000000,434.018,
27.000000,425.042,
28.000000,422.992,
29.000000,427.996,
30.000000,422.987,
31.000000,422.004,
32.000000,432.014,
33.000000,438.02,
34.000000,440.016,
35.000000,446.524,
36.000000,435.006,
37.000000,435.52,
38.000000,442.988,
39.000000,439.016,
40.000000,430.008,
41.000000,421.497,
42.000000,432.516,
43.000000,425.492,
44.000000,421,
45.000000,421.994,
46.000000,417.004,
47.000000,431.992,
48.000000,429.016,
49.000000,436.062,
50.000000,438.997,
51.000000,439.024,
52.000000,437.976,
53.000000,433.996,
54.000000,423.984,
55.000000,443,
56.000000,433.98,
57.000000,432.013,
58.000000,424.975,
59.000000,420.01,
60.000000,417.98,
61.000000,426.98,
62.000000,430.992,
63.000000,426.028,
64.000000,430.983,
65.000000,437.988,
66.000000,430.968,
67.000000,443,
68.000000,432.968,
69.000000,429.976,
70.000000,432.011,
71.000000,429.992,
72.000000,421.997,
73.000000,422.003,
74.000000,430.019,
75.000000,431.992,
76.000000,420.999,
77.000000,431.993,
78.000000,425.06,
79.000000,427.03,
80.000000,430,
81.000000,435.995,
82.000000,440.026,
83.000000,445.968,
84.000000,433.99,
85.000000,434.04,
86.000000,440.988,
87.000000,432.016,
88.000000,433.005,
89.000000,425.012,
90.000000,436.984,
91.000000,427,
92.000000,431.993,
93.000000,427.021,
