Frame number,1000000000,1000000001,1000000002,1000000003,
0.000000,7311.02,4376.06,2337.44,3303.59,
1.000000,7127.19,3853.94,2030.08,3016.55,
2.000000,9143.06,4424.86,1820.88,3950.11,
3.000000,12097.1,7782.75,2779.9,4809.95,
4.000000,14364.1,11056.2,4112.02,6339.9,
5.000000,15522.4,10754.3,5067.63,5850.66,
6.000000,18765.6,8416.07,4913.65,4936.29,
7.000000,22187.6,6965.32,4733.75,4293.17,
8.000000,17600.3,5658.55,4415.17,3682.63,
9.000000,13869.8,4400.52,3919.52,3242.74,
10.000000,10428.7,3389.6,3260.53,2786.85,
11.000000,9098.86,2640.26,2857.31,2389.3,
12.000000,8775.39,2028.96,2414.25,1991.73,
13.000000,7236.14,1706.3,2055.24,1819.21,
14.000000,5565.13,1706.25,1837.1,1604.95,
15.000000,4208.08,1721.01,1664.83,1507,
16.000000,3494.16,1817.08,1452.8,1508.75,
17.000000,3638.57,2391.26,1425.19,1693.01,
18.000000,4502.5,3538.9,1639.06,2387,
19.000000,6528.02,5234.41,2140.14,3240.97,
20.000000,8562.63,6495.3,2433.05,3879.15,
21.000000,8447.18,5522.46,2507.76,3509.5,
22.000000,6325.02,4461.39,2183.62,2787.79,
23.000000,5052.54,3628.25,2383.82,2402.83,
24.000000,4044.48,2800.38,2100.75,2022.13,
25.000000,3134.97,2084.6,2126.79,1644.73,
26.000000,2435.88,1703.89,1874.02,1442.06,
27.000000,1951.76,1389.83,1806.4,1258.05,
28.000000,1512.98,1243.14,1550.89,1109.1,
29.000000,1343.95,1104.82,1377.94,1071.91,
30.000000,1291.9,1057.75,1345,973.06,
31.000000,1365.01,1176.07,1241.55,978.032,
32.000000,1616.17,1277.98,1186.58,1027.98,
33.000000,2278.81,1862.96,1170.99,1251.11,
34.000000,3558.53,2631.73,1256.97,1797.76,
35.000000,6046.83,3672.68,1511.77,2609.16,
36.000000,7035.1,3898.8,1676.13,2843.86,
37.000000,5629.9,3394.57,1776.73,2485.14,
38.000000,4341.04,2888.86,1608.35,1986.82,
39.000000,3583.26,2417.18,1607.83,1731.84,
40.000000,2852.22,2144.73,1503.02,1475.84,
41.000000,2160.08,1714.21,1501,1282.02,
42.000000,1779.72,1434.82,1390.99,1141.11,
43.000000,1467.11,1171.1,1318.98,1045.93,
44.000000,1266,1088.88,1249.08,944.48,
45.000000,1128.05,1021.83,1162.49,883.028,
46.000000,1055.26,1032.3,1083.38,852.064,
47.000000,1080.16,1058.98,1049.05,822.556,
48.000000,1396.84,1205.85,951.048,899.036,
49.000000,1850.32,1437.71,898.04,1065.99,
50.000000,3065.18,1922.93,953.036,1412.9,
51.000000,4478.43,2593.52,1062.93,1956.86,
52.000000,5097.43,2896.15,1148.1,2157.99,
53.000000,4479.03,2628.5,1147,1934.49,
54.000000,3539.09,2313.21,1067.37,1591.02,
55.000000,2831.95,1907.78,1120.42,1399,
56.000000,2314.78,1628.92,1145.2,1197.08,
57.000000,1748.08,1383.27,1145.71,1098.07,
58.000000,1505.8,1239,1115.93,988.492,
59.000000,1271.24,1089.12,1046.05,903.894,
60.000000,1091.66,1050.81,1041.53,883.496,
61.000000,1018.1,975.916,964.2,803.504,
62.000000,949.949,1005.11,881.976,779.024,
63.000000,1015.01,1036.3,881.008,769.976,
64.000000,1191.78,1230.33,840.576,821.504,
65.000000,1573.58,1536.89,867.6,987.99,
66.000000,2254.25,2060.12,877.06,1350.06,
67.000000,3542.11,2647.09,903.054,1846.17,
68.000000,4310.86,2453.52,953.056,1896.98,
69.000000,3883.82,2135.35,945.936,1719.17,
70.000000,3091.95,1884.87,883.128,1411.01,
71.000000,2611.18,1665,858.154,1252.05,
72.000000,2114.75,1424.37,953.022,1113.93,
73.000000,1739.17,1299.95,1052.9,1022.02,
74.000000,1460.24,1161.83,982.045,913.088,
75.000000,1278.13,1045,952.932,864.978,
76.000000,1142.16,1046.21,943.102,872.06,
77.000000,1084.02,967.077,936.896,811.052,
78.000000,994.9,966.196,904.016,787.958,
79.000000,1067.68,1067,895.5,792.029,
80.000000,1247.04,1349.1,860.48,906.904,
81.000000,1565.06,1679,842.482,1045.93,
82.000000,2199.4,2144.58,864.006,1366.09,
83.000000,3222.51,2438.34,928.956,1775.15,
84.000000,3755.53,2387.37,933.064,1859.12,
85.000000,3529.13,2094,883.072,1627.94,
86.000000,2769.32,1778,846.502,1429.44,
87.000000,2409.19,1527.8,777.96,1202.6,
88.000000,2045.67,1284,845.958,1056.98,
89.000000,1587.26,1254.95,873.77,979.6,
90.000000,1336.91,1135.13,953,917.62,
91.000000,1196.76,1111.19,900.02,875.968,
92.000000,1110.3,1032.04,883.88,825.444,
93.000000,1007.05,997.838,884.04,784.516,
94.000000,950.92,936.859,867.017,790.96,
95.000000,1019.96,1023.27,848.07,795.028,
