Time [ms],1000000000,1000000001,1000000002,
0,2742.75,2125.22,2688.65,
1000000000,2098.71,1326.07,1248.88,
2000000000,1648.94,1368.09,1378,
3000000000,1604.42,1460.14,1346.91,
4000000000,1499.35,1437.99,1279.09,
5000000000,1560.22,1371.82,1075.83,
6000000000,1456.14,1261.12,1038.04,
7000000000,1240.22,1267.2,911.12,
8000000000,1110.06,1137.82,799.92,
9000000000,1052.14,1001.99,802.916,
10000000000,951.804,945.885,704.04,
11000000000,923.756,824.912,702.936,
12000000000,813.976,802.908,672.01,
13000000000,813.096,748.05,693.992,
14000000000,771.936,717.974,637.818,
15000000000,726.95,697.04,704.99,
16000000000,740.12,660.026,701.234,
17000000000,726.952,658.066,799.911,
18000000000,766.915,733,949.188,
19000000000,838.938,806.92,1013.17,
20000000000,891.07,935.018,1161.85,
21000000000,1008.11,991.208,1168.91,
22000000000,1075.97,1018.05,1140.21,
23000000000,1082.09,973.11,1011.92,
24000000000,998.52,962.398,974.178,
25000000000,910.91,883.967,861.01,
26000000000,781.05,764.065,745.942,
27000000000,812.928,770.05,727.9,
28000000000,758.979,736.05,683.114,
29000000000,673.975,710.946,629.999,
30000000000,677.944,681.966,607,
31000000000,652.504,644.035,592.904,
32000000000,617.026,627.933,564.984,
33000000000,599.047,607.957,593.952,
34000000000,575.931,589.04,577.48,
35000000000,570.957,561.012,611.428,
36000000000,569.99,572.46,620.07,
37000000000,592.956,612.1,655.056,
38000000000,659.976,629.092,713.032,
39000000000,723,733.033,798.888,
40000000000,836.056,833.99,885.998,
41000000000,820.102,864.128,857.14,
42000000000,856.892,816.135,815.976,
43000000000,843.049,804.953,836.912,
44000000000,790.05,715.119,727.928,
45000000000,765.888,659.12,717.172,
46000000000,723.1,674.92,668.936,
47000000000,678.08,643.94,652.1,
48000000000,673.08,652.992,602.958,
49000000000,637.064,623.92,600.976,
50000000000,596.028,625.084,575.996,
51000000000,581.944,593.044,566.92,
52000000000,563.009,555.05,555.048,
53000000000,560.97,542.016,532.969,
54000000000,541.984,541.97,555.012,
55000000000,558.04,545.008,578.06,
56000000000,567.996,571.035,601.976,
57000000000,604.042,585.04,625.92,
58000000000,638,649.1,682.954,
59000000000,642.956,679.96,712.05,
60000000000,694.966,701.027,730.02,
61000000000,721.003,718.92,714.976,
62000000000,704.96,711.032,735.072,
63000000000,666.95,669,679.022,
64000000000,673,656.965,656.984,
65000000000,653.979,622.978,635.118,
66000000000,619.055,617.012,600.92,
67000000000,594,603.882,609.9,
68000000000,583.02,577.02,590.088,
69000000000,570.062,561.948,569.084,
70000000000,550.036,536.006,556.976,
71000000000,545.052,541.983,542.01,
72000000000,567.05,515.031,552.528,
73000000000,557.994,529.96,568.05,
74000000000,590.99,537.994,590.48,
75000000000,642.936,591.98,628.929,
76000000000,626.984,576.036,599.524,
77000000000,606.96,615.52,618.1,
78000000000,619.047,622.026,601.02,
79000000000,642.038,628.98,603.012,
80000000000,615.984,649.956,621.035,
81000000000,619.024,619.975,615.988,
82000000000,604.984,620.031,609.026,
83000000000,600.05,611.528,599.004,
84000000000,589.942,559.508,575.978,
85000000000,574.944,561.492,570.076,
86000000000,554.988,555.005,543.48,
87000000000,538,533.016,535.94,
88000000000,531.98,532.54,528.965,
89000000000,537.06,519.028,545.936,
90000000000,547.952,521.032,539.956,
91000000000,556.988,526.992,552.008,
92000000000,581.008,530.01,569.032,
