Time [ms],1000000000,1000000001,1000000002,1000000003,
0,8358,9695.42,8649.56,9399.02,
1000000000,6893.62,7542.38,8822.41,10011.5,
2000000000,7492,8993.95,8609.61,10212.2,
3000000000,8966.49,10845,9070.55,12460.9,
4000000000,12065.2,15242.6,12132.9,15696.8,
5000000000,15337.5,18009.5,16813.1,17983.5,
6000000000,13917.9,16935.4,19268.6,16497,
7000000000,12973.3,14795,18312,12425.6,
8000000000,10504.8,13132.9,15224.3,11201,
9000000000,8745.78,10620.9,12318.5,8675.06,
10000000000,6995.5,9704,9376.31,7022.59,
11000000000,5894.91,6564.91,7675.57,5994.43,
12000000000,4802.4,5216.82,5907.31,5225.33,
13000000000,4063.76,4503.46,5332.73,4592.05,
14000000000,3632.43,4056.16,4367.82,3910.94,
15000000000,3044.81,3588.02,4011,3680.44,
16000000000,2864.7,3247.52,3365.61,3498.56,
17000000000,2632.66,2987.54,3000.06,3348.98,
18000000000,2591.42,2983.1,2928.84,3396.88,
19000000000,2767.56,3290.04,2992.6,3436.43,
20000000000,3245.42,3897.45,3529.82,4163.15,
21000000000,4192.61,5221.44,4328.76,5704.48,
22000000000,5568.5,6703.96,6303.98,8344.78,
23000000000,6870.57,8419.28,8307,10206.8,
24000000000,7589.08,8459.24,10484.6,10987.8,
25000000000,7266.63,9185.92,12086.4,10616.7,
26000000000,6675.16,7665.24,11449.6,9516.04,
27000000000,5732.63,6528.22,9541,8264.58,
28000000000,4889.52,5423.85,7925.5,7125.04,
29000000000,4265.98,4594.36,6629,6054.29,
30000000000,3677.68,4009.73,5302.71,5026.06,
31000000000,3238.5,3455.11,4244.05,4656.69,
32000000000,2923.62,3054.2,3819.46,3995.24,
33000000000,2592.64,2746.89,3276.28,3536.55,
34000000000,2477.52,2596.27,3018.95,3898.5,
35000000000,2152,2486.91,2822.5,3622.91,
36000000000,2265.53,2520.08,2855.28,3440.9,
37000000000,2284.18,2682.62,2923.57,3374.48,
38000000000,2546.03,3024.5,3391.46,3883.53,
39000000000,2738.04,4003.78,3602.02,4324.27,
40000000000,3544.42,4808.01,3708.1,5286.45,
41000000000,4216.36,5642.42,4510.24,6813.43,
42000000000,4992.99,5763.49,5581.33,7932.22,
43000000000,5341.24,6049.22,6451.64,8283,
44000000000,4960.75,5589.11,7571.6,7899.19,
45000000000,4524.75,5221.09,6709.48,6921.72,
46000000000,3985.3,4509.57,7277,6068.34,
47000000000,3313.33,3742.94,7017.94,5270.79,
48000000000,2892.38,3091.08,5675.24,4779.56,
49000000000,2583.57,2771.95,4782,4061.84,
50000000000,2359.5,2534,3638.01,3285.07,
51000000000,2221.52,2248.28,3423,2933.71,
52000000000,1914.68,2195,3172.74,2770.48,
53000000000,1865.1,2130,3027.42,2464.37,
54000000000,1838.24,2349.92,3054,2856.8,
55000000000,1908.94,2715.38,3037.88,2683.58,
56000000000,1960.1,3165.16,2781.5,2810.01,
57000000000,2077.03,3666.83,2761.59,3205.92,
58000000000,2284.46,4086.72,3113.54,3537.04,
59000000000,2786.26,4690.99,3423.68,4814.57,
60000000000,3152.09,4472.38,4829.39,5656.02,
61000000000,3525.99,4633.63,4954.21,6483.9,
62000000000,3589.35,4341.48,7053.79,6779.79,
63000000000,3477.41,3777.55,7288.19,5993.46,
64000000000,3202.92,3434.08,7521.19,5518.01,
65000000000,2744.05,2780.4,7512.15,4688.7,
66000000000,2362.32,2514,6356.54,4005,
67000000000,2191.19,2195.56,5677.48,3618.37,
68000000000,2102.73,2037.7,4445.11,3148.81,
69000000000,1999.19,1991.42,4150.42,2805.63,
70000000000,1851.79,2053.77,3632.01,2740.28,
71000000000,1741.04,1986.89,3514.9,2615.91,
72000000000,1645.86,2261.82,3505.6,2638.06,
73000000000,1538.99,2180.68,3369.62,2410.07,
74000000000,1512.06,2361.24,3113,2357.47,
75000000000,1538.79,2654.89,2700.23,2416.15,
76000000000,1609.85,3053.77,2523.48,2895.92,
77000000000,1641.29,3291.85,2352.87,3498.46,
78000000000,1731.3,3688.54,2958.84,4341.93,
79000000000,1877.09,3982.71,3406.1,4916.98,
80000000000,2124.97,3654.98,4926.54,5317.45,
81000000000,2432.82,3393.58,5102.32,5130.82,
82000000000,2595.71,2877.08,4632.59,4921.77,
83000000000,2430.71,2573.22,5138.59,4399.76,
84000000000,2498.86,2241.96,5759.56,3660.18,
85000000000,2253.11,2092.3,5755.58,3305.65,
86000000000,2163.75,2117.33,5241.04,3158.76,
87000000000,2033.86,2193.12,4661.75,2720.46,
88000000000,1963.12,2291.47,4319.57,2683.82,
89000000000,1741.94,2363.87,3951.84,2496.48,
90000000000,1661.64,2338.79,3891.47,2353.96,
91000000000,1548.08,2207.01,3732.9,2312.26,
92000000000,1518.76,2159.77,3450.64,1976.1,
93000000000,1509.82,2517.7,3120.44,2209.78,
94000000000,1594.91,2719.62,2683.24,2387.92,
95000000000,1584.22,3200.74,2667.49,2753.24,
