Frame number,1000000000,
0.000000,416.005,
1.000000,396.969,
2.000000,407.006,
3.000000,400.024,
4.000000,416.985,
5.000000,414.983,
6.000000,409.976,
7.000000,416.022,
8.000000,408,
9.000000,401.995,
10.000000,405.026,
11.000000,403.968,
12.000000,402.987,
13.000000,408,
14.000000,412.027,
15.000000,400.991,
16.000000,410.973,
17.000000,404.01,
18.000000,406.004,
19.000000,409.973,
20.000000,408.036,
21.000000,401.98,
22.000000,415.031,
23.000000,413.986,
24.000000,410.976,
25.000000,401.025,
26.000000,412.016,
27.000000,406.035,
28.000000,401.98,
29.000000,407,
30.000000,407.015,
31.000000,396.04,
32.000000,416.974,
33.000000,410.04,
34.000000,409.019,
35.000000,412.034,
36.000000,416.02,
37.000000,410.028,
38.000000,400.012,
39.000000,409,
40.000000,399.992,
41.000000,394.991,
42.000000,406.018,
43.000000,403.05,
44.000000,397.979,
45.000000,415.004,
46.000000,403.016,
47.000000,410,
48.000000,403.996,
49.000000,401.024,
50.000000,406.052,
51.000000,417.04,
52.000000,413.991,
53.000000,411.992,
54.000000,399.01,
55.000000,412.98,
56.000000,403,
57.000000,412.99,
58.000000,399.984,
59.000000,412.996,
60.000000,412.024,
61.000000,407.012,
62.000000,403.488,
63.000000,407.025,
64.000000,407.512,
65.000000,405.5,
66.000000,403.504,
67.000000,402.044,
68.000000,401.5,
69.000000,401,
70.000000,397.01,
71.000000,403.488,
72.000000,391.008,
73.000000,405.054,
74.000000,400.987,
75.000000,401.96,
76.000000,399.03,
77.000000,410.964,
78.000000,410.976,
79.000000,399.038,
80.000000,401.024,
81.000000,399.968,
82.000000,397.032,
83.000000,401.018,
84.000000,406.024,
85.000000,406.992,
86.000000,409.984,
87.000000,398.988,
88.000000,404.998,
89.000000,396.024,
90.000000,407.035,
91.000000,410.012,
92.000000,403.987,
93.000000,409.027,
