Time [ms],1000000000,
0,453.504,
1000000000,426.978,
2000000000,421.52,
3000000000,423.988,
4000000000,430.004,
5000000000,428.483,
6000000000,426.475,
7000000000,437.052,
8000000000,435.99,
9000000000,435.996,
10000000000,424.5,
11000000000,422.008,
12000000000,431.002,
13000000000,426.512,
14000000000,423.004,
15000000000,422.51,
16000000000,430.5,
17000000000,417.016,
18000000000,413.492,
19000000000,411.508,
20000000000,418.998,
21000000000,425,
22000000000,429.96,
23000000000,420.504,
24000000000,428.52,
25000000000,423.014,
26000000000,427.046,
27000000000,425.04,
28000000000,429.024,
29000000000,422.502,
30000000000,423.496,
31000000000,427.03,
32000000000,415.022,
33000000000,416.016,
34000000000,416.976,
35000000000,412.488,
36000000000,412.5,
37000000000,413.025,
38000000000,405.5,
39000000000,420.988,
40000000000,412.018,
41000000000,413,
42000000000,416.488,
43000000000,415.484,
44000000000,420.019,
45000000000,423.025,
46000000000,417.004,
47000000000,420.007,
48000000000,420.008,
49000000000,422.505,
50000000000,421.493,
51000000000,418.512,
52000000000,414.504,
53000000000,417.005,
54000000000,413.488,
55000000000,418.024,
56000000000,414.98,
57000000000,409.488,
58000000000,410.99,
59000000000,409.484,
60000000000,414.992,
61000000000,404.01,
62000000000,409.964,
63000000000,410.976,
64000000000,412.504,
65000000000,424.508,
66000000000,412.016,
67000000000,413.992,
68000000000,411.516,
69000000000,409.5,
70000000000,413,
71000000000,413.015,
72000000000,409.968,
73000000000,416.484,
74000000000,405.52,
75000000000,420.028,
76000000000,406.024,
77000000000,417.004,
78000000000,413.5,
79000000000,415,
80000000000,413.976,
81000000000,422.505,
82000000000,408.502,
83000000000,413.49,
84000000000,415.02,
85000000000,414.503,
86000000000,416.52,
87000000000,413.496,
88000000000,408.008,
89000000000,410.511,
90000000000,414.506,
91000000000,410.481,
92000000000,418.512,
93000000000,408.992,
94000000000,416.506,
95000000000,416.016,
