
Intensity Median
 ==================== 
Time [s],1000000000,1000000001,1000000002,1000000003,
0.000000,10292.7,11753.5,22970.8,7235.98,
1.000000,22921.8,26018.1,13105.4,13950.5,
2.000000,24148.7,22283.1,8082.08,12940,
3.000000,14938.6,14354.4,6061.01,8087.52,
4.000000,11199,7324.84,6831.7,5380.22,
5.000000,5608.79,5331.21,5144.28,3997.2,
6.000000,3834.2,5701.97,3932.7,3141.24,
7.000000,6107.31,4603.51,3562.28,3643.69,
8.000000,5975.42,4214.22,6542.8,3827.22,
9.000000,4771.1,3275.46,4589.03,3099.5,
10.000000,3724.34,2814.81,3812.38,2574.34,
11.000000,3184.11,2509.97,3224.8,2371.4,
12.000000,2365.15,2217.24,2844.56,2281.65,
13.000000,1939.28,2842.29,3265.71,2737.01,
14.000000,2586.6,5368.58,6773.48,5720.8,
15.000000,5775.75,11826,13442.2,9793.63,
16.000000,9951.21,16273.7,21033,14125.5,
17.000000,13057.7,16537.2,24144.6,16069.1,
18.000000,12986.4,12923.6,20245.2,15131.3,
19.000000,11748.4,8559.9,13801.2,12041,
20.000000,9077.56,5628.79,8996.37,8957.21,
21.000000,6678.68,3820.79,5754.04,7209.6,
22.000000,5734.9,2988.69,4338.47,5927.91,
23.000000,4972.23,2622.37,3446.37,5128.22,
24.000000,4144.58,2293.42,2844.87,4104.56,
25.000000,3836.01,2121.48,2462.13,3230.35,
26.000000,3074.27,1991.35,2186.24,2658.59,
27.000000,2508.09,2028.07,2069.08,2401.74,
28.000000,2278.5,3223.73,2749.67,2862.54,
29.000000,2957.08,6312.66,4846,4977.86,
30.000000,4693.9,10306.5,9038,7985.71,
31.000000,6801.4,13143.4,14035.6,10614.3,
32.000000,8368.1,12407.3,15297.6,11528.9,
33.000000,8221.19,9317.91,13040.6,10409.7,
34.000000,7024.61,6206.82,9174.46,8552.04,
35.000000,5801.86,4227.56,6073.81,6715.53,
36.000000,5331.26,3453.82,4413.98,5619.48,
37.000000,5175.41,2853.54,3319.79,4757.21,
38.000000,4661.85,2509.6,2579.16,3937.46,
39.000000,3901.5,2271.48,2234.83,3105.05,
40.000000,3045.42,2103.56,1966.95,2500.03,
41.000000,2556.25,1983.93,1770.9,2215.94,
42.000000,2118.69,2272.11,1858.03,2078.17,
43.000000,2094.92,3549.36,2195.91,2750.58,
44.000000,2909.21,6066.81,4019.24,4211,
45.000000,4449.41,8604.16,6971.32,6399.59,
46.000000,6400.69,10630,10182.9,8227,
47.000000,7056.55,11083.7,11647.6,9383.03,
48.000000,6921.94,8336.34,9433.61,8203.07,
49.000000,5934.34,5889.86,7057.28,6431.26,
50.000000,5200.22,4553.93,4734.78,5328.02,
51.000000,4476.64,3887.76,3344.39,4583.3,
52.000000,4119.06,3434.69,2688.23,4055.54,
53.000000,3440.93,2966.5,2096.65,3203.4,
54.000000,2681.57,2497.32,1792.83,2499.01,
55.000000,2217.89,2274.11,1517.81,2196.06,
56.000000,1824.99,2141.41,1353.9,1933,
57.000000,1723.49,2344.44,1301.93,2041,
58.000000,2334.42,3333.7,1683.74,3009.04,
59.000000,3615.8,5208.12,3145.09,4933.2,
60.000000,5914.87,7537.68,5923.38,7516.86,
61.000000,7762.83,9162.72,8902.7,9862.44,
62.000000,8427.73,9186.99,9352.66,9526.69,
63.000000,7161.14,7558.2,8001.99,7676.2,
64.000000,5731.99,5623.89,5284.74,5982.56,
65.000000,4535.2,4658.96,3497.57,4905.02,
66.000000,3829.78,3806.45,2608.4,4072.62,
67.000000,3216.91,3354.74,2045,3336.08,
68.000000,2600.75,2843.96,1766.65,2697.91,
69.000000,2106.1,2675.92,1511.02,2288.1,
70.000000,1761.84,2357.84,1349.1,2012.88,
71.000000,1623.18,2221.83,1167.94,1987.96,
72.000000,1837.86,2305.1,1134.92,2558.08,
73.000000,2750.22,2912.07,1376.25,3857.8,
74.000000,4381.87,4389.06,2412.53,5764.46,
75.000000,6259.94,6554.87,5037.96,8434.32,
76.000000,7334.75,8444.56,7400.2,9031.07,
77.000000,6870.86,8668.65,8570.38,8148.96,
78.000000,5918.68,7378.89,7302.18,6590.25,
79.000000,4847.64,5713.74,4855.48,5225.22,
80.000000,3878.87,4510.17,3279.6,4374.24,
81.000000,3174.1,3865.64,2324.61,3587.74,
82.000000,2544.36,3278.53,1971.08,2978.15,
83.000000,2110,2728.03,1696.17,2459.05,
84.000000,1825.18,2304.78,1539.74,2152.87,
85.000000,1639.5,2062.33,1345.27,2014.2,
86.000000,1715.17,1904.1,1176.47,2126.96,
87.000000,2256.98,2123.25,1084.49,2905.12,
88.000000,3294.77,2419.1,1143.93,4533.05,
89.000000,5078.8,4394.85,1693.4,6786.48,
90.000000,6913.75,6767.27,3150.18,9205.01,
91.000000,7679.64,8014.89,5428.34,9748.58,
92.000000,7262.21,7991.48,7488.67,8640.79,
93.000000,6029.3,6875.84,6999.04,6936.03,
94.000000,4836.68,5421.72,5352.92,5514.03,
95.000000,3845.4,4276.53,3791.64,4444.81,
