Time [ms],1000000000,1000000001,1000000002,1000000003,
0,1454.35,1444.33,1631.64,1701.35,
1000000000,1773.04,1075.62,1555.24,1401.99,
2000000000,2174.67,2019.42,1235.04,2123.46,
3000000000,1708.76,2081.5,1705.94,2762.76,
4000000000,2386.18,2475.85,1869.25,1895.83,
5000000000,2283.19,1698.5,1425.8,2183.94,
6000000000,2759.1,1675.2,1485.21,2148.91,
7000000000,2432.76,1504.02,1961.88,1497.43,
8000000000,2433.02,1568.61,2072.55,1449,
9000000000,1884.88,1707.91,1409.08,1432.37,
10000000000,1769.84,1616.97,1332.44,1579.1,
11000000000,1727.15,1687.08,1292.04,1517.14,
12000000000,1699,1718.96,1189.82,1512.76,
13000000000,1828.93,1630.99,1272.62,1547.73,
14000000000,1581.26,1289.44,1197.48,1440.79,
15000000000,1534,1217.62,1163.53,1473.46,
16000000000,1436.32,1212.07,1194.18,1333.49,
17000000000,1237.96,1181.89,1138.76,1313.15,
18000000000,1296.93,918.892,1157.62,1341.09,
19000000000,1166.95,903.288,1181.4,1337.68,
20000000000,1194.87,1018.71,1248.15,1334.4,
21000000000,1179.1,994.474,1212.84,1399.84,
22000000000,1204.05,992.76,1208.21,1404.53,
23000000000,1183.78,983.216,1143.44,1689.6,
24000000000,1101.36,962.874,1074.16,1673.4,
25000000000,1108.13,946.016,1103.66,1636.69,
26000000000,1087.54,895.22,1071.32,1547.29,
27000000000,1028.94,971.389,1056.55,1470.92,
28000000000,1002.22,992.335,1086.98,1452.99,
29000000000,992.902,954.936,1054.27,1218.33,
30000000000,928.135,1059,1112.48,1265.78,
31000000000,911.932,1118.06,1041.39,1243.3,
32000000000,923.168,1030.9,1095.62,1251.98,
33000000000,973.934,999.967,1084.34,1303.28,
34000000000,957.7,1065.85,1068.43,1244.33,
35000000000,1062.01,989.091,1016.62,1204.28,
36000000000,1077.18,782.44,1039.4,1152.26,
37000000000,1134.24,783.027,1063.93,1198.5,
38000000000,983.088,1012.05,1060.6,1123.46,
39000000000,1047.31,987.067,994.837,1127.01,
40000000000,1043.98,959.813,1025.28,1183.65,
41000000000,959.048,962.251,973.925,1235.13,
42000000000,938.822,941.182,971.875,1199.47,
43000000000,973.122,977.62,986.541,1136.57,
44000000000,879.032,956.738,960.13,1260.56,
45000000000,918.12,944.116,969.116,1115.76,
46000000000,964.268,958.016,1026.22,914.608,
47000000000,964.85,982.132,984.246,1073.13,
48000000000,971.116,973,1011.82,1065.83,
49000000000,950.952,781.064,1032.98,977.868,
50000000000,928.036,738.04,1000.03,905.72,
51000000000,956.916,729.547,961.953,893.112,
52000000000,856.096,743.542,974.64,970.23,
53000000000,908.32,754.137,955.64,1074.06,
54000000000,851.972,777.977,934.96,1064.35,
55000000000,824.91,761.914,935.272,928.08,
56000000000,857.948,735.88,920.224,875.872,
57000000000,843.896,741.15,867.032,916.312,
58000000000,801.06,714.961,906.328,840.923,
59000000000,771,719.091,930.888,857.162,
60000000000,801.08,685.065,895.536,873.295,
61000000000,745.108,731.059,828.144,835.25,
62000000000,804.104,695.6,916.544,903.875,
63000000000,725.974,723.048,883.85,945.856,
64000000000,637.936,719.105,881.008,866.946,
65000000000,687.976,703.098,896.472,869.736,
66000000000,695.872,715.488,873.922,879.687,
67000000000,705.952,744.52,734.068,853.692,
68000000000,605.488,707.076,743.9,784.216,
69000000000,655.512,712.52,756.091,687.192,
70000000000,636.44,683.456,812.127,730.143,
71000000000,612.045,702.919,813.007,658.168,
72000000000,639.447,691.063,766.25,732.043,
73000000000,669.868,712.975,831.92,690.106,
74000000000,634.52,694.058,802.076,724.936,
75000000000,631.472,700.122,816.015,685.163,
76000000000,668.464,769.019,665.964,706.11,
77000000000,607.032,749.904,677.087,766.136,
78000000000,630.5,794.86,711.864,714.896,
79000000000,665.38,726.044,657.284,736.84,
80000000000,590.968,713.903,668.86,657.116,
81000000000,579.98,724.067,731.024,619.256,
82000000000,631.928,637.985,708.068,659.998,
83000000000,613.98,686.065,687.86,714.924,
84000000000,600.04,655.067,605.2,642.837,
85000000000,613.839,608.02,558.72,619.968,
86000000000,603.112,646.77,605.012,591.06,
87000000000,605.973,625.086,709.84,600.892,
88000000000,617.092,622.116,668.84,599.54,
89000000000,615.06,627.138,637.96,614.233,
90000000000,594.88,639.826,671.906,688.878,
91000000000,671.04,633.928,614,615.104,
92000000000,635.84,636.5,617.04,617.96,
93000000000,613.034,666.08,682.024,638.106,
94000000000,647,631.822,661.792,654.928,
95000000000,619.227,671.864,650.9,607.942,
