Time [ms],1000000000,1000000001,1000000002,1000000003,
0,12798.6,12880.8,22783,15940.5,
1000000000,4909.58,7444.65,6757.27,8383.8,
2000000000,2421.22,4260.87,2974.38,3613.88,
3000000000,1601.08,2689,1980.56,2126.15,
4000000000,1395.82,2099.42,1713,1754.01,
5000000000,1297,1638.9,1579.4,1613.3,
6000000000,1243.87,1406.83,1602.02,1440.76,
7000000000,1197.38,1308.14,1449.14,1261.86,
8000000000,1151.05,1192.04,1278.96,1157.81,
9000000000,1041.5,1067.07,1178,1067.12,
10000000000,1147.1,1016.98,1073.55,998.02,
11000000000,932.9,934.952,963.488,904.463,
12000000000,880.944,888.78,906.488,905.98,
13000000000,855.37,871.04,858.12,874.922,
14000000000,773.022,911.17,793.108,847.925,
15000000000,732.924,878.92,746.06,798.94,
16000000000,727.1,833.126,772.1,815.525,
17000000000,734.016,778.905,822.896,807.59,
18000000000,742.98,841.057,903.32,836.071,
19000000000,764.032,843.048,1019.32,906.117,
20000000000,794.976,890.082,1065,990.948,
21000000000,814.99,894.004,1124.94,1058.01,
22000000000,818.084,918.64,1124.49,1089,
23000000000,775.036,959.592,1068.17,1109.17,
24000000000,802.078,1012.15,1080.5,1047.76,
25000000000,803.016,983.11,1063.75,1055,
26000000000,800.912,936.922,1032.77,1036,
27000000000,795.1,888.089,964.048,1012.92,
28000000000,765.1,893.898,933.02,937.015,
29000000000,760.1,889.91,896.061,912.08,
30000000000,759.074,855.488,845.886,864.04,
31000000000,731,859.442,844.944,866.848,
32000000000,706.459,821.97,814.136,853.13,
33000000000,688.042,793.94,797,794.032,
34000000000,682.432,774.08,762.085,804.9,
35000000000,677.454,777.118,761.875,790.52,
36000000000,660.576,794.06,726.91,776.533,
37000000000,662.93,815.836,749.126,772.04,
38000000000,699.56,818.048,770.861,798.548,
39000000000,736.972,860.896,825.9,787.982,
40000000000,805.053,865.064,831.92,823.522,
41000000000,767.14,902.062,885.932,837.554,
42000000000,735.068,891.87,897.024,843,
43000000000,820,927.07,895.044,872.944,
44000000000,752.92,878.845,880.88,860.94,
45000000000,702.872,885.17,903.062,860.6,
46000000000,709.06,835.062,903.035,841.976,
47000000000,666.472,820.1,888.84,864.022,
48000000000,659.48,791.944,844.435,811.534,
49000000000,657.08,792.008,816.887,833.983,
50000000000,661.96,780.076,790.028,808.406,
51000000000,645,730.04,752.86,795.078,
52000000000,621.016,737.986,775.568,778.112,
53000000000,634.059,744.988,757.511,772.904,
54000000000,619.028,730.096,764.984,742.473,
55000000000,617.936,739.128,750.044,742.54,
56000000000,632.016,755.064,744.55,751.982,
57000000000,627.904,727.082,756.44,765.989,
58000000000,614.072,728.171,725.942,755.016,
59000000000,644.052,770.048,764.966,753.984,
60000000000,629.094,770.956,732.139,745.82,
61000000000,645.092,739.116,720.908,750.032,
62000000000,644.08,740.896,720.864,722.04,
63000000000,624.532,681.975,716.878,715.8,
64000000000,629,704.936,717.971,716.912,
65000000000,633.556,668.876,696.2,688.52,
66000000000,612.492,677.934,703.06,669.488,
67000000000,607.015,672.025,699.091,670.06,
68000000000,609.086,660.98,690.049,691.008,
69000000000,610.972,667.084,725.81,672.124,
70000000000,597.028,659.924,712.92,673.93,
71000000000,596.084,658.112,691.104,667.052,
72000000000,587.992,686.952,704,645.936,
73000000000,586.976,669.048,721.962,649.426,
74000000000,574.99,664.064,703.47,667.056,
75000000000,602.024,675,691.48,672.002,
76000000000,613.088,687.958,698.464,667.08,
77000000000,591.96,697.488,716.008,686.032,
78000000000,587.936,677.004,711.068,692.562,
79000000000,602.952,669.08,715.068,669.032,
80000000000,590.045,669.976,690.03,709.44,
81000000000,595.041,694.013,680.02,704.076,
82000000000,579.052,666.982,653.952,672.526,
83000000000,576.14,673.976,643.988,701.054,
84000000000,551.492,669.03,653.128,655.03,
85000000000,545.97,647.496,632.933,655.959,
86000000000,534.057,635.476,628.996,646.056,
87000000000,527.962,633.6,645.024,643.966,
88000000000,536,648.501,656.082,622.056,
89000000000,536.016,634.492,633.868,632.978,
90000000000,554.549,638.045,612.945,631.052,
91000000000,536.992,644.036,661.136,626.97,
92000000000,529.495,650.522,663.934,655.047,
93000000000,548.006,651.572,672.946,612.126,
94000000000,540.485,658.556,632.099,642.064,
95000000000,547.52,659.018,659.56,621.96,
