Time [ms],1000000000,1000000001,1000000002,1000000003,
0,822.06,1059.32,1531.59,1087.28,
1000000000,713.612,835.048,1186.23,850.94,
2000000000,658.096,806.109,1039,834,
3000000000,796.844,907.112,1099.16,870.08,
4000000000,985.008,1053.73,1393.06,1073.13,
5000000000,1066.57,1159.94,1727.88,1253.33,
6000000000,1238.11,1266.21,1878.74,1382.74,
7000000000,1245.06,1300.05,1972.71,1467.11,
8000000000,1283.36,1221.34,1799.27,1212.25,
9000000000,1158.76,1201.88,1892.29,1235.4,
10000000000,935.944,1104.99,1944.58,1084.37,
11000000000,879.7,1066.88,1717.5,1167.29,
12000000000,807.048,995.113,1305.77,1082.85,
13000000000,738.184,977.331,1048.34,994,
14000000000,757,860.997,871.728,919.131,
15000000000,732.256,791.751,793.96,891.916,
16000000000,651.79,830.872,785.112,829.288,
17000000000,645.925,720.11,751.957,842.01,
18000000000,630.6,769.942,801,802.887,
19000000000,640.996,705.973,707.09,775.912,
20000000000,669.846,738.84,699.462,818.108,
21000000000,701.005,722.922,651.844,789.08,
22000000000,747.304,724.99,718.068,813.776,
23000000000,792.076,696.958,645.04,820.004,
24000000000,795.28,717.908,722.877,901.744,
25000000000,757.104,755.886,628.06,916.076,
26000000000,768.1,703.964,667.084,807.07,
27000000000,779.8,702.132,703.212,892.172,
28000000000,685.704,677.977,687.96,884.025,
29000000000,662.012,670.07,665,872.856,
30000000000,658.136,695.031,717.114,821.698,
31000000000,648.04,704.1,628.02,850.26,
32000000000,638.848,636.986,617.84,761.072,
33000000000,673.04,627.841,649,727.14,
34000000000,571.966,615.204,686.165,784.191,
35000000000,566.14,613.989,618,783.052,
36000000000,610.88,657.038,622.114,782.018,
37000000000,589.88,658.044,567.942,720.864,
38000000000,577.936,635.024,593.064,732.043,
39000000000,563.864,643.24,611.119,713.24,
40000000000,540.068,654.096,627.792,696.956,
41000000000,546.144,637.919,570.042,674,
42000000000,585.182,646.138,599.72,737.713,
43000000000,565.942,624.056,594.92,749.808,
44000000000,580.16,642.106,582.184,730.838,
45000000000,577.968,647.052,601.924,734.035,
46000000000,561.856,652.83,613.987,725.027,
47000000000,614.992,639.154,631.078,682.2,
48000000000,571.152,631.183,628.002,711.184,
49000000000,559.768,588.864,625.52,670.98,
50000000000,551.816,604.091,580.047,682.187,
51000000000,557.876,616.12,588.16,717.979,
52000000000,520.928,612.1,581.104,664.85,
53000000000,550.038,605.012,563.382,671.035,
54000000000,546.083,587.044,539.544,636.831,
55000000000,577.824,592.85,572.5,627.016,
56000000000,549.932,623.032,554.012,644.984,
57000000000,513.556,591.025,556.507,662.031,
58000000000,559.48,577.88,541.6,665.508,
59000000000,551.942,589.893,560.568,635,
60000000000,535.01,588.911,550.544,635.408,
61000000000,543.94,591.036,551.528,635.062,
62000000000,540.96,605.892,557.964,643.411,
63000000000,509.936,570.87,542.05,608.982,
64000000000,534.528,591.026,544.144,640.5,
65000000000,537.584,586.536,555.6,644.032,
66000000000,512.99,577.99,540.086,645.976,
67000000000,518.556,568.971,532.065,624.525,
68000000000,525.008,569.531,538,614.53,
69000000000,517.94,547.018,544.04,597.992,
70000000000,508.512,556.959,514.028,588.992,
71000000000,504.88,556.531,537.016,592.008,
72000000000,525.508,542.528,547.06,593.01,
73000000000,500.556,542.57,531.512,576.48,
74000000000,515.48,545.552,528.992,544,
75000000000,512.032,532.512,539.976,572.1,
76000000000,502.42,559.914,512.964,552.084,
77000000000,501.936,524.06,534.92,592.055,
78000000000,523.014,530.969,533.012,535.022,
79000000000,495.906,522.453,509.96,553.904,
80000000000,517.948,522.054,534.512,560.941,
81000000000,523.904,526.52,520.568,580.06,
82000000000,510.92,542.54,528.542,579.042,
83000000000,493.998,541.496,534.96,570.988,
84000000000,525.954,530.97,525.088,564.992,
85000000000,530.84,535.496,545.96,557.892,
86000000000,498,540.998,523.056,554.983,
87000000000,501.065,535.492,529.534,557.041,
88000000000,507.941,533.499,530.51,545.1,
89000000000,521.044,539.4,513.016,562.032,
90000000000,511.07,505.477,530.46,555.894,
91000000000,539.048,551.024,518.48,537.025,
92000000000,501.896,520.98,509.501,541.027,
93000000000,489.956,527.552,506.448,517.95,
94000000000,499.116,489.987,521.56,522.051,
95000000000,515.104,534.044,497.04,515,
