Frame number,1000000000,1000000001,1000000002,1000000003,1000000004,1000000005,
0.000000,1036.84,552.84,706.496,707.287,669.318,776.828,
1.000000,555.696,606.845,541.112,565.143,1157.91,443.763,
2.000000,560.568,531.617,703.421,548.664,1010.6,589.575,
3.000000,755.635,968.777,1221.74,683.74,1213.68,614.214,
4.000000,701.796,2173.74,1540.97,541.917,865.411,767.58,
5.000000,924.058,1646.91,1495.3,937.204,1121.98,814.672,
6.000000,910,831.98,1279.15,818.312,477.639,852.118,
7.000000,579.508,503.749,529.552,857,543.598,741.864,
8.000000,606.306,657.724,474.031,441.565,465.283,435.702,
9.000000,613.928,517.278,666.72,471.451,479.159,477.688,
10.000000,496.064,610.96,446.72,466.404,628.97,461.144,
11.000000,577.184,469.768,593.226,548.192,556.173,515.04,
12.000000,554.14,551.672,486.805,518.064,440.047,432.55,
13.000000,512.648,491.886,510.134,495.967,451.203,453.48,
14.000000,548.136,483.342,526.01,511.3,486.8,516.182,
15.000000,584.182,509.775,477.937,537.115,536.8,474.991,
16.000000,515.815,537.728,570.982,750.64,537.437,634.592,
17.000000,734.875,668.38,883.128,926.228,644.16,548.387,
18.000000,936.838,1255.82,946.88,921.818,736.747,678.424,
19.000000,1201.49,1231.18,1176.02,910.359,641.826,664.921,
20.000000,1131.69,507.508,1061.37,782.854,685.91,572.928,
21.000000,746.508,610.523,442.155,918.102,676.308,537.28,
22.000000,800.96,688.392,507.685,808.84,454.832,552.352,
23.000000,713.49,757.5,452.606,747.279,494.299,477.28,
24.000000,582.996,627.91,523.275,674.417,513.752,502.93,
25.000000,598.8,647.06,524.174,548.916,525,530.842,
26.000000,554.544,567.178,522.904,503.744,500.094,514,
27.000000,533.108,493.45,536.616,498.34,473.416,503.028,
28.000000,512.063,474.998,516.2,524.82,454.855,471.3,
29.000000,468.965,457.842,544.086,502.04,481.482,512.149,
30.000000,512.988,506.076,461.823,528.978,498.49,535.776,
31.000000,502.784,596.018,419.428,573.824,553,549.246,
32.000000,502.742,659.92,448.114,579.862,566.464,685.7,
33.000000,553.82,739.288,534.411,800.65,543.828,732.21,
34.000000,591.54,538.744,661.301,866.792,619.808,760.148,
35.000000,611.727,763.296,880.816,930.05,574.498,517.945,
36.000000,855.95,556.734,476.482,674.894,433.44,539.08,
37.000000,880.364,639.419,575.672,594.625,472.752,508.592,
38.000000,628.4,533.288,463.028,627.237,472.28,484.464,
39.000000,602.184,607.4,491.44,567.25,492.341,506.763,
40.000000,610.454,625.02,493.805,541.005,504.001,497.707,
41.000000,631.032,580.992,536.149,449.456,507.311,487.823,
42.000000,550,486.54,517.81,504.906,512.926,493.085,
43.000000,514.24,491.19,551.08,480.844,492.85,454.009,
44.000000,486.96,551.95,513.537,513.86,447,497.8,
45.000000,521.968,525.93,484.366,488.992,509.88,527.135,
46.000000,510.506,492.166,525.21,536.192,515.629,523.836,
47.000000,486.162,501.991,528.544,570.032,516.81,544.667,
48.000000,494.952,559.81,541.075,601.032,473.144,596.944,
49.000000,516.504,566.7,649.74,623.376,492.156,685.318,
50.000000,545.512,666.07,760.104,652.304,486.63,650.453,
51.000000,596.608,764.166,829.642,601.724,524.013,656.967,
52.000000,594.924,768.254,787,589.512,511.483,555.468,
53.000000,656.012,581.597,890.572,516.253,495.865,490.928,
54.000000,664.916,566.212,685.16,501.897,493.834,506.799,
55.000000,679.414,535.94,626.565,523.128,477.816,503.14,
56.000000,582.764,515.493,623.525,528.988,457.949,518.91,
57.000000,558.008,529.104,553.94,494.115,451.047,520.808,
58.000000,500.904,509.46,530.134,527.452,442.065,547.06,
59.000000,531.849,513.851,496.105,475.282,478.002,553.84,
60.000000,559.036,512.388,517.718,484.895,477.982,550.923,
61.000000,534.9,561.478,523.794,514.932,498.445,515.59,
62.000000,554.128,501.776,558.7,563.966,508.1,494.723,
63.000000,575.924,570.262,652.082,611.923,584.528,554.332,
64.000000,579.828,608.018,665.824,718.591,603.861,518.878,
65.000000,568.768,647.5,765.51,784.372,593.707,657.11,
66.000000,656.452,599.61,808.89,797.03,668.534,781.638,
67.000000,655.096,683.77,797.974,715.589,649.259,634.977,
68.000000,598.656,744.69,690.936,653.174,587.267,622.611,
69.000000,655.512,673.168,596.22,649.75,588.704,562.76,
70.000000,585.908,653.846,584.104,565.52,490.688,539.031,
71.000000,573.48,580.902,556.08,550.941,513.069,528.971,
72.000000,577.048,564.904,548.904,489.042,529.953,522.99,
73.000000,535.08,479.151,510.418,464.904,526.003,494.9,
74.000000,598.8,496.476,537.62,485.083,534.798,462.27,
75.000000,590.194,499.432,555.463,464.91,553.628,422.111,
76.000000,602.085,462.464,541.956,527,596.05,447.199,
77.000000,528.052,479.188,586.07,571.905,634.017,436.948,
78.000000,593.008,502.925,619.3,594.061,659.667,447.74,
79.000000,670.716,518.475,642.04,633.082,731.608,501.5,
80.000000,640.946,577.414,725.272,627.344,750.15,499.363,
81.000000,630.472,616.106,794.735,600.775,771,534.828,
82.000000,648.872,643.784,635,631.615,669.024,568.058,
83.000000,634.088,663.24,604.302,551.1,648.692,576.908,
84.000000,733.02,657.492,582.83,581.996,660.463,490.448,
85.000000,678.444,586.149,567.808,603.14,544.131,467.808,
86.000000,581.392,600.963,539.158,511,543.254,476.2,
87.000000,591.168,560.896,511.2,527.788,529.232,473.82,
88.000000,539.304,542.859,512.188,502.164,507.125,489.552,
89.000000,549.064,543.939,492,488.822,510.975,516.104,
90.000000,539.832,517.124,476.87,501.072,507.948,482.55,
91.000000,567.536,511.84,510.922,493.84,548.212,498.87,
92.000000,561.52,518.076,493.936,567.994,576.226,579.56,
93.000000,563.48,524.901,490.736,587.352,546.67,503.808,
94.000000,589.262,590.122,543.856,589,591.536,518.86,
