Time [ms],1000000000,1000000001,
0,968.808,731.992,
1000000000,958.54,831.094,
2000000000,909.776,1113.8,
3000000000,1495.79,1674.66,
4000000000,1945.13,2297.9,
5000000000,2280,2592.31,
6000000000,2548.58,2618.35,
7000000000,2453.55,2326.11,
8000000000,2399.32,2209.41,
9000000000,2090.25,1946.04,
10000000000,1848.07,1805.38,
11000000000,1736.92,1627.99,
12000000000,1559.09,1486.1,
13000000000,1310.17,1503.07,
14000000000,1289.83,1374.95,
15000000000,1212.08,1326.97,
16000000000,1106.21,1252.1,
17000000000,1011.93,1242.55,
18000000000,1013.42,1348,
19000000000,1055.8,1519.88,
20000000000,1077.87,1710.02,
21000000000,1120.06,1737.53,
22000000000,1119.89,1651.83,
23000000000,1159.82,1687.62,
24000000000,1180.77,1671.78,
25000000000,1186.69,1748.53,
26000000000,1142.03,1613.97,
27000000000,1076.12,1582.63,
28000000000,1014.1,1439.95,
29000000000,953.936,1334.78,
30000000000,840.996,1262.36,
31000000000,832.944,1203.43,
32000000000,755.064,1093.57,
33000000000,790.512,1076.96,
34000000000,748.072,1110.11,
35000000000,800.9,1179.91,
36000000000,813.98,1217.04,
37000000000,818.014,1233.1,
38000000000,818.942,1201.43,
39000000000,802.962,1221.96,
40000000000,850.032,1304.51,
41000000000,858.944,1280.06,
42000000000,807.096,1227.06,
43000000000,820.033,1138.02,
44000000000,739.968,1078.4,
45000000000,719,1018.98,
46000000000,712.96,967.62,
47000000000,667.876,892.57,
48000000000,628.524,889.02,
49000000000,648.05,896.544,
50000000000,637.13,919.98,
51000000000,642.08,1008.98,
52000000000,645.05,967.066,
53000000000,674.984,1005.07,
54000000000,660.026,993.012,
55000000000,669.037,1010.91,
56000000000,681,1022.91,
57000000000,686.928,1004.04,
58000000000,669.04,933.957,
59000000000,651.033,941.09,
60000000000,620.008,873.01,
61000000000,623.128,841.077,
62000000000,605.004,786.912,
63000000000,608.932,757.03,
64000000000,575.947,741.984,
65000000000,546.96,785.084,
66000000000,553.968,857.116,
67000000000,553.02,880,
68000000000,560.52,872.928,
69000000000,562.05,908.064,
70000000000,554.976,906.058,
71000000000,572.066,884.888,
72000000000,599.96,855.5,
73000000000,588.05,847.2,
74000000000,581.988,851.912,
75000000000,584,801.035,
76000000000,568.99,760,
77000000000,556.995,697.078,
78000000000,541.024,722.016,
79000000000,531,694.04,
80000000000,528.008,691.052,
81000000000,538.058,729.04,
82000000000,531.044,764.952,
83000000000,525.968,777.051,
84000000000,536.96,801.988,
85000000000,520,780.2,
86000000000,540.952,806.952,
87000000000,545,798.048,
88000000000,540.1,804.096,
89000000000,540.954,774.904,
90000000000,533.952,750.52,
91000000000,525.528,705.406,
92000000000,532,699.084,
93000000000,540.48,683.4,
94000000000,530.008,658.032,
95000000000,520.507,658.052,
