Frame number,1000000000,1000000001,1000000002,1000000003,1000000004,1000000005,1000000006,
0.000000,620.011,636.578,577.872,623.928,1384.09,572.95,620.58,
1.000000,682.394,668.934,681.086,647.92,1048.43,639.836,607.104,
2.000000,795.94,767.6,784.726,709.14,917.713,630.76,670.393,
3.000000,1042.08,889.32,914.728,771.984,1009.46,948.775,748.134,
4.000000,996.848,921.4,1010.65,804.596,949.996,1027.85,754.852,
5.000000,856.16,882.782,847.615,743.026,783.304,937.123,768,
6.000000,761.24,768.01,753.318,716.263,768.038,803.98,638.6,
7.000000,623.555,695.896,649.189,608.026,647,689.997,597.903,
8.000000,578.408,586.105,601.673,603.885,655.394,599.103,579.97,
9.000000,526.092,573.87,572.608,539.079,634.52,540.032,559.016,
10.000000,518.464,508.021,515.83,532.137,578.576,533.015,531.992,
11.000000,508.055,543.243,509.492,525.165,573.943,496.007,504.07,
12.000000,524.948,536.064,513.56,518.145,609.206,498.011,523.95,
13.000000,575.798,560.296,528.04,516.846,649.135,496.088,550.104,
14.000000,640,652.11,546.515,564.166,741.468,499.527,535.024,
15.000000,729.972,744.044,646.056,622.11,831.504,542.549,654.825,
16.000000,851.619,973.56,724.43,742.172,976.116,568.935,755.981,
17.000000,994.741,1092.96,897.692,868.676,1062.61,679.59,883.235,
18.000000,1078.49,1185.06,973.155,1049.17,1005.45,843,1027.32,
19.000000,1022.6,1186.85,1097.3,1064.54,964.006,952.914,1028.14,
20.000000,978.069,1131.4,953.78,973.411,862.435,970.607,1006.85,
21.000000,793.264,981,955.779,927.299,825.976,953.848,886.675,
22.000000,761.065,894.828,853.086,803.066,737.083,862.594,725.729,
23.000000,626.015,715.924,764.038,747.625,684.28,777.352,738.12,
24.000000,539.144,567.049,613.666,676.707,591.588,679.615,610.281,
25.000000,537.102,596.928,569.556,625.149,602.884,598.1,574.15,
26.000000,499.945,536.931,549.54,568.9,589.096,551.506,537.13,
27.000000,534.024,554.137,516.52,524.09,600.108,542.6,545.847,
28.000000,489.016,535.125,497.524,509.963,563.996,515.04,506.055,
29.000000,524.988,527.106,496.486,512.064,549.897,520.036,498.985,
30.000000,536.94,504.915,499.92,516.109,576.858,483.472,499.081,
31.000000,580.928,548.966,508.52,539.102,661.091,479.07,496.104,
32.000000,587.898,610.936,531.894,543.178,781.161,496.932,582.222,
33.000000,730.168,755.898,627.432,603.969,887.003,485.104,698.867,
34.000000,876.336,1026.04,712.288,680.636,929.85,517.796,808.196,
35.000000,953.622,1260.41,802.275,767.467,886.083,652.185,838.605,
36.000000,916.792,1339.45,938.108,878.277,825.311,729.947,894.895,
37.000000,848.288,1287.87,940.73,961.44,730.964,774.065,867.352,
38.000000,857.65,1111.9,919.376,914.263,675.892,891.98,890.673,
39.000000,723.844,1039.78,853.873,835.476,607.872,824.039,783.397,
40.000000,669.024,829.29,726.6,755.79,573.105,784.643,711.324,
41.000000,588.172,734.844,674.522,694.634,562.976,684.344,666.287,
42.000000,564.956,652.133,595.496,624.64,528.065,670.274,591.121,
43.000000,518.1,613.113,565.348,556.088,530.115,596.208,588.929,
44.000000,503.124,547.238,516.568,533.821,505.084,543.138,538.075,
45.000000,500.977,532.904,498.32,537.866,495,522.904,507.975,
46.000000,484.034,492.965,499.551,512.984,489.12,487.905,517.954,
47.000000,500.984,502.03,489.04,493.886,502.958,494.952,480.042,
48.000000,492.914,529.06,486.97,477.952,554.947,484.04,515.04,
49.000000,548.034,480.063,487.458,496.96,571.147,476.944,492.888,
50.000000,546.944,521.025,486.1,500.08,674.998,479.912,538.182,
51.000000,641.824,592.108,548.024,521.003,691.206,493.019,556.104,
52.000000,735.92,651.961,599.25,576.95,781.72,494.062,687.18,
53.000000,762.02,764.932,612.156,649.021,757.16,513.904,786.273,
54.000000,726.82,780.998,706.988,670.797,697.514,604.83,780.496,
55.000000,752.804,891.568,743.94,736.213,693.4,621.827,779.376,
56.000000,736.8,834.802,734.68,707.99,604.424,668.35,730.888,
57.000000,664.26,837.5,696.86,678.221,562.048,721.023,651.203,
58.000000,581.268,737.186,621.185,648.298,553,681.111,643.971,
59.000000,561.92,690.027,614.512,568.938,522.004,611.05,587.995,
60.000000,563,606.939,570.098,527.929,496.012,557.87,564.967,
61.000000,515.09,584.955,550.02,523.18,492.568,534.95,559.955,
62.000000,523.988,551.932,513.436,490.003,485.41,509.917,529.053,
63.000000,500.976,490.979,498.122,494.049,492.574,488.99,514.004,
64.000000,489.966,500.036,459.99,468.024,480.048,470.087,494.017,
65.000000,479.992,493.025,466.552,473.052,459.912,478.03,475.488,
66.000000,493.972,473.975,460.58,456.975,495.1,466.997,490.034,
67.000000,502.842,474,469.504,453.948,521.966,452.912,478.964,
68.000000,542.024,498.072,460.468,471.99,576.08,434.045,515.92,
69.000000,595.908,503.925,482.528,471.039,627.702,455.08,520.15,
70.000000,645.167,532.975,514.492,488.02,632.82,469.06,543.015,
71.000000,660.828,592.97,539.984,509.768,624.504,466.959,634.14,
72.000000,669.216,627.998,562.568,538.125,590.936,487.936,605.13,
73.000000,631,654.073,594.472,573.026,608.953,517.144,640.986,
74.000000,608.08,633.068,616.972,541.115,567.067,544.936,584.156,
75.000000,567.872,639.313,565.928,573.861,530.118,549.991,576.12,
76.000000,544.012,615.952,567.565,555.997,531.105,565.036,577.02,
77.000000,523.876,586.095,574.582,544.994,546.594,551.15,542.089,
78.000000,493.086,547.109,548.504,534.209,515.06,552.921,530.568,
79.000000,492.08,522.934,520.908,500.109,479.996,522.017,485.04,
80.000000,491.036,512.88,508.556,495.005,476.458,501.99,492.96,
81.000000,467.048,503.025,484.978,478.046,475.038,476.062,482.99,
82.000000,493,484.048,461.488,465.01,482.99,480.002,480.992,
83.000000,459,452.008,471.44,454.07,494.047,442.99,465.97,
84.000000,482.97,459.922,452.976,453,559.921,470.96,462.05,
85.000000,497.92,451.044,451.46,443.972,590.218,447.016,449.975,
86.000000,511.914,453.096,451.54,442.072,640.023,446.992,475.052,
87.000000,572.108,466.992,452.544,450.946,733.036,437.936,482.024,
88.000000,600.104,480.142,454.977,469.015,780.904,443.989,500.957,
89.000000,600.1,511.936,474.526,476.026,686.696,432.048,539.001,
90.000000,646.928,540.952,494,474.949,658.035,436.985,544.112,
91.000000,631.112,568.056,470,510.063,702.94,463.976,575.896,
92.000000,597.448,577.017,516.097,507.092,626.049,476.04,579.2,
93.000000,558.552,598.92,517.502,524.189,594.104,494.943,536.089,
