Time [ms],1000000000,
0,544.024,
1000000000,497.982,
2000000000,497.032,
3000000000,502.024,
4000000000,509.496,
5000000000,526.52,
6000000000,526.48,
7000000000,519.512,
8000000000,514.96,
9000000000,518.464,
10000000000,508,
11000000000,510.025,
12000000000,502.984,
13000000000,493.488,
14000000000,478.5,
15000000000,483.498,
16000000000,474.007,
17000000000,481.984,
18000000000,465.032,
19000000000,472.5,
20000000000,454.034,
21000000000,473.484,
22000000000,478.548,
23000000000,476.528,
24000000000,484.504,
25000000000,475.979,
26000000000,484.996,
27000000000,479.528,
28000000000,490.5,
29000000000,473.997,
30000000000,473.475,
31000000000,472.004,
32000000000,463.524,
33000000000,466.504,
34000000000,462.48,
35000000000,464.003,
36000000000,463.017,
37000000000,459.504,
38000000000,475.985,
39000000000,471.992,
40000000000,461.503,
41000000000,460.5,
42000000000,465.992,
43000000000,465.99,
44000000000,470.019,
45000000000,451.02,
46000000000,467.984,
47000000000,465.528,
48000000000,465.48,
49000000000,439.972,
50000000000,449.51,
51000000000,451.526,
52000000000,451.016,
53000000000,451.46,
54000000000,443.004,
55000000000,440.513,
56000000000,451.012,
57000000000,452.5,
58000000000,450.974,
59000000000,442.512,
60000000000,445.992,
61000000000,452.444,
62000000000,444.52,
63000000000,451.012,
64000000000,437.512,
65000000000,441.516,
66000000000,444.5,
67000000000,438.004,
68000000000,436.996,
69000000000,436.002,
70000000000,444.004,
71000000000,438.536,
72000000000,433.488,
73000000000,441.5,
74000000000,440.5,
75000000000,445.496,
76000000000,429,
77000000000,442.482,
78000000000,437.479,
79000000000,433.528,
80000000000,433.998,
81000000000,441.494,
82000000000,443.51,
83000000000,428.48,
84000000000,437.996,
85000000000,432.466,
86000000000,441.476,
87000000000,442.031,
88000000000,433.02,
89000000000,426.488,
90000000000,434.5,
91000000000,436.454,
92000000000,441.009,
93000000000,435.025,
94000000000,438.508,
95000000000,440.508,
