Time [ms],1000000000,1000000001,1000000002,1000000003,
0,906.95,1090.09,1490.67,1064.92,
1000000000,1183.22,1201.43,1224.02,1240.9,
2000000000,1428.13,1272.62,1376.87,1437.29,
3000000000,1860.24,1975.5,1429.9,1637.92,
4000000000,2324.29,2580.37,1532.44,2005.01,
5000000000,2521.72,2764.16,1663.11,2102.36,
6000000000,2451.87,2423.77,1628.11,2011.86,
7000000000,2324,2264.3,1550.65,1916.88,
8000000000,2269.63,2236.25,1383,1838.63,
9000000000,2033.67,2101.2,1380.06,1741.04,
10000000000,1897.64,1972.03,1268.02,1649.45,
11000000000,1850.31,1838.24,1152,1570.12,
12000000000,1682.01,1642.91,1155.01,1449.95,
13000000000,1551.83,1597.01,1140.87,1419.36,
14000000000,1577.98,1581,1101.13,1419.84,
15000000000,1531,1525.21,1137.09,1434.22,
16000000000,1483.12,1506.12,1090.93,1433.88,
17000000000,1510.03,1517.87,1109.03,1478.13,
18000000000,1675.3,1716.07,1152.91,1546.56,
19000000000,1803,2040.08,1151.89,1641.55,
20000000000,1959.77,2223,1187.51,1655,
21000000000,1975.12,2530.2,1156.88,1658.6,
22000000000,2020.96,2454.97,1153.15,1601.57,
23000000000,1887.21,2214.84,1153.59,1449.14,
24000000000,1811.38,2095.82,1141.09,1524.37,
25000000000,1714.94,1876.12,1142.26,1426.31,
26000000000,1628.88,1774.28,1090.99,1276.21,
27000000000,1485.26,1576.08,1060.36,1239.28,
28000000000,1430.55,1444.06,1025.03,1168,
29000000000,1352,1387.07,987.992,1144.07,
30000000000,1242,1340.05,975.023,1074.97,
31000000000,1271.88,1225.02,980.074,1033.87,
32000000000,1219.93,1205.16,919.094,1009.93,
33000000000,1212.03,1189.96,949.078,952.528,
34000000000,1257.47,1281.15,905.928,976.866,
35000000000,1288.14,1425.02,912.908,995.802,
36000000000,1363.08,1515.16,928.972,1057.78,
37000000000,1391.08,1721.95,949.987,1100.8,
38000000000,1422.03,1813.14,947.822,1101.14,
39000000000,1415.08,1741,902.068,1034.04,
40000000000,1401.08,1667.06,883.456,989,
41000000000,1323.21,1542.99,868.99,968.936,
42000000000,1298.96,1471.86,847.516,936.008,
43000000000,1219.96,1454.1,819,928.04,
44000000000,1150.04,1296.12,787.464,840,
45000000000,1104.16,1223.97,755.15,800.058,
46000000000,1078.75,1123.96,760.04,747.05,
47000000000,1015.04,1035.91,699.94,730.496,
48000000000,993.048,989.956,705.982,693.464,
49000000000,956.984,971.024,688.02,662.035,
50000000000,892.896,964.904,710.134,690,
51000000000,948.128,999.14,688.012,673.476,
52000000000,962.168,1123.08,689.985,705.48,
53000000000,1023.94,1262.01,690.952,723.956,
54000000000,1070.94,1271.94,704.992,730,
55000000000,1052.07,1349.92,706.89,731.968,
56000000000,1035,1397.02,708.89,717.92,
57000000000,1025,1363.06,677.048,696.06,
58000000000,1036.96,1311.03,669.04,712.92,
59000000000,1011.01,1223.14,692.996,662.02,
60000000000,952.04,1107.13,660.96,689.926,
61000000000,896.968,1018.96,661.008,604.956,
62000000000,802.977,943.97,656.983,601.5,
63000000000,796.864,901.084,656.06,604.984,
64000000000,788.048,890.944,647.07,602.976,
65000000000,771.904,817.024,619.01,581.072,
66000000000,754.996,804,603.972,553.972,
67000000000,756.08,854.024,617.99,560.452,
68000000000,780.016,887.104,593.996,559,
69000000000,792.96,967.912,607.005,580.504,
70000000000,780.036,1077.1,601.98,595.972,
71000000000,799.096,1102.95,592,602.456,
72000000000,819.524,1095.04,606.508,621.026,
73000000000,826.5,1122.13,583.02,609.981,
74000000000,854.949,1118.92,574.048,616.056,
75000000000,845.97,1076.98,592.48,613.028,
76000000000,795.032,954.95,608.526,610.04,
77000000000,745.012,891.936,604.972,591.987,
78000000000,726.948,844.048,600.1,582.971,
79000000000,710.044,805.936,592.934,565.982,
80000000000,693.057,787.06,572.944,566,
81000000000,670.088,735.975,566.998,567.016,
82000000000,638.064,717.114,571,556.96,
83000000000,650.092,746.955,557.936,542.025,
84000000000,650.968,762.922,566.04,535.984,
85000000000,638,789.96,559.934,558.005,
86000000000,662.96,836.08,546,526,
87000000000,646.936,896.04,556.002,557.99,
88000000000,668.12,911,562.008,545.004,
89000000000,678.028,932.104,558.04,555.982,
90000000000,696.976,959.888,539.016,546.025,
91000000000,685.088,920.144,558.029,581.952,
92000000000,683.504,857.92,579.052,570.989,
93000000000,670.46,829.032,565,553.992,
94000000000,652.5,778.096,576.034,546.016,
95000000000,629.952,738,550.968,535.032,
