
Intensity Median
 ==================== 
Time [s],1000000000,1000000001,1000000002,1000000003,
0.000000,1789.85,1664.76,1577.82,1590.33,
1.000000,2005.33,1901.34,1861.44,1590.17,
2.000000,1947.37,2084.45,1867.56,1913.29,
3.000000,1750.26,1932.45,1653.08,1743.04,
4.000000,1503.7,1595.24,1482.33,1567.98,
5.000000,1386.73,1389.73,1488.97,1269.06,
6.000000,1207.56,1228.24,1157.82,1226.03,
7.000000,1077.13,1036.96,1052.22,995.792,
8.000000,911.796,1009.21,941,962.032,
9.000000,812.16,900.964,842.516,814.004,
10.000000,710.952,758.136,784.485,741.992,
11.000000,687.03,759.954,737.504,666.02,
12.000000,680.04,698.093,725.072,636.922,
13.000000,669.03,668.914,652.072,606.904,
14.000000,643.808,691.036,675.954,639,
15.000000,689.943,673.962,662.968,656.108,
16.000000,750.032,853.385,806.84,819.911,
17.000000,969.25,1035.27,986.612,1017.87,
18.000000,1062,1330.36,1185.76,1180.64,
19.000000,1222.24,1455.05,1369.66,1357.24,
20.000000,1352.38,1551.55,1425.54,1280.49,
21.000000,1361.8,1418.78,1318.32,1215.4,
22.000000,1482,1386.31,1182,1101.01,
23.000000,1252.88,1298.27,1148.45,1056.15,
24.000000,1173.07,1236.62,1218.79,937.224,
25.000000,1069.29,1148.66,1111.67,948.096,
26.000000,996.312,1073.3,1046.68,845.192,
27.000000,909.896,995.841,913.59,850.12,
28.000000,780.178,874,874.84,861.146,
29.000000,754.951,878.394,844.968,728.924,
30.000000,733,802.328,802.372,739.1,
31.000000,700.944,762.532,780.175,686.076,
32.000000,663.04,718.892,712.06,688,
33.000000,654,740.035,712.016,727,
34.000000,641.044,730.576,694.01,693.16,
35.000000,652.056,725.438,710.149,772.92,
36.000000,684.152,830.061,753.096,777.88,
37.000000,732.104,890.345,808.192,797.94,
38.000000,854.06,1045.03,858.192,728.184,
39.000000,998.92,1103.49,962.21,811.198,
40.000000,1031.05,1192.18,1056.95,783.038,
41.000000,1059.78,1139.16,1077.9,878,
42.000000,1065.6,1015.52,1038.2,853,
43.000000,999.871,978.949,1001.98,807.068,
44.000000,927.884,907.235,903.112,811,
45.000000,902.06,877.544,842.148,776,
46.000000,848.496,791.499,785.274,699.132,
47.000000,768.08,819.965,772.142,691,
48.000000,713.006,773.625,782.054,628.96,
49.000000,714.097,724.98,728.016,651.012,
50.000000,679.168,706.455,711,603.008,
51.000000,658.024,655.068,680,616.966,
52.000000,633.068,719.06,642.962,604.44,
53.000000,634.016,668.014,664.088,646.984,
54.000000,631.928,695.496,625.222,648.94,
55.000000,620.092,706.52,710.036,669.024,
56.000000,686.976,787.944,736,682.992,
57.000000,693.14,834.896,795.097,697.98,
58.000000,741,855.88,796.012,747.06,
59.000000,746.05,880.036,854.108,720.03,
60.000000,750.112,840.5,877.214,753.982,
61.000000,759.081,824.08,789.996,669.876,
62.000000,753.935,776.352,823.915,676.06,
63.000000,745.068,761.48,773.052,661.024,
64.000000,741.12,747.862,766,635.096,
65.000000,746.952,714.904,723,597.971,
66.000000,726,686.051,689.081,648.04,
67.000000,692.948,655.935,676.516,592.978,
68.000000,656.964,649.104,675.092,568.004,
69.000000,636.955,642.092,610.54,586,
70.000000,612.048,610.941,639.08,570.018,
71.000000,596.016,614.971,602.98,585.9,
72.000000,603.01,627.916,572.134,579.04,
73.000000,567.04,604.02,614.056,577.046,
74.000000,558,667.096,633.944,614.04,
75.000000,579,673.986,650.066,619.92,
76.000000,583.076,687.924,676.01,642.962,
77.000000,596.052,714.018,740.912,605.976,
78.000000,629.032,720.12,722.896,628.08,
79.000000,625.06,719.541,711,596.998,
80.000000,635.048,678.54,722.1,631.472,
81.000000,628.016,679.54,711.822,603.096,
82.000000,642.048,674.035,685,602.92,
83.000000,672.996,631.54,661.04,598.925,
84.000000,639.044,663.998,630.952,563.008,
85.000000,647,632.956,606.96,570.948,
86.000000,638.12,621.937,603.915,568.03,
87.000000,613,635.077,594.966,551.036,
88.000000,606.932,596.003,607.016,543.52,
89.000000,583.98,625.058,582.968,519.026,
90.000000,554.05,610.91,588.084,551.438,
91.000000,545.018,620.968,585.116,557.09,
92.000000,541.983,616.063,610,586.062,
93.000000,543.084,662.972,599.004,566.963,
94.000000,548.998,633.018,618.108,563.043,
95.000000,555.016,666.064,627.101,566.025,
96.000000,555.94,668.094,606,582.948,
97.000000,593.068,636.058,616.084,593,
