Frame number,1000000000,1000000001,1000000002,1000000003,
0.000000,811.035,1100.87,1038.12,962.936,
1.000000,1150,1846.49,1483.98,1438.08,
2.000000,2203.15,2744.9,1844.1,2112.1,
3.000000,2385,2870.63,1939.38,2480.42,
4.000000,2624.61,2734.8,2156.18,2783.96,
5.000000,2660.88,2703.26,2015.71,2538.43,
6.000000,2412.98,2439.09,2007.89,2330.5,
7.000000,2352.47,2152.1,1825.84,2054.38,
8.000000,2494.42,1883,1731.81,1796.74,
9.000000,2439.15,1793.01,1601.98,1678.25,
10.000000,2238,1656.98,1507.25,1370.96,
11.000000,2005.99,1498.59,1452.92,1301.95,
12.000000,1805.43,1449.56,1383.16,1386.6,
13.000000,1606.99,1468.55,1336.46,1373.34,
14.000000,1594.06,1429.99,1338.93,1328.99,
15.000000,1500.83,1428.95,1363.91,1365,
16.000000,1455.93,1447.4,1360.8,1426.1,
17.000000,1667.76,1620.93,1288.92,1514.11,
18.000000,1690.74,1830.6,1425.76,1628.01,
19.000000,1899.23,1709.98,1436.88,1539.13,
20.000000,1873.06,1759.96,1509.08,1535.06,
21.000000,1898.04,1769.63,1442.96,1511.89,
22.000000,1952.78,1772.15,1490.49,1569.06,
23.000000,1961.98,1574.99,1471.12,1596.79,
24.000000,2026.34,1573.05,1471.97,1466.2,
25.000000,1784.09,1446.06,1379.85,1396.14,
26.000000,1705.91,1405.03,1257,1279.81,
27.000000,1639.98,1342,1166.98,1134.11,
28.000000,1497.03,1278.95,1090.61,1133.88,
29.000000,1423.99,1223.04,1038.05,1064.86,
30.000000,1464,1189.03,967.062,1003.9,
31.000000,1396.09,1176.96,1007,1001.05,
32.000000,1349.12,1167.98,982.9,990.098,
33.000000,1405.85,1256,950.136,1022.05,
34.000000,1454.87,1303.94,943.04,1065.03,
35.000000,1362.14,1285.97,903.5,1044.04,
36.000000,1245.11,1284.08,888.1,1031.89,
37.000000,1263.06,1326.96,900,1059.09,
38.000000,1294.98,1348.9,846.032,1055.98,
39.000000,1329.96,1316.98,921.44,1038.05,
40.000000,1364.25,1242.08,896.92,997.051,
41.000000,1270.06,1193.96,834.984,936.992,
42.000000,1178.13,1127.02,785.422,914.06,
43.000000,1154.89,1102.02,738.432,879.026,
44.000000,1065.91,1032.49,737.5,867.986,
45.000000,1046,1036.47,684,857.015,
46.000000,1013.02,1005.06,662.488,828.868,
47.000000,940.93,1012.97,689.06,795.056,
48.000000,989.116,1008.05,698.992,837.96,
49.000000,942.962,1071.01,678.04,853.16,
50.000000,975.922,1076.98,677.988,819.928,
51.000000,904.04,1050.96,675.428,822.006,
52.000000,897.88,1072.05,677.44,830.44,
53.000000,904.994,1133.08,685.512,831.484,
54.000000,895.956,1114.89,678.04,828.068,
55.000000,949,1095.97,686.984,804.952,
56.000000,905.13,1078.06,660.071,812.988,
57.000000,924.008,1012.05,652.968,788.08,
58.000000,887.081,999.036,646.968,740.49,
59.000000,830.008,962,627.53,745.138,
60.000000,804.188,955.032,622.504,712.026,
61.000000,831.976,925.952,601,724.021,
62.000000,758.04,916.98,609.53,718.935,
63.000000,770.98,892.961,594.008,697.088,
64.000000,790.092,900.952,590.492,738.943,
65.000000,748,923.001,608.484,718.996,
66.000000,741,934,608.024,751.96,
67.000000,743.995,955.03,593.55,716,
68.000000,726.488,994,582.992,699.072,
69.000000,744.966,1029.03,596.542,728.002,
70.000000,757.496,1037.86,600.06,733.998,
71.000000,735.92,1048,607.012,705.948,
72.000000,756,1001.95,600.032,700.016,
73.000000,703.104,1012.06,576.96,697,
74.000000,702.96,999,563.008,703.99,
75.000000,691.148,945.928,576.04,685.948,
76.000000,686,929.966,552.504,673.956,
77.000000,710.44,940.052,555.024,660.017,
78.000000,692.008,882.052,570.94,665.952,
79.000000,695.934,875.036,552.53,680.01,
80.000000,651.98,904,547.976,629.092,
81.000000,672.056,916.046,546.484,632.972,
82.000000,668.048,931,544.488,658.04,
83.000000,666.552,935.976,537.996,661,
84.000000,633,906.955,524.032,640,
85.000000,640.959,953.93,561,651.032,
86.000000,645.984,951,548.544,655.048,
87.000000,648,990.016,553.432,647.012,
88.000000,659.99,983.966,546.016,673.528,
89.000000,642.044,975.958,545.442,633.954,
90.000000,648.886,947.984,553.024,633.024,
91.000000,654.108,968.976,547.508,609.032,
92.000000,639.466,929.014,533.996,607.048,
93.000000,645.019,901,520.424,615.026,
94.000000,639.002,852.024,525.52,618.02,
