Time [ms],1000000000,1000000001,1000000002,1000000003,1000000004,1000000005,1000000006,1000000007,
0,1341.22,2537.7,2275.01,2954.53,2199.07,1139.23,896.06,1352.02,
1000000000,921.992,1321.99,1343.88,1378.42,1098.02,852.012,676.048,844.964,
2000000000,777.952,907.974,994,821.023,929.444,669.578,597.952,643.974,
3000000000,819.02,953.985,1007.94,843.692,1053.01,736.928,587.04,640.012,
4000000000,1142.1,1031.05,1344.96,1041.53,1300.9,927.56,637.024,681.002,
5000000000,1527.04,1205,1589.31,1374.28,1564.57,1229.77,737.927,756.975,
6000000000,1939.14,1334.89,1887.16,1616.26,1712.49,1353.89,794.019,859.024,
7000000000,2234.12,1387.13,2035.61,1633,1733.8,1264.96,842.06,840.025,
8000000000,2240.81,1491.5,1732.12,1582.07,1657.74,1344.34,841.864,825.02,
9000000000,2234.89,1432.52,1714.47,1264.74,1528.28,1375.04,823.068,859.1,
10000000000,2047.33,1412.16,1605.47,1444.99,1447,1296.4,890.888,894.98,
11000000000,1854.95,1349,1546.9,1422.08,1446.67,1354.74,840.984,830.984,
12000000000,1676.08,1266.51,1462.96,1349.2,1319.4,1165.12,817.032,830.002,
13000000000,1556.96,1203.82,1395.85,1220.44,1315.03,1263.02,812.408,765.944,
14000000000,1460.83,1171.2,1327.32,1238.93,1210.91,1221.12,776,747.112,
15000000000,1281.24,1154.55,1303.09,1086.16,1213.04,1192.84,792.904,756.031,
16000000000,1132.07,1038.12,1206,1194.9,1077.04,1109.01,748.012,702.456,
17000000000,1033.9,944.536,1138.72,1162.86,1054.16,980.796,752.904,681.564,
18000000000,931.856,896,1110.2,1088.95,1023.97,951.4,740,617,
19000000000,928.008,886.85,1079.13,1048.77,1012.8,995.012,787.54,657.055,
20000000000,1000.12,905.8,1112,1176.12,1063.28,1078.14,800,657.894,
21000000000,1079.06,922.95,1253.47,1164.7,1140,1169.9,871.38,662.958,
22000000000,1184.08,1047.02,1310.94,1216.97,1238.78,1207.78,928.912,704.986,
23000000000,1281.89,1088.4,1349.33,1265.07,1278.56,1304.03,989.16,707.988,
24000000000,1369.06,1111.19,1420.01,1242.92,1261.02,1286.32,986.076,726.928,
25000000000,1427.95,1190.6,1406.62,1225.87,1260.5,1366.96,1019.06,722.05,
26000000000,1454.06,1171.21,1354.93,1175.52,1231.03,1264.88,944.928,735.538,
27000000000,1389.1,1120.43,1421.85,1156.79,1249.6,1197.51,944.46,734.02,
28000000000,1319.9,1165.8,1414.22,1144.08,1247.1,1258.39,913.95,700.488,
29000000000,1285.92,1090.94,1424.66,1027,1182.97,1206.66,898.98,714.04,
30000000000,1254.98,1098.1,1335.8,1011.89,1163.92,1144.14,900.942,712.926,
31000000000,1192.09,1104.04,1265.5,988.472,1127.11,1205.58,898.934,714.125,
32000000000,1105.1,1052.09,1309.48,955.352,1085.1,1165.91,847.052,683.5,
33000000000,1032.9,1062.13,1175.41,885,1014.58,1046.16,826.808,668.56,
34000000000,963.936,988.124,1115.42,803.135,975.856,975.925,781.12,633.04,
35000000000,898.92,877.016,1080.96,802.12,902.512,979.992,773.032,647.009,
36000000000,853.01,869.04,1058.34,817.848,962.16,936.484,805.512,637.52,
37000000000,874.996,880.172,1096.62,805.902,933.452,1009.47,844.012,631.064,
38000000000,887.882,916.054,1065.72,818.02,1031.09,1053.68,844.448,631.92,
39000000000,964.492,968.918,1167.33,845.058,1055,1145.09,872.46,635.988,
40000000000,985.036,985.096,1162.98,852.166,1070.58,1111.11,876.472,666.99,
41000000000,1013.99,1032.09,1136.89,872.96,1088.17,1151.96,889.992,650.002,
42000000000,1036,967.928,1136.76,881.094,1062.93,1131.87,877.52,676.03,
43000000000,1064.95,962.052,1150.48,870.185,1073.13,1150.54,881.576,659.054,
44000000000,1105.08,1014.91,1173.58,867.106,1125.9,1134.4,828.476,676.06,
45000000000,1114.96,996.04,1190.57,854.84,1058.84,1081.22,839.968,641.024,
46000000000,1082.07,1006.94,1144.52,882.6,1042.1,1047.9,823.008,632.966,
47000000000,994.056,988.012,1206.84,866.507,1048.08,1092.79,794.184,666.053,
48000000000,970.028,964.065,1171.58,831.88,1067.29,1097.98,812.92,648.904,
49000000000,999.46,973.92,1110.11,831.996,1055.31,1059.09,765.98,633.132,
50000000000,930.524,930.848,1046,813.816,1036.92,931.944,763.892,606.912,
51000000000,891.948,927.086,1067.43,833.975,955.203,951.144,744.14,594.01,
52000000000,859.082,897.025,972.9,789.838,908.036,912.016,729.912,582.992,
53000000000,843.15,874.926,946.164,749.146,907.066,927.04,687,581.064,
54000000000,825.99,836.01,948.196,747.922,863.064,921.98,722.944,590.992,
55000000000,833.01,851.144,963.817,773.99,905.104,938.1,738.964,579.496,
56000000000,831.928,808.128,971.18,798.023,946.947,906,758.008,591.58,
57000000000,865.986,881.087,956.2,787.964,928.812,942.2,759.232,604.028,
58000000000,913.919,846.918,992.981,793.02,959.783,961.922,759.96,604.95,
59000000000,952.944,886.984,1036.1,779.066,991.058,937,739,597.97,
60000000000,942.938,881.038,1055.44,790.88,1009.98,974,727.984,593.988,
61000000000,952.88,856.965,964.816,766.17,958.4,967.12,769.968,584.98,
62000000000,968.06,868.054,982.543,775.9,925.008,923.992,729.989,602.08,
63000000000,1008.94,853.052,988.382,762.012,956.12,949.088,728.968,599.041,
64000000000,1017.1,833.96,979.24,757.972,952.915,897.964,712,591.048,
65000000000,997.972,846.492,996.46,732.911,904.12,915.844,728.944,576.507,
66000000000,946.968,851.504,966.952,732.88,904.12,875.977,726.947,541.008,
67000000000,931.038,836.528,893.25,741,881.208,863.12,686.078,572.987,
68000000000,867.085,812,904.044,710.096,842,830.937,656.44,560.992,
69000000000,890.034,816.116,862.948,698.109,857.952,816.094,662.944,556.504,
70000000000,860.1,807.056,858.7,677.054,812.42,780.966,658.082,552.552,
71000000000,816.02,788.4,794.472,677.066,777.984,773.072,658.94,554.056,
72000000000,785.531,772.068,840.011,666.142,811.46,808.09,670.96,538.96,
73000000000,820.53,751.028,827.164,687.88,805.43,844.99,706.92,545,
74000000000,826.023,779.878,912.924,656.026,816.57,867.079,715.91,562.968,
75000000000,849.56,781.928,871.968,709.984,851.416,876.931,717.075,582.08,
76000000000,921.985,751.12,866.92,704.06,834.974,925.16,710.132,555.08,
77000000000,928.94,784.984,853.936,692.504,832.52,863.985,703.9,603.035,
78000000000,911.04,765.936,797.818,676.982,831.422,835.04,716.072,549.96,
79000000000,984.89,755.984,833.016,678.464,830.004,797.015,718.016,569.98,
80000000000,976.904,762.112,834.91,659.996,838.008,818.888,697.848,560.488,
81000000000,975.968,753.114,869.968,679.952,801.592,843.026,696.924,547.984,
82000000000,956.88,757.884,859.804,661.517,824.884,799.92,670,534.008,
83000000000,1016.2,727.02,833.212,618.492,783.248,804.874,706.821,544.95,
84000000000,955.996,749.986,811.24,647.504,802.08,761.9,626.46,540.928,
85000000000,879.541,757.952,794.93,649,780.153,773.616,652.058,528.972,
86000000000,851.905,751.912,773.032,629.926,738.6,726.52,638.53,522.972,
87000000000,820.048,736.858,768.912,618.005,751.944,719.007,674.016,533.998,
88000000000,833.08,703.008,809.876,630.064,742.068,750.105,671.516,525.072,
89000000000,817.9,711.128,726.937,600.952,732.944,739.1,678.548,515.98,
90000000000,845.92,698.984,758.98,586.967,800.184,724.136,672.004,524.943,
91000000000,814.55,721.948,775.16,607.524,753.942,721.956,688.56,543.022,
92000000000,840.008,727.964,780.122,599.5,779.92,749.47,675.328,539.972,
93000000000,881.376,714.1,772.142,583.46,791.952,764.66,658.016,523.978,
94000000000,926.52,716.96,746.096,599.008,777.548,748.004,647.088,527.92,
95000000000,1001.1,713.049,777.208,583.528,783.992,762.966,661.112,518.048,
