Time [ms],1000000000,1000000001,1000000002,1000000003,
0,59641.2,17540.7,31789,54747.4,
1000000000,15374.9,13105.4,10105.1,14641.3,
2000000000,7789.02,5491.5,7063.44,6868.62,
3000000000,4579.58,3978.94,6017.68,5063.36,
4000000000,2916.89,2954.26,4851.68,3423.06,
5000000000,2084.92,2082.81,3668.76,2403.79,
6000000000,1601.17,1616.09,2593.05,1759.97,
7000000000,1282.98,1285,1975.17,1419.92,
8000000000,1134.51,1157.04,1563.83,1181.95,
9000000000,1052.97,1155.67,1420.15,1053.97,
10000000000,1059.51,967.436,1264.04,1022.13,
11000000000,1037.94,894.561,1202.94,928.981,
12000000000,987.52,793.506,1268.71,926.072,
13000000000,921.02,760.541,1693.02,954.114,
14000000000,894.05,758.56,1610.47,939.112,
15000000000,940.936,837.488,1489.71,987.477,
16000000000,1022.1,934.504,1462.85,995.096,
17000000000,1101.11,1118.02,1471.83,1136.42,
18000000000,1393.18,1348.09,1600.01,1523.24,
19000000000,1471.52,1525.87,1583.91,1838.67,
20000000000,1554.61,1592.18,1606.09,1821.46,
21000000000,1612.1,1624.8,1570.1,1779,
22000000000,1593.15,1620.02,1534.14,1761.47,
23000000000,1471.03,1462.11,1452.98,1612.95,
24000000000,1397.05,1319.22,1436.03,1489.55,
25000000000,1276.92,1246.9,1425.39,1342.48,
26000000000,1229.92,1092.04,1312.66,1197.97,
27000000000,1162.12,1039.45,1214.07,1132.98,
28000000000,1137.1,966.4,1221.89,1062.06,
29000000000,1069.47,910.086,1224.1,1044.06,
30000000000,1051.49,859.519,1244.12,972.94,
31000000000,1019.97,816.956,1176.89,973.858,
32000000000,1012.02,813.125,1125.85,956.912,
33000000000,1063.07,861.946,1149.83,924.037,
34000000000,1055.02,877.964,1212.79,951.572,
35000000000,1114.03,1002.86,1263.87,1008.93,
36000000000,1137.05,1084.24,1287.09,1052.04,
37000000000,1174.19,1209.53,1321.95,1273.3,
38000000000,1181.97,1317.06,1311.12,1403.73,
39000000000,1230.86,1457.05,1337.02,1455.04,
40000000000,1231.98,1512,1276.96,1516.38,
41000000000,1268.07,1488.96,1308.88,1511.82,
42000000000,1280.05,1496.12,1282.92,1525.98,
43000000000,1258.15,1412.1,1201.09,1481.99,
44000000000,1238,1380.89,1214.16,1289.09,
45000000000,1191.17,1280.95,1160.1,1267.02,
46000000000,1193.02,1196.9,1108.9,1198.13,
47000000000,1185.48,1068.11,1094.98,1111.06,
48000000000,1100.88,1054.82,1073.02,1092.94,
49000000000,1096.96,959.981,1043,1041.49,
50000000000,1050.04,925.87,994.556,1046.47,
51000000000,1077.17,900.012,1028.89,965.12,
52000000000,1009.03,859.032,1006.02,949.92,
53000000000,965.073,878.006,1041.95,901.907,
54000000000,973.064,881.074,1007.09,921.952,
55000000000,994.932,891.072,1030.04,936.984,
56000000000,972.944,915.952,1040.07,973.028,
57000000000,980.048,982.908,1037.19,967.786,
58000000000,1007.05,1107.03,1078.93,1046.98,
59000000000,1009.92,1103.24,1073.03,1080.96,
60000000000,1011.92,1105.11,1091.95,1089,
61000000000,1008.06,1168.75,1065.14,1136.9,
62000000000,1017.03,1217.91,1057.12,1173.02,
63000000000,1005.02,1186.78,1046.94,1100.06,
64000000000,1060.6,1190.84,1058.08,1102.12,
65000000000,1047.47,1184.22,1013.11,1114.16,
66000000000,1025.68,1109.05,1030.79,1061.94,
67000000000,1031.56,1091.98,1006.03,1073.57,
68000000000,1064.6,1013.17,998.896,1041.04,
69000000000,996.568,983.867,995.143,1000.84,
70000000000,1022,963.56,938.907,975.982,
71000000000,1001.5,892.472,956.095,936.992,
72000000000,991.961,901.082,917.961,902.968,
73000000000,995.544,826.873,948.08,887.1,
74000000000,989.96,873.108,893.85,877.46,
75000000000,937.032,891.084,935,867.42,
76000000000,959.028,852.964,903.035,820.512,
77000000000,926.003,906.49,888.49,853.012,
78000000000,893.072,896.071,857.635,811.176,
79000000000,914.892,897.947,871.056,851.5,
80000000000,924.995,925.216,882.95,862.845,
81000000000,905.466,990.125,890.984,876.9,
82000000000,866.956,965.975,870.464,929.92,
83000000000,870.91,928.194,852.01,923.968,
84000000000,908.964,953.072,834.892,926.044,
85000000000,894.144,959.964,847.008,964.038,
86000000000,885.036,983.828,843.052,951.07,
87000000000,913.959,978.8,869.488,934.13,
88000000000,919.024,908.885,876.504,916.52,
89000000000,897.6,905.908,844.985,946.064,
90000000000,934.56,927.088,877.938,881.95,
91000000000,932.064,914.98,867.94,875.966,
92000000000,918.06,900.906,855.967,872.098,
93000000000,910.071,855.047,856.935,836.04,
94000000000,933.91,867.936,848.071,837.064,
95000000000,893.018,840.012,821.913,791.548,
