Time [ms],1000000000,
0,459.962,
1000000000,449.02,
2000000000,440.02,
3000000000,434.016,
4000000000,439.032,
5000000000,458.984,
6000000000,446.976,
7000000000,446.034,
8000000000,456.972,
9000000000,441.06,
10000000000,437.992,
11000000000,439.005,
12000000000,436.972,
13000000000,437.002,
14000000000,434.032,
15000000000,438.992,
16000000000,433.012,
17000000000,433.019,
18000000000,426.025,
19000000000,426.04,
20000000000,429.981,
21000000000,431.012,
22000000000,428.976,
23000000000,435,
24000000000,446.028,
25000000000,439.024,
26000000000,436.95,
27000000000,437.011,
28000000000,435.98,
29000000000,435,
30000000000,425.004,
31000000000,423.996,
32000000000,425.02,
33000000000,423.032,
34000000000,428.992,
35000000000,429.972,
36000000000,420.991,
37000000000,429.992,
38000000000,419.034,
39000000000,435.017,
40000000000,428.98,
41000000000,427.008,
42000000000,421.96,
43000000000,420.008,
44000000000,422.987,
45000000000,428.012,
46000000000,419.972,
47000000000,429.014,
48000000000,434.022,
49000000000,426.013,
50000000000,424.024,
51000000000,423.98,
52000000000,414.987,
53000000000,427.012,
54000000000,426.993,
55000000000,429.028,
56000000000,430,
57000000000,423.007,
58000000000,432.026,
59000000000,425.028,
60000000000,429.02,
61000000000,424.952,
62000000000,419.05,
63000000000,420.986,
64000000000,413,
65000000000,424.02,
66000000000,421.965,
67000000000,428.03,
68000000000,422.992,
69000000000,422.99,
70000000000,417.996,
71000000000,421.976,
72000000000,419.016,
73000000000,425.03,
74000000000,420.008,
75000000000,424,
76000000000,424.046,
77000000000,428.99,
78000000000,418.023,
79000000000,419.012,
80000000000,423.04,
81000000000,422.016,
82000000000,423.019,
83000000000,418,
84000000000,425.986,
85000000000,422.996,
86000000000,424.004,
87000000000,420.031,
88000000000,421.008,
89000000000,420.97,
90000000000,413.004,
91000000000,418.014,
92000000000,420.992,
93000000000,421.992,
94000000000,419.016,
95000000000,412.993,
