Time [ms],1000000000,1000000001,1000000002,1000000003,
0,634.59,682.994,624.496,663.879,
1000000000,781.04,785.02,713.927,750.16,
2000000000,936.696,998.308,814.093,914.728,
3000000000,1124.72,1105.26,996.175,1010.2,
4000000000,1234.52,1272.84,1104.75,1150.11,
5000000000,1207.85,1370.88,1101.81,1154.84,
6000000000,1250.14,1202.82,1156.52,1055.11,
7000000000,1168.04,1111.07,946.914,927.886,
8000000000,1078.23,991.224,865.998,813.811,
9000000000,925,822.899,771.948,754.936,
10000000000,839.144,793.983,714.18,699.072,
11000000000,768.104,722.69,690.668,629.025,
12000000000,759.046,665.908,605.115,636.077,
13000000000,710.174,683.084,591.995,668.867,
14000000000,629.181,618.82,564.487,633.978,
15000000000,610.876,610.076,535.463,567.93,
16000000000,577.046,577.876,520.012,580.085,
17000000000,576.079,590.862,523,535.994,
18000000000,551.931,573.088,530.56,572.019,
19000000000,553.075,629.968,528.5,587.925,
20000000000,538.999,578.966,538.452,622.084,
21000000000,584.512,682.04,559.084,649.067,
22000000000,667.48,728,577.918,652,
23000000000,742.32,799.8,648.06,729.748,
24000000000,785.07,822.976,754.05,730.914,
25000000000,841.08,862.865,736.226,744.862,
26000000000,757.108,855.125,704.908,726.137,
27000000000,711.088,749.104,648.03,636.104,
28000000000,679.926,745.124,655.08,629.628,
29000000000,624.872,693.53,605.2,598.14,
30000000000,610.12,651.64,575,614.02,
31000000000,609.912,652.522,553.96,592.016,
32000000000,576.148,640.94,535.96,562.475,
33000000000,584.936,596.528,507.962,548.067,
34000000000,567.056,589.488,539.92,544.985,
35000000000,567.936,566.928,512.975,562.52,
36000000000,542.068,564.616,506.054,536.548,
37000000000,534.059,564.02,488.979,526.56,
38000000000,525.07,542.476,516.024,519.524,
39000000000,547.024,551.06,512,542.002,
40000000000,578.966,581.456,530.974,564.9,
41000000000,623.064,620.112,544.124,587.444,
42000000000,662.04,648.992,560.028,629.448,
43000000000,668.022,691.556,584.968,657.992,
44000000000,649.804,694.022,574.008,592.55,
45000000000,633.022,678.453,577.436,667.438,
46000000000,609.04,656.056,574,610.008,
47000000000,610.136,633.006,533.992,589.56,
48000000000,608.072,604.008,543.53,566.939,
49000000000,596.088,618.94,547.404,559.048,
50000000000,566.93,573.901,533.96,565.96,
51000000000,551.01,569.101,532.016,546.056,
52000000000,539.983,545,515.56,539.032,
53000000000,538.07,541.948,506.52,520.564,
54000000000,534.872,547.941,502.002,507.532,
55000000000,534.026,528.969,489.014,520.962,
56000000000,528.104,535.014,501.032,507.12,
57000000000,540.02,521.06,520.04,510.5,
58000000000,540.966,557.007,534.472,513,
59000000000,528.076,533.952,519.992,526.489,
60000000000,581,544.102,535.04,535.968,
61000000000,586.08,564.957,531.03,560.446,
62000000000,563.08,553.995,529.46,554.024,
63000000000,567.856,576.966,534.985,566.568,
64000000000,574.96,533.923,520.976,557.016,
65000000000,560.964,558.902,548.472,542.504,
66000000000,555.02,548.006,532.008,544.544,
67000000000,559.047,552.007,515.96,530.932,
68000000000,539.98,545.963,499.52,524.46,
69000000000,535.08,533.009,498.544,515.028,
70000000000,521.484,520.99,498.02,517.996,
71000000000,522.984,512.013,495.005,508.984,
72000000000,515.028,492.022,505.052,514.508,
73000000000,530.028,503,497.008,509.504,
74000000000,525.5,485.95,504.968,497.94,
75000000000,531,507.947,497,510.002,
76000000000,516.02,506.05,508.952,505.992,
77000000000,539.016,515.01,492.992,515.05,
78000000000,519.48,508.932,494.012,504.04,
79000000000,539,515.937,511.52,511.994,
80000000000,542.519,523.047,512.512,515.448,
81000000000,527.96,521.052,486.98,515.968,
82000000000,534.54,511.988,507.932,520.96,
83000000000,528.014,526.09,517.976,528.432,
84000000000,536.492,538.962,514.038,527.06,
85000000000,523.996,527.972,492.953,502.5,
86000000000,527.466,509.017,507,510.996,
87000000000,521.988,510.052,487.98,523.48,
88000000000,544.52,514.999,502.036,516.028,
89000000000,524.994,506.02,486.058,504.504,
90000000000,517.52,521.49,489.053,499.48,
91000000000,505.06,505.008,497.042,494.52,
92000000000,510.96,500.036,502.012,489.416,
93000000000,538,519.002,494.01,511.432,
94000000000,547.992,526.52,512.946,518.95,
