Time [ms],1000000000,1000000001,1000000002,1000000003,
0,1455.27,2162.07,1528.91,1927.74,
1000000000,1061,1172.95,1162.06,1470.97,
2000000000,1342.9,1160,1582.17,1587.99,
3000000000,1651.88,1531.03,2165.2,1712.1,
4000000000,1990.43,1872.84,2632.28,1943.04,
5000000000,2107.2,1779.51,2513.67,2088.04,
6000000000,2133.06,1661.98,2588.98,2105.19,
7000000000,2140.15,1668,2627.2,2067.91,
8000000000,2190.2,1684.1,2464.05,2056.09,
9000000000,2108.64,1580.9,2232.93,2052.06,
10000000000,2007.91,1480.94,2020.88,1952.62,
11000000000,1974.13,1401.53,1859.02,1842.01,
12000000000,1846.95,1348.04,1739.89,1683.6,
13000000000,1827.09,1335.86,1609.04,1715.06,
14000000000,1942.18,1288,1502.86,1718.46,
15000000000,1827.08,1282.58,1564.7,1759.04,
16000000000,1844.11,1277.4,1501.14,1654.91,
17000000000,1768.9,1255.52,1656.04,1703.58,
18000000000,1813.14,1389.07,1842.08,1707.55,
19000000000,2071.1,1510.95,2052.71,1701.35,
20000000000,1909.27,1453.47,1924.91,1764.16,
21000000000,2055.58,1485.3,1942.11,1684.46,
22000000000,2103.75,1578.44,1986.95,1612.85,
23000000000,1999.72,1505.5,1966.79,1768.14,
24000000000,2037.84,1521.04,1860.23,1645.82,
25000000000,2033.16,1490.01,1771.07,1653.17,
26000000000,1767.24,1372.02,1629.97,1586.07,
27000000000,1672.5,1305.86,1540.16,1478.08,
28000000000,1569.22,1317.1,1456.92,1360.86,
29000000000,1529.06,1230.98,1332.91,1307.12,
30000000000,1401.94,1240.87,1243.05,1243.94,
31000000000,1459.96,1234.1,1218.11,1200.04,
32000000000,1374.55,1179.11,1202,1115.89,
33000000000,1403.46,1211.9,1205.92,1094.12,
34000000000,1384.99,1236.09,1258.86,1107.17,
35000000000,1430.22,1242.86,1261.22,1089.05,
36000000000,1317.08,1158.97,1263.8,1095.18,
37000000000,1376.27,1210.97,1284,1082.94,
38000000000,1355.22,1215.01,1308.83,1096.13,
39000000000,1391.2,1230.04,1360.48,1145.1,
40000000000,1457.65,1226.1,1252.18,1170.13,
41000000000,1344.19,1168.97,1190.06,1117.1,
42000000000,1269.13,1085.99,1137.07,1078.13,
43000000000,1239.98,1060.64,1099.99,991.087,
44000000000,1188.13,1042.02,1031.12,945.975,
45000000000,1163.99,977.016,959.559,939.038,
46000000000,1103.16,982.432,914.93,901.962,
47000000000,1044.99,949.98,877.054,867.058,
48000000000,1009.97,933.872,874.956,858.083,
49000000000,1002.04,921.11,856.16,823.99,
50000000000,1041.09,962.056,931.096,810.048,
51000000000,1009.95,924.96,877,814.022,
52000000000,994.896,902.02,852.912,792.024,
53000000000,964.87,930.91,897.93,809.042,
54000000000,1021.23,923.995,906.112,839.96,
55000000000,1067.06,946.962,881.184,841.94,
56000000000,1017.9,950.91,881.07,841.98,
57000000000,1007.38,930.032,864.136,830.476,
58000000000,947.928,898.939,798.096,805.036,
59000000000,906.553,862.98,815.89,778.512,
60000000000,875.528,852.936,762.984,755.932,
61000000000,904.976,823.054,780.96,729.057,
62000000000,871.968,831.012,753.008,732.998,
63000000000,839.984,765.046,727.964,706.97,
64000000000,812.079,802.984,709.884,687,
65000000000,809.882,778.084,740.96,687.995,
66000000000,824.029,798.04,748.976,690.009,
67000000000,848.025,777.988,762.136,695.019,
68000000000,788.084,792.908,766.024,677,
69000000000,786.1,773.1,718.024,690.988,
70000000000,819.055,807.92,742.076,716.971,
71000000000,847.99,847.068,745.055,711.015,
72000000000,832.986,810,779.88,729.986,
73000000000,818.106,779.05,742.968,721,
74000000000,783.04,779.073,723.086,697.992,
75000000000,758.99,756.12,692.932,678,
76000000000,759.816,773.976,701.071,686.986,
77000000000,761.501,728.04,702.053,667.022,
78000000000,730.98,724.956,691.004,652.006,
79000000000,731.927,705.04,688.932,629.036,
80000000000,703.024,700.07,679.09,626.532,
81000000000,723.46,747.98,674.942,634.989,
82000000000,693.979,739.962,700.051,623.006,
83000000000,729.456,703.002,726.016,643.46,
84000000000,721.93,711.04,702.023,641.011,
85000000000,690.952,715.024,698.948,632.056,
86000000000,701.024,748.016,668.088,636.544,
87000000000,715.92,724,700.088,664.022,
88000000000,718.96,736.024,695.067,626.968,
89000000000,710.94,736.984,668.972,651.485,
90000000000,700.004,718.064,668.944,636.032,
91000000000,688,720.038,639.072,611.96,
92000000000,667.955,726.982,655.992,603,
93000000000,651,692.48,651.516,608.01,
94000000000,665.925,669.504,645,620,
95000000000,666.1,650.968,622.48,604.012,
