Time [ms],1000000000,1000000001,1000000002,1000000003,
0,569.024,613,556.998,495.054,
1000000000,678.59,639.986,603.048,571.952,
2000000000,764.092,752.492,805,628.976,
3000000000,894.56,821.6,859.218,753.048,
4000000000,1061.77,965.081,950.748,783.564,
5000000000,1032.21,1023.99,1057.95,855.018,
6000000000,1035.51,1013.06,933,801.008,
7000000000,906.975,1007.96,841.158,776.084,
8000000000,845.024,845.874,797.869,740.086,
9000000000,745.018,783.864,744.168,671.076,
10000000000,681,745.906,698.14,620,
11000000000,641.044,654,612.9,582.54,
12000000000,601.536,643.042,596.056,545.524,
13000000000,567.038,618.154,569.07,550.004,
14000000000,560.971,588,552.464,518.964,
15000000000,547,579.5,555.081,490.054,
16000000000,517.979,557.006,517.01,496.021,
17000000000,528.968,543,501.952,497.956,
18000000000,528.984,562.034,532.028,487.001,
19000000000,528.012,569,507.036,509.965,
20000000000,570.096,594.535,537,538.925,
21000000000,584.008,655.486,579.05,562.992,
22000000000,662.08,723,594.992,597.024,
23000000000,764,753.04,689.884,670.96,
24000000000,827.556,767,708.268,697.952,
25000000000,775.984,741.144,690.03,709.982,
26000000000,815.44,730.074,662.066,706.917,
27000000000,746.99,687.01,679.408,659.031,
28000000000,716.818,681.962,618.908,663.84,
29000000000,643.022,639.004,606,615.028,
30000000000,640.088,595.04,572.017,596.04,
31000000000,581.956,567.96,561.576,570.98,
32000000000,572.005,575.046,534.966,530.989,
33000000000,560.052,547.928,564.956,518.968,
34000000000,546.015,542.946,534.112,519.012,
35000000000,523.96,533.992,523,499.956,
36000000000,508.96,523,519.04,500.98,
37000000000,505.982,554.972,511.98,477.994,
38000000000,510.94,546.06,514.96,485,
39000000000,506.028,570.96,494.998,497.03,
40000000000,531.997,586.016,506.988,508.036,
41000000000,535.942,629.02,555,527,
42000000000,580.992,666,547.952,563.024,
43000000000,605.04,664.104,605.028,600,
44000000000,645.11,674.064,568.055,621,
45000000000,651.024,660.966,615.078,636,
46000000000,638,616.096,608.936,604.024,
47000000000,630.992,587.032,598.022,593.108,
48000000000,606.517,587.987,562.096,585.96,
49000000000,580.516,573.98,563.008,543.964,
50000000000,552.508,537.02,528.025,549.044,
51000000000,542.512,536.01,521.946,532.022,
52000000000,534.956,538.968,526.973,523.016,
53000000000,526.952,523,516.982,492.952,
54000000000,529.928,514.016,526.053,497.024,
55000000000,504.495,533.968,501.962,487.032,
56000000000,492.012,538.976,496.992,483.956,
57000000000,495,551,475.048,483.036,
58000000000,490,543,497.97,469.981,
59000000000,515.992,558,501.984,516.056,
60000000000,522.984,557.05,530.035,506,
61000000000,530.964,563.964,505.01,502.037,
62000000000,533.952,587.968,539.072,535.04,
63000000000,568,584.04,558.988,530.992,
64000000000,568.942,575.96,530.07,555,
65000000000,575.971,569.936,543.964,585.084,
66000000000,559.02,544.039,540.081,556,
67000000000,555.992,534.99,540.078,535.048,
68000000000,568.007,524.973,527.02,536.037,
69000000000,543.944,517.052,505.974,528.957,
70000000000,526.018,524.038,521.957,520.01,
71000000000,507.93,506.96,510.962,497.98,
72000000000,507.934,508.05,508.018,498,
73000000000,497.984,506.042,497.928,496.984,
74000000000,496.967,512.031,499.038,487.992,
75000000000,495.972,504.021,474.932,478.952,
76000000000,494,516.035,495.02,491.062,
77000000000,489.016,508.008,502.984,470.992,
78000000000,487.984,511.968,488.984,493.985,
79000000000,498.964,507.032,509.066,483.978,
80000000000,520.068,521.016,505.047,477.044,
81000000000,504,528.036,485.044,507.034,
82000000000,508,515.996,515.978,499.98,
83000000000,529.056,520.031,527,496.98,
84000000000,523.979,510.99,506.038,495.94,
85000000000,515.008,510.946,532.024,506.01,
86000000000,532,517.054,522.036,513.008,
87000000000,527.036,498.97,515.98,490.988,
88000000000,509.984,504.955,502.044,506.956,
89000000000,514.016,511.956,500.973,507.928,
90000000000,489.98,497.024,480.956,492.964,
91000000000,500.035,496.968,504,488.959,
92000000000,492.056,504.952,490.99,482,
93000000000,494.968,514.968,478.968,473.992,
94000000000,482.006,497.004,501,479.042,
95000000000,487.008,498.048,474.991,482.985,
