Time [ms],1000000000,1000000001,
0,660.06,603,
1000000000,688.05,642.06,
2000000000,727.976,683,
3000000000,673.352,770.935,
4000000000,740.107,636.88,
5000000000,787.972,625.813,
6000000000,789.021,666.88,
7000000000,714.112,679.852,
8000000000,729.011,686.203,
9000000000,742.776,717.982,
10000000000,716.168,720.948,
11000000000,762.776,736.924,
12000000000,627.819,746.16,
13000000000,628.08,659.086,
14000000000,601.136,671.109,
15000000000,586.508,646.08,
16000000000,621.92,668.072,
17000000000,579.102,596.076,
18000000000,573.918,608.086,
19000000000,620.104,596.125,
20000000000,555.042,618.987,
21000000000,515.996,606.415,
22000000000,565.864,642.892,
23000000000,596.982,664.816,
24000000000,591.917,611.218,
25000000000,622.08,601.868,
26000000000,538.04,595.024,
27000000000,554.432,600.858,
28000000000,533.008,576.971,
29000000000,515.509,594.008,
30000000000,546.1,561.988,
31000000000,554.046,612.04,
32000000000,565.98,576.944,
33000000000,530.95,582.6,
34000000000,558.896,533.08,
35000000000,523.994,546,
36000000000,545.02,550.975,
37000000000,546.966,562.941,
38000000000,541.036,579.99,
39000000000,558.955,622.992,
40000000000,515.127,594.944,
41000000000,587.125,584.844,
42000000000,597.464,613.136,
43000000000,596.016,582.986,
44000000000,596.546,603.922,
45000000000,526.48,628.901,
46000000000,555.895,590.98,
47000000000,552.96,543.947,
48000000000,576.544,560.064,
49000000000,560.481,579.104,
50000000000,532.53,558.971,
51000000000,551,577.985,
52000000000,551.894,580.028,
53000000000,536.56,511.959,
54000000000,537.496,549.035,
55000000000,532.98,530.04,
56000000000,519.988,528.95,
57000000000,531.984,518.955,
58000000000,514.487,519.052,
59000000000,515.032,517.056,
60000000000,522.512,530.04,
61000000000,515.036,534.056,
62000000000,504.449,530.948,
63000000000,505.031,521.54,
64000000000,496.016,510.526,
65000000000,508.524,509.024,
66000000000,506.05,515.432,
67000000000,490.962,512.064,
68000000000,492.06,497.909,
69000000000,478.525,474.862,
70000000000,480.02,493.016,
71000000000,497.004,467.979,
72000000000,491.45,471.058,
73000000000,483.496,506.065,
74000000000,486.432,497.872,
75000000000,477.5,513.049,
76000000000,492.04,522.1,
77000000000,499.982,511.984,
78000000000,491.002,478.004,
79000000000,480.979,505.89,
80000000000,493.036,484.992,
81000000000,503.917,495.057,
82000000000,502.987,478.948,
83000000000,470.97,479.032,
84000000000,499.012,483.971,
85000000000,493.01,488.924,
86000000000,496.986,473.028,
87000000000,488.04,489,
88000000000,487.04,484.08,
89000000000,467.072,462.958,
90000000000,478.52,485.043,
91000000000,471.05,474.04,
92000000000,482.986,471.944,
93000000000,487.01,470.948,
94000000000,479.017,455.981,
95000000000,488.897,475.07,
