Frame number,1000000000,1000000001,1000000002,1000000003,1000000004,1000000005,
0.000000,1056.78,1362.2,802.2,587.592,658.742,647.992,
1.000000,1010.04,1416.43,807.822,588.616,716.361,755.02,
2.000000,997.602,1615.08,969.84,620.765,623.618,762.92,
3.000000,1116.04,1685.8,804.888,556.216,640.748,748.788,
4.000000,935.078,1434.2,690.7,541.08,571.845,689.932,
5.000000,775.308,1197.42,637.886,536.95,529.03,644.948,
6.000000,788.396,921.895,631.204,539.554,653.891,606.96,
7.000000,667.872,712.06,549.912,502.931,559.042,547.98,
8.000000,625.144,636.904,521.99,488.98,501.076,537.922,
9.000000,607.964,593.057,539.082,494.052,496,542.876,
10.000000,539.052,580.016,561.97,509.96,512.963,541,
11.000000,534.932,492.472,520.039,509.016,505.979,519.944,
12.000000,583,529.018,561,564,534.992,559.98,
13.000000,633.997,737.156,628.912,681.872,589.144,612.044,
14.000000,794.769,1012.77,785.98,786.16,723.1,756,
15.000000,964.5,1437.04,982.538,924.72,724.848,942.792,
16.000000,1134.04,1719.34,1096,1048.02,898.192,1185.9,
17.000000,1179.5,1749.22,1122.79,876.866,869.746,1186.35,
18.000000,1035.51,1112.2,1012.6,825.14,846.8,1105.96,
19.000000,933.408,980.488,873.919,772.085,701.856,962.86,
20.000000,862.994,782.603,788.058,638.125,625.689,800.8,
21.000000,731.512,682.88,649.045,577.916,581.896,648.048,
22.000000,637.4,625.02,586.94,527.978,531,618.86,
23.000000,546.984,586.44,534.088,506.992,539.016,541.964,
24.000000,554.02,548.504,522.984,509.95,493.016,492.01,
25.000000,507.92,506.08,489.012,504.028,511.057,503.54,
26.000000,507.048,504.968,494.035,490.062,497.954,486.946,
27.000000,506.992,483.036,486.016,485.025,505.064,480.522,
28.000000,516.1,534.908,506.06,502.086,523.04,507.032,
29.000000,595.1,652,542.46,516,575.004,565.07,
30.000000,889.54,856,617.99,688.968,688.109,719.486,
31.000000,1166.3,1150.74,791.616,788.71,831.804,925.182,
32.000000,1315.66,1507.96,909.94,1080.04,978.35,1264.48,
33.000000,1112.94,1693.91,1056.48,1069.02,1003.84,1232.94,
34.000000,1070.94,1494,1335.55,831.867,940.762,1112.26,
35.000000,876.881,1185.16,1037.66,716.191,860.644,928.578,
36.000000,767.896,878.336,855.975,625.114,609.932,802.182,
37.000000,660.03,708.92,696.175,572.484,572.05,640.95,
38.000000,616.963,616.535,596.02,530.496,530.048,546.99,
39.000000,546.012,581.54,539.936,495.04,494.989,525.028,
40.000000,522,529.976,520.98,494.014,491.974,501.96,
41.000000,506.015,500.964,520.952,462.014,486.016,498.034,
42.000000,484.02,507.462,493.976,493.951,498,466.015,
43.000000,497.056,494.98,506.108,482.031,504.02,468.964,
44.000000,531.96,520.992,546.04,509.034,543.044,498.48,
45.000000,523.152,576.06,606,555.944,592.04,547,
46.000000,738.9,735.06,758.232,675.892,683.904,645.08,
47.000000,1047.9,913.012,1009.17,837.07,806.964,855,
48.000000,1288.28,1364.08,1186.7,888.916,997.04,996,
49.000000,1405.06,1340.99,1379.36,898.816,927.84,1078.19,
50.000000,1216.94,1200.19,1255.1,828.107,1010.99,1088.51,
51.000000,1113.61,974.137,959.76,765.135,925.968,974.824,
52.000000,901.885,808.031,794.998,643.513,750.908,808.4,
53.000000,727.922,682.808,679.069,580.055,674.032,687.036,
54.000000,630.953,579.975,575.967,550.974,568.036,616.118,
55.000000,572.52,561.95,522.997,506.08,549.088,577.092,
56.000000,543.94,516.968,494.968,488,510.956,524,
57.000000,494.525,502.984,474.012,465.967,497.018,511.028,
58.000000,499.468,491.88,498.944,477.018,504.03,482.032,
59.000000,502.488,495.94,487.948,471.992,512.06,492.988,
60.000000,519,509,555.032,491.024,574,524.966,
61.000000,586.992,541.968,656,533.88,670.972,523.052,
62.000000,745.125,653.96,816.028,760.186,809.472,694.072,
63.000000,999.616,959.13,1134.12,910.652,997.164,753.71,
64.000000,1421.84,1047.06,1087.44,1197.82,1152.5,929.88,
65.000000,1123.32,1247.15,1280.45,1181.25,947.415,1004.89,
66.000000,1106.94,1041.56,1074.28,988,808.448,863.19,
67.000000,868.672,917.976,806.848,862.92,728.232,828.484,
68.000000,736.91,725.912,632.138,764.128,657.508,719.576,
69.000000,677.035,693.53,592.074,623,561.568,657.1,
70.000000,625.92,597.92,515.096,578.048,521.944,598,
71.000000,575.072,571.024,517.07,520.008,504,560,
72.000000,522.986,529,506.902,506.994,489.971,506,
73.000000,487.062,542.464,503.904,487,496.482,511.056,
74.000000,490.94,500.048,497.96,482.954,503.999,510.984,
75.000000,518.056,545.54,531.024,497.018,531.464,525.108,
76.000000,564.128,508.992,591.136,498.914,594.92,570.032,
77.000000,689.089,572,699.936,706.928,776.952,626.858,
78.000000,893.052,691.068,1114.86,847.176,915,834.822,
79.000000,1106.71,1060.22,1170.76,980.04,978.491,807.096,
80.000000,1236.06,1231.6,1151.96,960.84,1175,994.1,
81.000000,1246.94,1192,1112.96,803.972,870.208,951.2,
82.000000,1227.27,1185.2,916.86,737.094,808,870.1,
83.000000,1035,926.92,761.916,625.928,706.84,719.96,
84.000000,873.867,771.936,671.938,600.975,594.08,630.94,
85.000000,667.944,714.928,572.032,530.022,541.072,574.08,
86.000000,617.176,617.07,542.03,491.96,521.972,546,
87.000000,534.954,574.936,486.96,489.029,520.056,487.986,
88.000000,524.01,579.916,481.046,481.022,484.976,484.568,
89.000000,510.032,551.504,483.036,480.512,503.96,493.05,
90.000000,499.016,584.512,512.499,507.49,522.55,519.02,
91.000000,563,657.916,529.056,548.108,560.888,581.842,
92.000000,618.94,749.516,598.92,690.981,687.004,658.908,
93.000000,744.128,968.742,791.52,863.796,878.988,845.334,
94.000000,995.984,1059.21,926.528,1068.18,1102.22,1114.77,
