Time [ms],1000000000,1000000001,1000000002,
0,4480.71,3797.78,4608.12,
1000000000,2668.7,2431.44,3267.91,
2000000000,2296.84,2045.4,2879.13,
3000000000,2422.25,1926.2,3187.72,
4000000000,2812.87,2282.03,3530.47,
5000000000,2932.07,2466.4,3392.84,
6000000000,2857.7,2405.78,3337.11,
7000000000,2544.65,2344.5,3034.83,
8000000000,2226.73,2143.07,2852.7,
9000000000,2091.5,2016.49,2734.42,
10000000000,1987.69,1860.52,2515.5,
11000000000,1881.55,1898.66,2220.87,
12000000000,1746,1781.6,2001.72,
13000000000,1578.89,1609.86,1845.87,
14000000000,1388,1498.6,1703.94,
15000000000,1305.57,1369.01,1535.61,
16000000000,1194.71,1357.11,1569.41,
17000000000,1093.06,1380.64,1403.87,
18000000000,1164.78,1439.7,1434.16,
19000000000,1240.01,1544.9,1715.17,
20000000000,1374.6,1605,1893.52,
21000000000,1372.58,1738.62,1839.6,
22000000000,1455.38,1695.1,1848.61,
23000000000,1370.71,1809.03,1783.42,
24000000000,1369.96,1659.49,1650.85,
25000000000,1320.31,1605.78,1515.73,
26000000000,1313.74,1582.92,1490.59,
27000000000,1284.17,1538.74,1437.2,
28000000000,1265.24,1498.83,1415.1,
29000000000,1175.16,1413.66,1367.66,
30000000000,1107.66,1328.22,1388.82,
31000000000,1047.96,1266.22,1250.05,
32000000000,969.2,1143.97,1266.75,
33000000000,937.056,1120.57,1167.75,
34000000000,903.46,1111.06,1176.9,
35000000000,883.01,1109.7,1146.03,
36000000000,875.125,1178.53,1301.81,
37000000000,953.992,1327.16,1254.34,
38000000000,986.164,1285.08,1325.05,
39000000000,1051.04,1428.15,1398.5,
40000000000,1074.46,1452.26,1368.65,
41000000000,1071.95,1414.75,1351.34,
42000000000,1098.98,1418.04,1347.78,
43000000000,1114.13,1345.93,1392.44,
44000000000,1075.42,1328.83,1277.92,
45000000000,1081,1293.91,1309.13,
46000000000,992.092,1260.73,1270.56,
47000000000,932.15,1219.08,1221.01,
48000000000,918.32,1199.05,1210.61,
49000000000,937.554,1192.06,1180.95,
50000000000,852.8,1070.2,1092.05,
51000000000,857.672,1049.02,1112.3,
52000000000,829.064,1077.93,1099.61,
53000000000,866.184,1126.08,1207.65,
54000000000,832.736,1204.53,1181.4,
55000000000,898.845,1297.03,1232.49,
56000000000,935.089,1283.42,1234.1,
57000000000,887.065,1304.99,1261.54,
58000000000,946.779,1297.65,1310.77,
59000000000,941.06,1334.81,1300.33,
60000000000,960.154,1315.47,1218.74,
61000000000,931.032,1234.42,1175.57,
62000000000,959.036,1236.69,1242.99,
63000000000,939.376,1122.17,1249.22,
64000000000,967.886,1253.36,1196.56,
65000000000,940.99,1164.56,1148.4,
66000000000,887.017,1059.75,1152.47,
67000000000,937.95,1063.2,1141.1,
68000000000,871.135,1081.9,1190.33,
69000000000,887.901,978.12,1137.03,
70000000000,833.115,1092.49,1094.9,
71000000000,804.898,1117.09,1059.31,
72000000000,824.961,1120.14,1083.13,
73000000000,869.046,1125.74,1093.34,
74000000000,853.352,1147.59,1100.87,
75000000000,795.666,1133.33,1131.92,
76000000000,859.133,1158.22,1144.58,
77000000000,895.81,1149.16,1108,
78000000000,916.12,1172.32,1121.18,
79000000000,823.032,1153.46,1063.74,
80000000000,831.13,1134.27,1110,
81000000000,852.053,1092.76,1118.15,
82000000000,825.812,1116.87,1133.21,
83000000000,823.992,1044.18,1071.92,
84000000000,812.808,1143.56,1132.19,
85000000000,800.877,1096.72,1070,
86000000000,772.736,956.896,1047.15,
87000000000,796.224,1004.22,969.664,
88000000000,788.112,1067.74,1019.69,
89000000000,796.556,985.6,973.794,
90000000000,755.1,1055.13,1022.91,
91000000000,819.249,1096.12,1070.72,
92000000000,794.5,1094.9,1047,
93000000000,819.6,1098.17,1042.02,
94000000000,850.004,1070.89,1030.06,
95000000000,810.078,1032.32,992.62,
