Frame number,1000000000,
0.000000,592.55,
1.000000,474.477,
2.000000,484.472,
3.000000,508.05,
4.000000,505.475,
5.000000,496.02,
6.000000,497.99,
7.000000,475.08,
8.000000,451.968,
9.000000,447.012,
10.000000,443.48,
11.000000,448.992,
12.000000,433.984,
13.000000,430.008,
14.000000,423.508,
15.000000,424.532,
16.000000,417.976,
17.000000,418.02,
18.000000,438.956,
19.000000,433.019,
20.000000,444.994,
21.000000,442.992,
22.000000,454.964,
23.000000,445.044,
24.000000,447,
25.000000,446.034,
26.000000,441.018,
27.000000,446.048,
28.000000,435.976,
29.000000,430.028,
30.000000,433.025,
31.000000,430,
32.000000,431.04,
33.000000,418.032,
34.000000,421.994,
35.000000,427.025,
36.000000,433.01,
37.000000,434.016,
38.000000,426.992,
39.000000,434,
40.000000,434.052,
41.000000,443,
42.000000,448.003,
43.000000,430.988,
44.000000,433,
45.000000,430.974,
46.000000,431.986,
47.000000,427.009,
48.000000,419.991,
49.000000,430.968,
50.000000,428,
51.000000,426.052,
52.000000,428.024,
53.000000,429.976,
54.000000,416.916,
55.000000,422.028,
56.000000,429.92,
57.000000,427,
58.000000,432.008,
59.000000,433.013,
60.000000,428.03,
61.000000,435.012,
62.000000,432.014,
63.000000,428.016,
64.000000,423.016,
65.000000,423.951,
66.000000,431.016,
67.000000,425.008,
68.000000,418.986,
69.000000,417.01,
70.000000,420.94,
71.000000,429.032,
72.000000,420.001,
73.000000,419.998,
74.000000,419.044,
75.000000,418,
76.000000,421.979,
77.000000,428.972,
78.000000,433.985,
79.000000,428.022,
80.000000,420.009,
81.000000,423.028,
82.000000,426.956,
83.000000,416.997,
84.000000,437.976,
85.000000,417.02,
86.000000,423.981,
87.000000,419.994,
88.000000,424.984,
89.000000,421.992,
90.000000,418.968,
91.000000,426.009,
92.000000,412.994,
93.000000,422.99,
94.000000,417.98,
