Time [ms],1000000000,1000000001,1000000002,1000000003,
0,2241.42,1684.53,1457.09,1661.28,
1000000000,2169.27,1992.42,1637.62,1657.88,
2000000000,2256.66,1715.18,1351.74,1528.36,
3000000000,2414.37,1956.73,1765.73,2098.36,
4000000000,2272.44,1927,1738.28,2184.4,
5000000000,2114.78,1788.33,1583.81,1939.27,
6000000000,1876.96,1462.37,1497.78,1806.03,
7000000000,1792.14,1499.69,1513.09,1700.46,
8000000000,1664.14,1407.7,1367.85,1556.3,
9000000000,1621.32,1277,1268.58,1440.9,
10000000000,1512.94,1276.5,1160.08,1330.36,
11000000000,1435,1178.06,1105.17,1258.15,
12000000000,1417,1167.84,1121.22,1243.1,
13000000000,1342.1,1163.65,1006.98,1156.96,
14000000000,1303.98,1049,984.784,1083.23,
15000000000,1241.18,1071.18,988.016,1103.19,
16000000000,1230.96,1159.26,963.912,1093.94,
17000000000,1190.16,1106.71,999.064,1132.72,
18000000000,1312.42,1104.29,987.92,1192.98,
19000000000,1323.28,1171.34,1074.97,1308.32,
20000000000,1340,1121.41,1065.11,1315.96,
21000000000,1403.74,1147.79,1069.86,1270.89,
22000000000,1366.57,1175.74,1031.24,1259.67,
23000000000,1333.82,1179.89,1062.08,1233.06,
24000000000,1355.84,1192.87,1181,1142,
25000000000,1173.82,1102.85,1208.93,1131.52,
26000000000,1228.24,1100.2,1128.15,1075.02,
27000000000,1143.17,1079.3,1042.19,1049,
28000000000,1100.48,990.4,1006.1,1025.01,
29000000000,1027.86,1027.9,985.96,1012.92,
30000000000,980.419,922.912,931.992,982,
31000000000,1001.28,904.832,952.176,945.016,
32000000000,949.112,967.004,928.792,974.04,
33000000000,991.891,933.072,865.08,956.904,
34000000000,973.916,961.01,877.504,984.1,
35000000000,961.18,912.896,901.95,965.475,
36000000000,952.272,978,981.136,986.54,
37000000000,1067.13,966.924,974,938.16,
38000000000,1016.73,974.92,991.142,968.94,
39000000000,1054.18,959.904,900.364,947.403,
40000000000,1076.01,949.004,929.056,942.116,
41000000000,993.364,956.824,893.148,930.01,
42000000000,997.08,890.072,890.012,927.61,
43000000000,1000.88,841.948,828.524,869.52,
44000000000,890.84,818.928,838.528,858.104,
45000000000,876.032,789.992,847.94,852.955,
46000000000,851.1,773.12,800.064,808.208,
47000000000,836.983,766.956,758.104,831.024,
48000000000,800.816,737.824,759.932,756.032,
49000000000,786.7,754.844,722,762.04,
50000000000,811.62,762.9,752.028,755.945,
51000000000,792.18,789.94,733.028,735.996,
52000000000,806.18,799.44,764.976,758.021,
53000000000,797.979,786.086,767.978,784.96,
54000000000,846.016,782.776,791.912,755.91,
55000000000,779.008,759.088,766.812,758.112,
56000000000,779.932,747.964,738.992,761,
57000000000,754,780.036,728.032,763.888,
58000000000,789.168,724.125,745,781.062,
59000000000,766,704,715.196,724.098,
60000000000,732.942,695.12,710.072,728.96,
61000000000,741.136,662.92,685.932,680.504,
62000000000,729.94,688.094,660.08,708,
63000000000,719.93,658.967,678.904,658.048,
64000000000,695.952,682.902,677.008,675.1,
65000000000,716.08,665.532,644.056,686.168,
66000000000,737.98,653.978,624.06,663.904,
67000000000,711.936,665.424,611.484,663.908,
68000000000,666.056,642.88,631.948,661.102,
69000000000,648.952,659.072,609.024,643.984,
70000000000,682.176,655.34,637.96,674.908,
71000000000,679.94,681.016,662.034,683.92,
72000000000,680.592,642.914,618.928,653.954,
73000000000,660.98,645.968,647.96,640.028,
74000000000,683.456,666.96,620.988,650.004,
75000000000,708.86,643.092,636.096,635.088,
76000000000,685.98,626.908,632.964,644.994,
77000000000,665.88,634.948,639.001,617.096,
78000000000,677.94,625.52,621.944,598.476,
79000000000,669.064,620.52,609.992,599.018,
80000000000,663.04,607.06,602.972,589.6,
81000000000,666.5,639.964,580.056,589.106,
82000000000,661.082,620.128,582.984,600.992,
83000000000,644.904,601.56,599.05,559.938,
84000000000,652.92,626.48,597.98,582.053,
85000000000,633.96,606.988,576.08,574.98,
86000000000,629.948,612.922,603.06,598.046,
87000000000,638.036,601.948,592.96,578.029,
88000000000,623.036,626.992,603.944,586.04,
89000000000,616.94,638.852,596.036,591,
90000000000,624.986,615,601.96,589.48,
91000000000,617.932,621.04,606.976,584.06,
92000000000,650,622.524,564.936,578.519,
93000000000,652.976,601.9,609.047,590.464,
94000000000,656.034,608.94,601.956,593.01,
