Time [ms],1000000000,1000000001,1000000002,1000000003,
0,2815.88,3258.79,4103.5,3859.19,
1000000000,3344.7,3590.5,4753,4561.48,
2000000000,2718.15,3672.22,4506.61,4677.29,
3000000000,2926.17,3508.21,5054.22,4977,
4000000000,3058.07,3526.57,5027.21,4863.74,
5000000000,2946.1,3438.77,4597.33,4273.54,
6000000000,2785.71,3249.64,4001.59,3962.62,
7000000000,2572.17,2934.56,3512.73,3669.26,
8000000000,2387.46,2701.23,3209.16,3293.3,
9000000000,2180.16,2480.89,2959.28,3012.02,
10000000000,2088.02,2321.84,2739.16,2844.47,
11000000000,1930.9,2211.38,2455.96,2659.14,
12000000000,1841.19,2113.91,2347.24,2395.66,
13000000000,1767.91,1945.64,2142.58,2302.66,
14000000000,1664.07,1821.76,1998.29,2157,
15000000000,1617.82,1730.29,1774.81,2067.24,
16000000000,1639.8,1695.7,1920.49,2066.55,
17000000000,1612.34,1661.04,1994.67,2149.86,
18000000000,1650.04,1657.31,2203.81,2217.51,
19000000000,1602.86,1767.56,2321.82,2377.95,
20000000000,1698.79,1838.83,2316.98,2504.83,
21000000000,1747.53,1849,2371.77,2498.96,
22000000000,1729.24,1816.82,2395.71,2395.91,
23000000000,1740.66,1798.71,2228.34,2364.29,
24000000000,1614.87,1664.09,2247.06,2187.2,
25000000000,1541.96,1619.92,1955.76,2112.98,
26000000000,1676.65,1643.78,1955.48,1966.88,
27000000000,1469.45,1557.29,1858.83,1819.23,
28000000000,1245.44,1563.52,1667.9,1771.84,
29000000000,1262.44,1428.87,1697.34,1705.15,
30000000000,1238.52,1464,1642.31,1694.97,
31000000000,1248.05,1399.2,1681.35,1622.05,
32000000000,1271.45,1421,1641.77,1731.03,
33000000000,1248.7,1403.5,1768.01,1845.64,
34000000000,1321.22,1430.15,1829.06,1858.46,
35000000000,1364.4,1444.04,1851.77,1937.15,
36000000000,1378.98,1422.77,1904.08,1946.94,
37000000000,1369,1455.84,2003.35,1890.88,
38000000000,1435.08,1384.33,1867.83,1888.24,
39000000000,1307.46,1353.66,1753.1,1793.98,
40000000000,1347.24,1312.14,1737.62,1686.2,
41000000000,1274.7,1281.94,1586.12,1644.78,
42000000000,1266.94,1238.07,1562.33,1575.01,
43000000000,1227.17,1238.93,1549.9,1518.34,
44000000000,1190.84,1156.74,1474.37,1424.31,
45000000000,1179.03,1151.06,1425.66,1512.9,
46000000000,1126.82,1136.82,1501.92,1425.13,
47000000000,1141.84,1115.05,1448.89,1495,
48000000000,1090.93,1118.08,1566.99,1492.26,
49000000000,1198.06,1151.98,1579.14,1583.92,
50000000000,1167.14,1142.15,1620.3,1613.48,
51000000000,1209.56,1134.02,1590.95,1684.77,
52000000000,1212,1130.08,1564.34,1644.88,
53000000000,1156.1,1139.27,1567.14,1565.96,
54000000000,1167.7,1098,1466.91,1515.21,
55000000000,1142.24,1089.09,1453.75,1464.05,
56000000000,1078.75,1064,1438.84,1383.93,
57000000000,1069.08,1034.74,1358.18,1375.78,
58000000000,1027.06,1041.79,1326.8,1293,
59000000000,1032.16,1012.1,1326.8,1331.02,
60000000000,981.04,1019.13,1340.81,1295.12,
61000000000,983.968,1005.96,1385,1311.1,
62000000000,972,932.796,1330.96,1308.14,
63000000000,924.056,980.852,1370.07,1356.96,
64000000000,984.408,946.851,1390.01,1358.2,
65000000000,1022.88,946.2,1408.16,1375.74,
66000000000,1009.88,911.02,1329.92,1449.56,
67000000000,1028.12,919.006,1347.17,1373.27,
68000000000,959.8,942.232,1326.99,1390.11,
69000000000,963.116,919.782,1319.7,1366.9,
70000000000,988.776,884.162,1253.92,1317.96,
71000000000,943.12,889.928,1215.98,1251.28,
72000000000,1002.78,893,1218.81,1264.1,
73000000000,900.46,889.026,1236.76,1257,
74000000000,942.704,874.848,1225.1,1225.11,
75000000000,920,920.924,1258.01,1234.19,
76000000000,905.216,851.924,1280.24,1230.11,
77000000000,870.888,855.923,1239.19,1275.41,
78000000000,869.92,868.916,1301.2,1274.03,
79000000000,908.168,858.976,1248.75,1282.64,
80000000000,918.79,880.388,1234.9,1292.08,
81000000000,928.048,872.099,1151.08,1262.96,
82000000000,919.02,894.002,1114.84,1238.46,
83000000000,947.032,865.99,1140.92,1242.46,
84000000000,941.083,855.02,1125.08,1141.38,
85000000000,968.94,856.472,1107.9,1158.64,
86000000000,922.06,891.576,1062.05,1172.71,
87000000000,872.892,868.6,1083.85,1164.67,
88000000000,846.996,832.426,1091.14,1116.82,
89000000000,852.496,787.606,1089.9,1098.92,
90000000000,855.424,799.468,1108.04,1108.96,
91000000000,782.092,835.196,1083.95,1097.5,
92000000000,783.518,778.96,1124.04,1103.56,
93000000000,793.008,797.528,1079.06,1114.45,
94000000000,789.496,800.12,1047.99,1118.62,
95000000000,782,783.455,1063.91,1143.75,
