Frame number,1000000000,1000000001,
0.000000,17197.7,23651.6,
1.000000,5771.1,9848.4,
2.000000,6432.44,10496.7,
3.000000,11552.9,11250.2,
4.000000,10253.8,10046.6,
5.000000,8652.69,8593.3,
6.000000,6902.71,6426.16,
7.000000,5417.51,5004.69,
8.000000,4621.92,3790.52,
9.000000,3413.82,2977.33,
10.000000,2859.2,2550.56,
11.000000,2439.42,2322.76,
12.000000,1953.52,1915.7,
13.000000,1681.74,1707.02,
14.000000,1467.94,1663.58,
15.000000,1330.06,1616.35,
16.000000,1397.99,1877.75,
17.000000,1679.59,2512.48,
18.000000,2398.49,3446.09,
19.000000,3562.86,4342.32,
20.000000,3775.81,4589.62,
21.000000,4494.61,4384.69,
22.000000,3438.6,3904.05,
23.000000,3401.33,3568.27,
24.000000,2602.11,3068.42,
25.000000,2351.05,2706.57,
26.000000,1999.15,2277.61,
27.000000,1773.98,2189.4,
28.000000,1565.8,1915.34,
29.000000,1397.06,1682.91,
30.000000,1287.04,1554.31,
31.000000,1230.94,1455.29,
32.000000,1196.06,1375.82,
33.000000,1327.89,1542.17,
34.000000,1530.18,1714.43,
35.000000,1864.81,2077.56,
36.000000,2174.64,2362.33,
37.000000,2476.52,2757.27,
38.000000,2514.02,3061.96,
39.000000,2480.47,3177,
40.000000,2416.35,2776.36,
41.000000,2086.07,2497.59,
42.000000,1991.98,2281.18,
43.000000,1699.44,2084.2,
44.000000,1560.6,1744.47,
45.000000,1375.94,1497.52,
46.000000,1279.64,1371.49,
47.000000,1204,1175.72,
48.000000,1189.45,1154.13,
49.000000,1129.7,1230.88,
50.000000,1154.6,1269,
51.000000,1237.92,1383.41,
52.000000,1368.6,1644.63,
53.000000,1613.4,1758.94,
54.000000,1761,1991.31,
55.000000,1840.98,2209.42,
56.000000,1957.1,2374.08,
57.000000,1988.69,2257.68,
58.000000,1927.14,2163.72,
59.000000,1807.98,1945.53,
60.000000,1653.13,1724.04,
61.000000,1525.88,1541.67,
62.000000,1395.02,1343.03,
63.000000,1288.88,1170.78,
64.000000,1152,1052.21,
65.000000,1099.97,949.016,
66.000000,1101.08,928.156,
67.000000,1021.91,909.988,
68.000000,1011.2,1073.02,
69.000000,1106.94,1199.6,
70.000000,1154.2,1399.44,
71.000000,1286.1,1681.92,
72.000000,1377.1,1978.95,
73.000000,1645.39,2027.42,
74.000000,1661.08,1924.16,
75.000000,1732.2,1655.29,
76.000000,1602.07,1535.65,
77.000000,1559.01,1340.5,
78.000000,1432.15,1285.11,
79.000000,1311.93,1048.06,
80.000000,1209.11,986.004,
81.000000,1090.05,885.192,
82.000000,1044.98,827.138,
83.000000,1005.38,790.248,
84.000000,957.063,794.088,
85.000000,960.906,820,
86.000000,983.88,955.16,
87.000000,1065.88,1105.98,
88.000000,1116.79,1373.15,
89.000000,1318.37,1566.62,
90.000000,1441.04,1614.55,
91.000000,1534.29,1619.56,
92.000000,1495.12,1519.05,
93.000000,1517.99,1461,
94.000000,1444.92,1324.93,
