Time [s],1000000000,1000000001,1000000002,1000000003,
0.000000,3983.72,3571.23,4399.32,6386.43,
1.000000,8019.28,8679.08,7559.43,12149.9,
2.000000,3605.96,3937.45,4359.8,5739.4,
3.000000,2743.15,2839.64,3256.56,4917.3,
4.000000,2232.68,2303.42,2616.98,3285.92,
5.000000,2021.58,2072.47,2335.8,2706.22,
6.000000,1844,2025.55,2138.46,2473.66,
7.000000,1833.32,1944.84,2061.44,2384.68,
8.000000,1613.48,1618.23,2014.96,2093.54,
9.000000,1891.18,1728.42,2256.87,2849.08,
10.000000,1843,1803.49,1649.16,5675.63,
11.000000,2028.4,2058.22,1884.25,5862.15,
12.000000,2839.14,2770.76,2526.8,8036.25,
13.000000,4134.05,4044.61,3368.95,10630.1,
14.000000,5145.89,5085.78,4480.8,12299.7,
15.000000,5053.58,5416.04,5183.44,10970.8,
16.000000,4225.92,4339.54,5304.71,7044.17,
17.000000,3594.75,4184.76,5040.07,4098.96,
18.000000,2767.47,2848.66,3662.32,2969.07,
19.000000,2523.54,2647.73,3381.58,2896.1,
20.000000,2569.16,2685.72,3330.61,2757.33,
21.000000,2522.37,2752.65,3144.55,2340.51,
22.000000,2306.6,2562.3,3291.79,1771.08,
23.000000,2008.21,2327.56,3473.69,1522.41,
24.000000,1648.74,1832.47,3388.9,1324.65,
25.000000,1804.56,2039.47,2836.35,1881.94,
26.000000,1725.67,1848.37,2282.47,2228.96,
27.000000,1612.4,1593.13,1701.92,2593.8,
28.000000,2101.99,2154.25,1988.24,4213.1,
29.000000,3171.88,3214.18,2703.06,6316.36,
30.000000,4036.7,4135.83,3466.75,7737.9,
31.000000,4374.56,4440.48,3939.4,5773.92,
32.000000,3597.29,3829,3966.53,3824.26,
33.000000,3187.82,3441.8,4234.24,2384.77,
34.000000,2440.27,2498.04,3072.25,1820.2,
35.000000,2029.46,2294.88,2795.44,1643.36,
36.000000,2046.28,2196.77,2799.19,1450.79,
37.000000,1856.33,2160.15,2827.97,1371,
38.000000,1642.84,1908.8,2726.69,1202.17,
39.000000,1529.31,1605.22,2564.65,1150.9,
40.000000,1341.17,1311.98,2053.24,1061.4,
41.000000,1401.31,1307.34,1810.14,1295.16,
42.000000,1434.96,1370.99,2086.03,1558.54,
43.000000,1288.48,1202.3,1584.23,1810.54,
44.000000,1698.26,1716,1848.1,3046.15,
45.000000,2595.44,2761.88,2853.55,5092.89,
46.000000,3654.55,3828.45,3889.75,6146.97,
47.000000,3651.92,3994.48,4383.47,4448.56,
48.000000,3167.4,3328.25,4011.66,3064.21,
49.000000,2828.2,2798.46,3982.31,2190.9,
50.000000,2183.21,2127.05,2880.28,1619.11,
51.000000,1756.66,1807.92,2403.64,1329,
52.000000,1646.44,1640.54,2306.21,1353.93,
53.000000,1613.6,1543.14,2218.52,1200.98,
54.000000,1400.46,1271.12,2046.8,1109.16,
55.000000,1234.02,1104.15,1761.01,1022.16,
56.000000,1132.51,909.752,1455.55,983.08,
57.000000,1109.88,936.883,1348.61,1042.04,
58.000000,1275.6,1018.72,1601,1126.82,
59.000000,1090.67,951.928,1260.52,1277.01,
60.000000,1738.9,1553.05,1718.02,2378.41,
61.000000,2814.6,2635.43,2913.97,3947.23,
62.000000,3736.95,3613.38,3926.34,5309.43,
63.000000,3623.82,3981.52,4504.49,4609.42,
64.000000,2914,3141.33,3870.38,3007,
65.000000,2540.06,2617.33,3636.53,2308.77,
66.000000,1849.84,2025.48,2708.57,1596.97,
67.000000,1498.15,1540.24,2139.94,1360.89,
68.000000,1336.92,1342.06,1923.19,1207.98,
69.000000,1327.12,1225.11,1832.46,1116.94,
70.000000,1262.94,1084.98,1689.5,1028.43,
71.000000,1109,941.064,1470.39,954.48,
72.000000,1012.97,815.296,1283.51,908.964,
73.000000,1008.81,829.12,1288,993.146,
74.000000,1115.55,853.904,1440.48,957.588,
75.000000,975.438,911.164,1140.18,1058.6,
76.000000,1459.15,1360.61,1532.52,1863.1,
77.000000,2363.34,2260.53,2666.44,3224.43,
78.000000,3307.48,3369.59,3717.84,4371.7,
79.000000,3335.53,3509.64,4437.84,4024.04,
80.000000,2627.07,2745.9,3660.6,2813.87,
81.000000,2330.83,2277.87,3424.83,2221.32,
82.000000,1831.23,1708.5,2614.51,1604.26,
83.000000,1465.96,1419.85,1995.81,1260.2,
84.000000,1278.65,1197.33,1822.18,1183.92,
85.000000,1233.04,1126.87,1704.17,1102.16,
86.000000,1146.97,1016.12,1577.87,991.212,
87.000000,1016.89,893.008,1446.93,944.905,
88.000000,925.886,792.916,1218.91,895.037,
89.000000,944.96,822.034,1256.98,905.958,
