Frame number,1000000000,1000000001,
0.000000,727.952,892.096,
1.000000,891.97,993.96,
2.000000,955.032,1057.16,
3.000000,928.076,1023.88,
4.000000,929.96,1010.9,
5.000000,874.95,990.826,
6.000000,809.024,851.109,
7.000000,708.905,766.065,
8.000000,690.008,807.102,
9.000000,658.034,703,
10.000000,610.039,701.921,
11.000000,597.008,639.98,
12.000000,591.056,631,
13.000000,547.007,623.088,
14.000000,563,630.96,
15.000000,547.896,647.1,
16.000000,566.992,646.022,
17.000000,623.98,731.012,
18.000000,709.032,785,
19.000000,785.045,932.124,
20.000000,876.964,974,
21.000000,838.88,1026.12,
22.000000,827.011,999.1,
23.000000,781.957,938.18,
24.000000,685.447,878.026,
25.000000,652.071,789.872,
26.000000,621.048,744.168,
27.000000,625.498,695.046,
28.000000,578.083,688.12,
29.000000,571.048,646.926,
30.000000,547.98,641.04,
31.000000,573.056,713.103,
32.000000,587.864,713.136,
33.000000,571.12,718,
34.000000,607.96,760,
35.000000,678.088,847.99,
36.000000,755.087,880.04,
37.000000,794.014,958.75,
38.000000,825.853,1051.03,
39.000000,834.11,1094.18,
40.000000,818.188,1059.84,
41.000000,795.978,989.842,
42.000000,759.936,892.96,
43.000000,709.114,904.1,
44.000000,641.956,829.522,
45.000000,653.949,781.998,
46.000000,601.996,744.946,
47.000000,610,767.464,
48.000000,585.952,755.102,
49.000000,590.1,750.461,
50.000000,597.04,771.947,
51.000000,614.05,770.886,
52.000000,653.09,777.004,
53.000000,665,781.067,
54.000000,773.161,771.896,
55.000000,803.496,874.585,
56.000000,758.87,932.186,
57.000000,773,935.04,
58.000000,768.032,875.936,
59.000000,708.984,896.96,
60.000000,716.064,837,
61.000000,700.932,849.028,
62.000000,668.563,811.064,
63.000000,601.064,784,
64.000000,620.012,753.92,
65.000000,609.504,726.944,
66.000000,587.05,734.9,
67.000000,574.996,741.988,
68.000000,562.964,748.092,
69.000000,562.992,668.955,
70.000000,566.016,693.134,
71.000000,641.047,683.01,
72.000000,648.096,705.952,
73.000000,648.947,722.02,
74.000000,683.02,747.079,
75.000000,690.933,765.988,
76.000000,655.88,758.158,
77.000000,643.983,747.176,
78.000000,622.995,740.132,
79.000000,585.024,730.032,
80.000000,588.031,732.944,
81.000000,603.03,712.975,
82.000000,609.966,731.008,
83.000000,562.547,714.05,
84.000000,574.593,688.925,
85.000000,560.052,699.926,
86.000000,549.047,651.044,
87.000000,550.97,664,
88.000000,552.502,675.094,
89.000000,566.949,691.046,
90.000000,580.049,679.977,
91.000000,588.562,697.902,
92.000000,606.045,708.048,
