Time [ms],1000000000,1000000001,1000000002,1000000003,
0,2454.55,2112.11,2043.22,2371.47,
1000000000,1388.7,1343.77,1143.2,1354,
2000000000,1063.21,869.044,806.109,980.787,
3000000000,1004.3,835.096,697.996,832.964,
4000000000,919.251,829.252,674.964,862,
5000000000,874.045,826.137,692.912,853.984,
6000000000,876.148,833.04,663.092,857,
7000000000,870.839,872.804,642.098,784.5,
8000000000,772.977,754.756,631.007,850.117,
9000000000,767.136,825.056,626.956,768.967,
10000000000,753.032,723.152,564.97,671.909,
11000000000,681.86,730.1,595.624,651.116,
12000000000,638.051,636.935,564.002,629.091,
13000000000,596.038,632.968,522.99,622,
14000000000,581.1,624.48,535.516,643.98,
15000000000,555.889,573.072,530.016,576.99,
16000000000,538.052,575.067,569.5,545.908,
17000000000,525.019,531.1,521.084,517.915,
18000000000,521.935,558.12,519.528,501.994,
19000000000,556.005,566,515.976,510.968,
20000000000,567.144,576.098,516.04,518.988,
21000000000,601.957,610.64,526.928,545.922,
22000000000,636.865,622.972,550.18,579.92,
23000000000,618.006,681.916,565.956,596.035,
24000000000,625.171,718.416,582.026,590.946,
25000000000,713.155,747.872,593.936,626.87,
26000000000,678.979,733.442,593.956,634.92,
27000000000,668.788,715.08,581.12,600.968,
28000000000,643.088,718.468,584.964,633.864,
29000000000,687.065,670.448,548.985,592.498,
30000000000,599.081,667.476,543.055,587.89,
31000000000,561.958,595.976,517.99,566.528,
32000000000,565.021,597.1,518.035,533.072,
33000000000,543.076,585.507,516.545,525.06,
34000000000,534.974,544.976,503.172,513.99,
35000000000,503.97,522.05,495,505.004,
36000000000,491.99,542.07,484.535,510.03,
37000000000,493.959,496.97,481.504,498,
38000000000,505.072,522.016,468.502,514.047,
39000000000,499.008,516.047,477.544,503.002,
40000000000,513.122,532.05,494.016,515.94,
41000000000,524.006,524.016,503.456,497.008,
42000000000,549.488,539.088,521.057,543.04,
43000000000,542.008,548.456,487.957,562.936,
44000000000,549.967,561.97,500.001,522.968,
45000000000,581.886,565.048,515.435,556.98,
46000000000,579.982,583.007,497.55,550,
47000000000,570.51,543.85,481.469,508.96,
48000000000,550.452,539.967,498.522,509.954,
49000000000,553.478,549.105,526.969,509.099,
50000000000,519.004,533.015,498.5,506.982,
51000000000,551.546,521.947,494,509.872,
52000000000,508.472,528.08,488.032,497.025,
53000000000,496.512,502.093,494.049,487.51,
54000000000,514.517,484.961,481.985,493.044,
55000000000,523.467,498.016,474.544,475.975,
56000000000,498.059,489.016,479.528,473.952,
57000000000,491,496.943,477.016,474.051,
58000000000,482.042,496.056,479.008,461.976,
59000000000,486.09,499.944,483.052,478.06,
60000000000,503.042,509.936,474.026,496.984,
61000000000,497.068,529.024,459.978,492,
62000000000,503.073,512.004,475.98,492.008,
63000000000,525.032,517.072,469.962,485.476,
64000000000,507.018,491.02,446.954,489.968,
65000000000,501.93,520.037,472.951,478.532,
66000000000,495.1,524.976,454.98,469.484,
67000000000,513.96,516.05,469.07,485.568,
68000000000,513,498.92,442.968,464.015,
69000000000,503.957,513.976,465.026,471.488,
70000000000,496.034,493.029,451.981,466.52,
71000000000,487.96,509.042,447.027,464.032,
72000000000,494.995,514.957,447.985,463.998,
73000000000,479.071,499.964,444.048,468,
74000000000,477.034,483.04,452.029,466,
75000000000,480.944,498,445.979,459.524,
76000000000,478.932,499.904,457.974,445.51,
77000000000,480,487.038,441.032,466.5,
78000000000,478.025,480.026,447.04,473.969,
79000000000,485.968,503.016,445,468.016,
80000000000,497.023,497.05,446.96,465.016,
81000000000,492.033,494.04,445.045,473.05,
82000000000,494.032,490.944,461.042,486.02,
83000000000,493.975,503.94,460.918,480,
84000000000,497.045,486.957,467.978,484.992,
85000000000,499.97,515.002,448.951,470.032,
86000000000,484.992,501.048,462.942,471.012,
87000000000,492.954,497,462.035,464.495,
88000000000,475.992,480.987,458.982,466.96,
89000000000,482.04,489.968,443.992,458.02,
90000000000,477.036,483.014,463.972,466.004,
91000000000,471,498.96,459.5,459.489,
92000000000,478.99,478.024,437.552,460.46,
93000000000,483.035,471.048,443.48,464.55,
94000000000,479.993,484,445.996,457,
95000000000,475.97,488.96,460.472,453.499,
