Frame number,1000000000,1000000001,1000000002,
0.000000,2069.79,2878.77,2672.5,
1.000000,1577.96,1993.86,1902.04,
2.000000,1880.42,2150.79,2197.86,
3.000000,2821.46,2868.18,2944.54,
4.000000,3706.83,3688.82,3693.6,
5.000000,3678.21,4070.52,3775.77,
6.000000,3817.29,3923.08,3377.34,
7.000000,3345.33,3423.79,2829.71,
8.000000,3173.26,3064.13,2411.68,
9.000000,2576.35,2496.54,2023.28,
10.000000,2074.19,2146.42,1676.83,
11.000000,1737.01,1871.71,1507.05,
12.000000,1548.17,1616.34,1313.88,
13.000000,1321.82,1397.61,1145.97,
14.000000,1224.09,1267.05,1059.05,
15.000000,1099.16,1159.86,962.97,
16.000000,1023.03,1099.77,954.931,
17.000000,1024.04,1054.14,1018.11,
18.000000,1087.92,1137.97,1176.21,
19.000000,1411.17,1408.19,1477.25,
20.000000,1868.04,1792.51,1814.32,
21.000000,2284.42,2085.32,1956,
22.000000,2447.28,2219.89,1913.9,
23.000000,2551.58,2314.3,1844.06,
24.000000,2566.22,2289.32,1808.92,
25.000000,2415.11,2136.16,1660.3,
26.000000,2215.16,2044.7,1592.26,
27.000000,1842,1802.56,1492.98,
28.000000,1720.69,1661.73,1389.86,
29.000000,1556.78,1476.77,1262.98,
30.000000,1497.17,1404.28,1210.19,
31.000000,1312.78,1318.71,1173.87,
32.000000,1302.84,1234.82,1092.06,
33.000000,1268.5,1210.22,1067.99,
34.000000,1269.98,1065.31,1066.1,
35.000000,1229.42,1055.12,1049.02,
36.000000,1312.89,1131.89,1157.1,
37.000000,1329.16,1194.04,1230.92,
38.000000,1572.49,1469.52,1359.13,
39.000000,1908.38,1608.53,1420.07,
40.000000,2028.91,1809.12,1461.73,
41.000000,2070.12,1968.56,1649.99,
42.000000,2250.63,1908.31,1661.82,
43.000000,2157.83,1929.09,1600.16,
44.000000,2104.93,1783.63,1545.72,
45.000000,2043.95,1725.42,1405.75,
46.000000,1890.12,1599.01,1424.67,
47.000000,1720.45,1545.02,1310.91,
48.000000,1583.37,1479.59,1271.62,
49.000000,1482.34,1419.51,1222.98,
50.000000,1460.03,1299.92,1130.16,
51.000000,1334.83,1259.97,1127.44,
52.000000,1226.16,1167.09,1078.06,
53.000000,1216.67,1123.56,1081.96,
54.000000,1170.39,1148.19,1104.3,
55.000000,1290.46,1148.52,1089.17,
56.000000,1488.48,1238.44,1179.29,
57.000000,1617.17,1298.01,1289.94,
58.000000,1767.89,1465.56,1269.82,
59.000000,1813.46,1583.71,1369.21,
60.000000,2067.06,1690.61,1430.75,
61.000000,1898.58,1615.08,1420.97,
62.000000,1813.99,1619.08,1353.97,
63.000000,1870.8,1622.72,1316.94,
64.000000,1699.45,1428.85,1268.79,
65.000000,1635,1382.29,1218.16,
66.000000,1503.53,1330.75,1171.76,
67.000000,1438.31,1271.99,1125,
68.000000,1371.58,1186.67,1117.2,
69.000000,1279.27,1123.63,1077,
70.000000,1325.21,1127.23,1005.85,
71.000000,1304.48,1121.18,1053.87,
72.000000,1396.14,1082.21,1065.1,
73.000000,1421.35,1106.93,1079.81,
74.000000,1439.47,1154.88,1096.22,
75.000000,1486.26,1185.76,1148.04,
76.000000,1530.63,1170.07,1141.79,
77.000000,1761.85,1216.42,1244.22,
78.000000,1810.27,1405.66,1220.97,
79.000000,1694.36,1374.33,1287.05,
80.000000,1542.58,1401.33,1255.21,
81.000000,1489.8,1397.75,1194.97,
82.000000,1424.78,1360.41,1146.12,
83.000000,1397.6,1357.09,1122.85,
84.000000,1325.15,1363.84,1098.99,
85.000000,1256.88,1310.18,1090.98,
86.000000,1265.5,1203.11,1011.89,
87.000000,1179.32,1236.95,1068.7,
88.000000,1206.48,1163.16,1026.83,
89.000000,1159.16,1173.29,1016.98,
90.000000,1174,1158.19,1002.04,
91.000000,1236.96,1166.4,1037.91,
92.000000,1327.48,1137.06,1046.48,
93.000000,1386.69,1145.17,1022.56,
94.000000,1529.4,1179.95,1048.95,
95.000000,1513.49,1152.87,1020.96,
