Frame number,1000000000,1000000001,
0.000000,9428.44,6878.1,
1.000000,3772.79,3679.6,
2.000000,6485.75,4135.67,
3.000000,7305.46,5056.3,
4.000000,7545.84,6044.25,
5.000000,9445.93,6317.73,
6.000000,6946.53,5913.68,
7.000000,4466.08,4382.7,
8.000000,3382.55,3160.52,
9.000000,2272,2426.71,
10.000000,1656.44,1873.42,
11.000000,1244.48,1543.52,
12.000000,1096.54,1308.61,
13.000000,971,1135.99,
14.000000,933,1090.52,
15.000000,937.046,1156.42,
16.000000,1048.94,1186.38,
17.000000,1386,1369.08,
18.000000,2278.06,1846.26,
19.000000,3382.3,2552.95,
20.000000,4309.28,3313.52,
21.000000,3942.23,3823.8,
22.000000,3013.76,3483.23,
23.000000,2238.87,3007.52,
24.000000,1662.91,2466.14,
25.000000,1244.4,1978.32,
26.000000,1042.46,1623.25,
27.000000,887.047,1340.04,
28.000000,777.024,1104.16,
29.000000,724.026,972.484,
30.000000,744.04,951.776,
31.000000,790.648,937.25,
32.000000,1059.69,1068.14,
33.000000,1556,1352.1,
34.000000,2228.12,1897.61,
35.000000,2736.34,2775.64,
36.000000,2747.75,3318.7,
37.000000,2339.58,2949.46,
38.000000,1981.76,2338.26,
39.000000,1575.09,1938.46,
40.000000,1363.09,1601.94,
41.000000,1113.07,1372.9,
42.000000,924.736,1182.98,
43.000000,820.536,998.43,
44.000000,772.12,874,
45.000000,770.06,804.19,
46.000000,821,794.56,
47.000000,1009.47,826.946,
48.000000,1382.46,1088.1,
49.000000,2039.66,1544.68,
50.000000,2638.5,2229.44,
51.000000,2582.07,2728.4,
52.000000,2113.02,2570.23,
53.000000,1743.44,2044.6,
54.000000,1477.44,1657.08,
55.000000,1207.44,1334.04,
56.000000,1008.43,1136.15,
57.000000,894.49,979.872,
58.000000,801,822.016,
59.000000,759.48,761.03,
60.000000,766.928,685.5,
61.000000,835.039,685,
62.000000,1080.08,754.024,
63.000000,1582.02,959.1,
64.000000,2186.01,1432.89,
65.000000,2653.43,2106.77,
66.000000,2427.75,2492.32,
67.000000,1977.51,2226.5,
68.000000,1572.13,1688,
69.000000,1324.03,1352.64,
70.000000,1107.08,1110.06,
71.000000,943.96,939.97,
72.000000,900.08,838.088,
73.000000,827.964,773.066,
74.000000,776,730.096,
75.000000,803.036,671.992,
76.000000,914.488,648.04,
77.000000,1118.99,695.022,
78.000000,1667.33,876.95,
79.000000,2376.8,1260.74,
80.000000,2622.77,1776.96,
81.000000,2357.95,2045.83,
82.000000,1795.65,1880,
83.000000,1453.83,1462.32,
84.000000,1201.05,1333.2,
85.000000,1035.02,1079.89,
86.000000,952.54,911.144,
87.000000,893.076,793.836,
88.000000,847.08,730.92,
89.000000,825.56,719.03,
90.000000,837.688,695.985,
91.000000,908.444,659.976,
92.000000,1242.57,668.976,
93.000000,1565.64,769.02,
94.000000,2292.38,1026.06,
95.000000,2607.29,1313.03,
