Time [ms],1000000000,1000000001,1000000002,
0,1565.82,1860.03,1274.02,
1000000000,1909,1244.86,1140.18,
2000000000,2413.92,1376.1,1508.89,
3000000000,3058.03,1420.5,2011.87,
4000000000,3614.85,1438.94,2272.28,
5000000000,4231.95,1540.03,2525.12,
6000000000,4118.94,1560.19,2466.21,
7000000000,4129.4,1650.88,2517.94,
8000000000,3852.88,1566.11,2473.8,
9000000000,3563.14,1593.99,2456.34,
10000000000,3112.24,1491.18,2287.16,
11000000000,2723.02,1261.76,2136.33,
12000000000,2451.82,1202.02,1976.18,
13000000000,2285.83,1055.99,1860.12,
14000000000,2002.59,1028,1800.7,
15000000000,1919.55,1031.07,1706.68,
16000000000,1845.03,959.936,1714.9,
17000000000,1844.11,1002.59,1699,
18000000000,1900.94,1004.54,1769.09,
19000000000,1981.47,1080.95,1812.98,
20000000000,2196.96,1068.81,1863.16,
21000000000,2219.17,1019.1,1712.08,
22000000000,2232.96,1202.98,1606.88,
23000000000,2412.02,1181.1,1636.15,
24000000000,2369.99,1139.93,1633.27,
25000000000,2273.08,1065.89,1653.72,
26000000000,2166,1046.98,1672,
27000000000,1999.02,961.981,1528.83,
28000000000,1865.06,928.89,1381.87,
29000000000,1746.02,879.052,1281.06,
30000000000,1585.1,906.068,1237.87,
31000000000,1569.02,874.109,1072.92,
32000000000,1511.91,857.05,1095.08,
33000000000,1493.48,851.96,1012.04,
34000000000,1537.94,879.964,1008.97,
35000000000,1648.52,859.06,1007.12,
36000000000,1632.47,869.04,936,
37000000000,1684.52,848.052,926.81,
38000000000,1770.48,898.996,946,
39000000000,1850.98,871.918,975.884,
40000000000,1849.5,839.107,1001.53,
41000000000,1782,815.049,1039.04,
42000000000,1678.93,860.924,992.436,
43000000000,1572.08,788.08,946.952,
44000000000,1488,768.016,909.912,
45000000000,1393.07,732.96,871,
46000000000,1324.45,720,830.982,
47000000000,1298.96,693.916,830.956,
48000000000,1243.04,700.032,774.016,
49000000000,1260,697.992,748.956,
50000000000,1273.01,720.984,728.11,
51000000000,1284.05,727.956,715,
52000000000,1292.96,732.936,718.025,
53000000000,1400.04,713.046,708.04,
54000000000,1460.96,724.936,695.03,
55000000000,1484.01,710,706.976,
56000000000,1503.94,715.96,733.984,
57000000000,1433.91,650.044,728.045,
58000000000,1364,663.962,729.044,
59000000000,1294.96,640.508,713.04,
60000000000,1251,612.96,709.004,
61000000000,1216.06,638.54,713.05,
62000000000,1188.92,615.512,690.996,
63000000000,1136.96,607.512,669.964,
64000000000,1120.05,596.957,654.999,
65000000000,1080.94,602,660.01,
66000000000,1125.02,589.482,636.992,
67000000000,1123.03,593.035,639.062,
68000000000,1169.05,613.96,645.496,
69000000000,1205.91,629.088,632.004,
70000000000,1270.03,611.058,632.562,
71000000000,1328.01,572.02,648.94,
72000000000,1341.02,619.952,666.96,
73000000000,1276.5,598,668.504,
74000000000,1246,598.008,650.528,
75000000000,1179,575.991,642.04,
76000000000,1119,578.004,640.12,
77000000000,1104.98,557.512,649.938,
78000000000,1059.99,552.951,642.013,
79000000000,1030.99,557.528,641.048,
80000000000,1017.02,551.48,601.96,
81000000000,995.998,553.976,611.964,
82000000000,996.868,561.016,575.02,
83000000000,993.952,544.5,592.06,
84000000000,1034.05,566.495,597.022,
85000000000,1086.98,572,594.982,
86000000000,1136.93,581.484,607.064,
87000000000,1173.97,566.99,602.072,
88000000000,1162.93,549.992,605.032,
89000000000,1154.95,571.012,603.984,
90000000000,1116.05,566.97,607.456,
91000000000,1109.06,539.009,581.988,
92000000000,1055,542.53,597.44,
93000000000,1028.47,529.472,591.972,
94000000000,1000.05,543.992,605.948,
95000000000,961.984,525.004,593.488,
