
Intensity Median
 ==================== 
Time [s],1000000000,1000000001,1000000002,1000000003,
0.000000,18238.7,19144.5,13278,18010.2,
1.000000,24548.6,22817.3,24470.2,17888,
2.000000,24786,18860.1,19339.4,14585.2,
3.000000,18262.2,15006.7,16569.5,12377.2,
4.000000,12606.8,10971.3,10951.1,10741.5,
5.000000,7041.67,7665.44,7232.73,9357.11,
6.000000,4638.4,6123.35,4439.28,8380.35,
7.000000,3640.1,4568.54,3469.2,7813.51,
8.000000,2937.36,3701.7,2599.66,6754.11,
9.000000,2233.23,3239.63,2323.26,5440.57,
10.000000,1960.9,2791.68,1904.66,5203.8,
11.000000,1643.66,2683.18,1826.78,4478.62,
12.000000,1425.8,2515.84,1708.82,3678.31,
13.000000,1499.8,2731.15,1705.39,3482.39,
14.000000,2200.41,3579.57,2788.61,3475.01,
15.000000,3577.79,5372.27,4845.44,4072.3,
16.000000,5194.32,7730.52,7690.79,5312.99,
17.000000,6637.83,9561.79,10220.6,6450.53,
18.000000,7258.18,10315.7,10539.3,7323.01,
19.000000,6639.18,8724.54,8789.71,7167.96,
20.000000,5195.99,6388.87,6486.98,5365.01,
21.000000,3535.01,4626.34,4546.98,4160.81,
22.000000,2718.15,3666.71,3408.24,3680.69,
23.000000,2197.66,2965.73,2775.63,3323.38,
24.000000,1843.86,2574.81,2194.24,3152.27,
25.000000,1655.16,2169.88,1903.96,2652.91,
26.000000,1441.68,2103.65,1601.73,2306.28,
27.000000,1317.72,1877.04,1454.22,1900.2,
28.000000,1246.77,1925.48,1372.17,1666.02,
29.000000,1235.8,2293.44,1607.56,1659.19,
30.000000,1326.08,2960.06,2073.06,1749.61,
31.000000,1543.82,3846.22,3082.04,2122.82,
32.000000,2173.69,5026.5,4176.9,2863.32,
33.000000,2768.27,6116.61,5231.56,3770.04,
34.000000,3095.85,6173.7,5612.89,4293.51,
35.000000,3458.5,5794,4990.64,4674.41,
36.000000,3597.57,4753.75,3945,4177.29,
37.000000,3080.69,3670.35,2990.57,3158.07,
38.000000,2433.23,2962.72,2366.76,2726,
39.000000,1959.95,2428.8,1923.59,2116.87,
40.000000,1638.92,2101.62,1696.87,1887.5,
41.000000,1311.81,1939.37,1517.99,1626.67,
42.000000,1132.42,1717.8,1364.44,1479.66,
43.000000,1110.76,1711.53,1277.75,1312.48,
44.000000,1039.05,1857.59,1319.61,1215.9,
45.000000,1115.79,2134.85,1596.14,1248.02,
46.000000,1189.01,2887,2113.34,1412.53,
47.000000,1337.43,3506.9,2707.91,1765.12,
48.000000,1505.38,4209.8,3441.58,2070.82,
49.000000,1880.92,4122.96,3869.59,2453.73,
50.000000,2058.01,4515.84,4075.61,2976.82,
51.000000,2259.54,4471.86,3786.4,3116.04,
52.000000,2530.27,4089.61,3201.35,3135.78,
53.000000,1962.04,3368.6,2563.58,2782.7,
54.000000,1607.35,2829.9,1985.16,2114.27,
55.000000,1840.71,2272.21,1624.84,1734.14,
56.000000,1482,1897.48,1386.26,1466.01,
57.000000,1264.64,1699,1213.88,1318.23,
58.000000,991.065,1689.46,1166.78,1148.06,
59.000000,937.04,1738.89,1269.05,1070.11,
60.000000,996.894,1953.51,1432,1175.34,
61.000000,999.913,2151.19,1734.69,1197.81,
62.000000,1078.99,2519.67,2104.57,1363.26,
63.000000,1172.3,2894.06,2476.75,1507,
64.000000,1325.62,3125.95,2865.56,1819.73,
65.000000,1558.28,3436.55,3076.52,2145.71,
66.000000,1737.72,3596.43,3226.07,2537.68,
67.000000,1907.31,3707.68,3114.72,2871.53,
68.000000,2017.4,3625.88,2812,2920.84,
69.000000,2039.04,3094.15,2373.26,2751.5,
70.000000,1802.64,2568.77,1920,2477.9,
71.000000,1669.56,2158.39,1581.42,2204,
72.000000,1295.01,1904.53,1322.24,1780.92,
73.000000,995.12,1735,1270.06,1363.23,
74.000000,924.94,1769.1,1194.05,1314.58,
75.000000,985.956,1737.61,1332.08,1338.78,
76.000000,1055,1880.55,1572.86,1242.19,
77.000000,1088.77,2059.79,1836.97,1245.7,
78.000000,1148.74,2310.23,1978.18,1263.66,
79.000000,1220.87,2357.1,2204.22,1239,
80.000000,1337.06,2552.42,2383.69,1377.35,
81.000000,1487.66,2842.25,2525.24,1589,
82.000000,1526.13,3192.1,2688.48,1773,
83.000000,1585.69,3410.87,2659.57,2082.43,
84.000000,1618.17,4021.24,2599.21,2353,
85.000000,1737.12,3970.42,2417.37,2321.75,
86.000000,1674.13,3378.67,1957.64,2407.83,
87.000000,1536.07,2984.23,1590.39,2295.32,
88.000000,1367.96,2464.72,1515.7,2006.1,
89.000000,1270.66,2169.43,1362.2,1916.27,
90.000000,1279.29,2210.11,1553.34,1718.68,
91.000000,1211.02,2068.83,1709.73,1647.45,
92.000000,1325.04,2217.24,1709.12,1450.99,
93.000000,1398.54,2010.88,1931.22,1353,
94.000000,1345.33,1947.3,2022.43,1300.09,
95.000000,1367.2,2069.14,2053.98,1254,
