Frame number,1000000000,1000000001,1000000002,1000000003,1000000004,1000000005,
0.000000,2025.22,2187.68,3528.57,3854.45,3013.5,3512.51,
1.000000,2097,2207.1,3651.44,4102.29,2477.46,4857.62,
2.000000,1973.54,2085.3,3752.75,3650.8,2275.13,4736.54,
3.000000,1765.97,2118.64,3412.13,3396.14,2158.25,3948.8,
4.000000,1678.32,1929.27,2940.73,3139.92,2046.12,3293.74,
5.000000,1769.77,1813.47,2635.54,2924.6,1965,2670.82,
6.000000,1826.52,1737.27,2421.38,2472,1932.87,2355.71,
7.000000,1854.82,1635.76,2416.29,2718.18,1853.72,2104.81,
8.000000,1956.7,1567.14,2300.12,3116.38,1682.74,1838.36,
9.000000,1846.98,1363.18,2222.26,2874.82,1504.98,1607.08,
10.000000,1727.94,1327.97,1738.14,2364.88,1289.92,1525.63,
11.000000,1367.3,1278.16,1425.04,1970.16,1178,1395.01,
12.000000,1222.04,1158.98,1355.01,1761.07,1128.88,1290.12,
13.000000,1289.75,1093.17,1502.66,1600.09,1190.02,1344.9,
14.000000,1748.39,1150.74,2119.61,1803.92,1391.1,1559.1,
15.000000,2361,1459.66,2996,2255.65,1752.75,2092.53,
16.000000,2484.95,1946.67,3543.97,2610.6,2087.22,2942.1,
17.000000,3342.92,2358,3177.93,2648.6,2375,3122.04,
18.000000,3182.62,2328.86,2631.29,2422.25,2637.2,2960.39,
19.000000,2860.98,1970.6,2220.49,2072.14,2281.73,2815,
20.000000,2309.37,1932.83,1748.83,1952,2125.95,2456.96,
21.000000,1967.04,1719.36,1514.23,1774,1838.25,2250.48,
22.000000,1580.54,1466.82,1288.08,1662.9,1536.48,1914.12,
23.000000,1368.3,1213.08,1143.22,1367.9,1262.02,1586.04,
24.000000,1129.24,1022.82,1026.98,1194.86,1119.06,1426.87,
25.000000,1117.42,994.88,979.2,1099.9,993.044,1280.76,
26.000000,1052.01,877.914,882.92,1010.99,932.126,1117.75,
27.000000,939.792,844.064,857.874,873.994,871.248,997.852,
28.000000,963.88,775.824,844.068,913.048,850,924.964,
29.000000,1044.02,819,848.965,836.984,937.875,869,
30.000000,1207.98,861.08,884.28,889.026,1171.85,948.122,
31.000000,1471.09,1091.15,1067,948.312,1564.3,1055.45,
32.000000,1713.67,1260.76,1255.25,1114.25,1881.15,1372.93,
33.000000,1832.92,1503,1466.57,1281.98,2252.24,1622.77,
34.000000,2010,1599.1,1498.19,1447.11,2179.09,1884.5,
35.000000,1897.62,1670.1,1356.78,1507.55,2169.04,1859.82,
36.000000,1886.43,1690,1408.36,1499.4,1817.89,1918.22,
37.000000,1687.72,1556.36,1328.57,1373.89,1707.95,1793.7,
38.000000,1545.3,1278.31,1224.44,1321.25,1494.09,1533.38,
39.000000,1362.14,1189.19,1229.67,1107.04,1221.96,1397,
40.000000,1211.89,1080.18,1111.33,1086.04,1182.86,1379.24,
41.000000,1134.23,1069.24,1123.76,1044.98,1027.96,1209.46,
42.000000,1087.04,975.912,1063.2,968.108,956.912,1211.36,
43.000000,1012.59,881.954,1039.99,957.052,892.006,1090.98,
44.000000,945.952,861.971,972.908,920.032,849.912,1036.21,
45.000000,906.568,758.96,951.024,860.96,850.96,980.918,
46.000000,931.478,763.992,950.862,861.1,900.056,981.02,
47.000000,1001.85,819.23,1010.98,893.954,995.016,1022.67,
48.000000,1080.01,911.978,1079,914.92,1123,1083.05,
49.000000,1153.15,1013.22,1129.28,975.02,1445.32,1112.09,
50.000000,1188.06,1124.16,1133.8,988.944,1502.84,1246.42,
51.000000,1225.79,1218.2,1188.39,1113.89,1587.88,1384.48,
52.000000,1236.17,1182.36,1167.07,1105.07,1481.98,1441.59,
53.000000,1170.06,1083.43,1208.19,1088,1401.25,1396.28,
54.000000,1097.2,1070.89,1079.89,1000.91,1302.96,1365.56,
55.000000,1054.05,993.214,1038.89,975.038,1247.05,1222,
56.000000,1040.06,904.096,999.98,940.944,1124.86,1212.85,
57.000000,983.841,909.976,956,925.012,1090.98,1128.7,
58.000000,958.095,870,932.946,882.956,1033.21,1051.84,
59.000000,922.89,818.784,881.128,828,1019.88,1020.78,
60.000000,880.032,740.132,857.784,806.024,971.947,1000.29,
61.000000,870.082,731.214,835.132,774.008,910.92,940.864,
62.000000,836.906,700.944,819.088,798.949,925,911.99,
63.000000,815.198,696.076,857.075,787,900.096,916.188,
64.000000,825.955,702.084,829.08,770,910.992,892.2,
65.000000,822.488,690.214,859.928,823.9,929.038,911.784,
66.000000,886.968,724.12,861.24,789.033,979.024,975.1,
67.000000,918.5,727.044,906.384,832,1100,999.094,
68.000000,941.484,782.92,869.048,821.924,1126.11,1057.73,
69.000000,1016.59,794.016,929.896,901.91,1138,1116.87,
70.000000,1011,797.184,1010.8,850.12,1149.94,1203.97,
71.000000,1031.71,833.112,1053.14,867.932,1126.15,1162.92,
72.000000,1084.75,825.306,1046.26,908.06,1166,1195.06,
73.000000,1105.19,790.96,983.232,879.08,1087.91,1138.18,
74.000000,1085.12,782.084,1011,879,1057,1180,
75.000000,1066.7,791.906,999.16,876.067,1067.9,1157.26,
76.000000,985.972,760.016,971.312,845.9,1013.12,1118.13,
77.000000,972.83,742.108,924.9,811.864,959.04,1075.93,
78.000000,951.036,773.9,938,814.05,943,1015.17,
79.000000,885.975,713.972,870.958,811.04,899.068,1020.18,
80.000000,869.92,721.096,873.016,800.072,887.064,968.306,
81.000000,869.979,738.9,852.06,794.06,894,984.964,
82.000000,841.976,750.036,843.94,797.978,920.904,979.176,
83.000000,884.002,747.062,848,774.96,870.992,951.092,
84.000000,859.948,750.048,817.064,805.072,883.968,995.16,
85.000000,858.085,771.016,811.064,802.912,940.03,993.48,
86.000000,844,796.06,845.112,818.1,981.168,990.036,
87.000000,868.016,772.04,839.96,834.136,1016.12,1017,
88.000000,890.09,785.08,854.012,846.036,1009.07,1050.3,
89.000000,946.952,839.212,881.144,846.976,1049.07,1071.31,
90.000000,956.96,823.048,880.888,841,989.028,1007,
91.000000,983.932,880.076,851.012,847.068,1037,1082.12,
92.000000,1017.2,853.916,865.184,830.048,1033.89,1093.92,
93.000000,995.058,903.122,892.052,805.096,988.847,1032.16,
