Frame number,1000000000,1000000001,
0.000000,3477.83,2917.06,
1.000000,4388.77,2666.01,
2.000000,4509.21,2909.32,
3.000000,5963.6,3824.9,
4.000000,6599.63,4636.14,
5.000000,5631.45,3998.28,
6.000000,4497.89,3078.12,
7.000000,4144.19,2605.55,
8.000000,3507,2376.96,
9.000000,2975.9,2034.06,
10.000000,2945.09,1733.95,
11.000000,2495.39,1493.6,
12.000000,2159.39,1419.22,
13.000000,1794.92,1274.79,
14.000000,1606.4,1210.08,
15.000000,1429.4,1148.01,
16.000000,1356.49,1105.94,
17.000000,1362.38,1082,
18.000000,1545.2,1133.03,
19.000000,1880.48,1402.02,
20.000000,2565.17,1842.94,
21.000000,2965.07,2410.14,
22.000000,3064.58,2916.76,
23.000000,2780.17,2819.04,
24.000000,2455.31,2562,
25.000000,2155.6,2143.02,
26.000000,2005.71,1821.22,
27.000000,1755.2,1551.16,
28.000000,1533.99,1351.18,
29.000000,1343.01,1215.91,
30.000000,1241.3,1130.04,
31.000000,1166.76,1040.63,
32.000000,1051.21,1022.89,
33.000000,1132.13,930.064,
34.000000,1210.09,927.1,
35.000000,1263.83,935.066,
36.000000,1479.94,1007.87,
37.000000,1558.8,1066.12,
38.000000,1816.67,1248.96,
39.000000,2151.15,1612,
40.000000,2427.38,1994.28,
41.000000,2280.43,2180.2,
42.000000,1985.47,2271.98,
43.000000,1739.47,1972.81,
44.000000,1529.02,1792.04,
45.000000,1407.77,1539.02,
46.000000,1213.23,1319.92,
47.000000,1083.86,1173.04,
48.000000,1022.08,1040.5,
49.000000,972.966,970.538,
50.000000,947.044,941.98,
51.000000,1072.04,900.996,
52.000000,1081.04,912.872,
53.000000,1195.27,872.008,
54.000000,1143.96,890.468,
55.000000,1306.97,916,
56.000000,1504.13,1077.99,
57.000000,1779.32,1310.08,
58.000000,1823.48,1673,
59.000000,1767.92,2007.8,
60.000000,1949.12,2090.75,
61.000000,1715.88,2021.27,
62.000000,1407.98,1832.14,
63.000000,1233.79,1550.92,
64.000000,1122.06,1405.22,
65.000000,1036.88,1207.97,
66.000000,969.031,1042.16,
67.000000,927.044,981.032,
68.000000,864.83,950.008,
69.000000,911.761,946.944,
70.000000,936.85,904.92,
71.000000,920.04,866.966,
72.000000,943.074,843.024,
73.000000,1093.1,844.928,
74.000000,1318.82,899.916,
75.000000,1861.14,1101.1,
76.000000,2062.31,1441,
77.000000,2017.28,1834.26,
78.000000,1943,2033.64,
79.000000,1715.19,2043.43,
80.000000,1442.93,1884.22,
81.000000,1253.8,1665.09,
82.000000,1214.88,1405.92,
83.000000,999.96,1320.03,
84.000000,946.064,1188.7,
85.000000,935.114,1083.51,
86.000000,955.826,979.98,
87.000000,884.706,908.449,
88.000000,821.25,853.132,
89.000000,813.75,824.544,
90.000000,945.101,779.508,
91.000000,1100.97,801.492,
92.000000,1431.24,852,
93.000000,1694.03,986.416,
94.000000,1835.18,1190.44,
