
Intensity Median
 ==================== 
Time [s],1000000000,1000000001,1000000002,
0.000000,482.952,563.52,661.695,
1.000000,478.004,583.176,578.082,
2.000000,479.036,512.974,596.912,
3.000000,465.552,537.081,605.991,
4.000000,494.059,573.132,634.06,
5.000000,580.097,668.112,807.677,
6.000000,637.807,658.744,821.109,
7.000000,613.518,675.81,736.634,
8.000000,681,661.794,719.11,
9.000000,699.696,658.452,719.816,
10.000000,697.25,713.808,683.756,
11.000000,640.672,699.762,741.641,
12.000000,618.944,756.557,732.16,
13.000000,622.19,689.507,719.113,
14.000000,588.769,649.413,738.146,
15.000000,524.99,583.703,588.152,
16.000000,550.111,584.794,587.5,
17.000000,504.924,602.62,556.864,
18.000000,508.023,573.971,582.1,
19.000000,487.998,553.829,584.94,
20.000000,477.02,540.741,580.976,
21.000000,498.035,552.34,548.98,
22.000000,503.989,589.839,620.003,
23.000000,575.999,674.911,739.474,
24.000000,574.241,744.019,831.91,
25.000000,612.174,863.514,947.634,
26.000000,622.81,822.375,989.592,
27.000000,630.252,714.563,1073.1,
28.000000,622.149,686.261,973.05,
29.000000,595.04,687.33,968.04,
30.000000,584.9,633.968,811.341,
31.000000,555.775,633.687,676.272,
32.000000,550.43,630.584,680.093,
33.000000,543.552,613.264,634.489,
34.000000,516.932,563.607,619.055,
35.000000,531.025,584.058,596.814,
36.000000,504.92,541.858,597.185,
37.000000,501.022,525.56,573.77,
38.000000,498.015,553.552,544.16,
39.000000,498.025,543.532,512.172,
40.000000,543.436,544.027,549.192,
41.000000,539.534,584.003,613.76,
42.000000,546.04,643.863,630.02,
43.000000,568.02,634.288,804.74,
44.000000,589.856,656.414,659.145,
45.000000,564.928,698.36,682.549,
46.000000,569.076,771.513,747.312,
47.000000,583.872,718.08,701.41,
48.000000,615.952,703.588,688.768,
49.000000,597.936,739.37,656.715,
50.000000,599.404,708.451,671.817,
51.000000,547.984,664.544,632.104,
52.000000,519.956,604.268,628.845,
53.000000,498.086,592.109,616.687,
54.000000,527.6,560.102,576.106,
55.000000,488.476,529.946,584.895,
56.000000,508.094,552.84,583.942,
57.000000,479.885,568.269,575.01,
58.000000,507.076,573.09,588.211,
59.000000,544.12,613.284,630.685,
60.000000,525.04,679,691.997,
61.000000,542.4,721.03,708.254,
62.000000,541.869,698.822,800.092,
63.000000,584.012,711.312,750.151,
64.000000,534.224,747.042,693.485,
65.000000,551.194,743.658,700.995,
66.000000,551.959,639.18,675.094,
67.000000,536.036,619.278,699.272,
68.000000,545.201,651.86,623.182,
69.000000,549.14,596.966,686.303,
70.000000,529.2,599.136,615.297,
71.000000,497.092,578.92,576.22,
72.000000,488.112,553.95,641.008,
73.000000,499.996,538.864,602.107,
74.000000,498.008,566.104,596.002,
75.000000,503.922,584.832,656.262,
76.000000,528.04,599.024,691.136,
77.000000,543.12,659.3,645.34,
78.000000,503.862,609.64,668.564,
79.000000,545.95,679.784,664.368,
80.000000,522.238,666.9,685.84,
81.000000,533.288,666.848,687.36,
82.000000,519.033,678.94,757.012,
83.000000,508.917,659.936,677.424,
84.000000,505.994,564.976,678.52,
85.000000,546.079,583.43,594.56,
86.000000,534.068,546.946,593.418,
87.000000,518.559,555.838,639.138,
88.000000,500.46,556.08,601.42,
89.000000,486.52,543.951,592.456,
90.000000,503.927,552.119,600.5,
91.000000,493.5,561.872,592.94,
92.000000,484.44,548.97,673.96,
93.000000,501.174,581.124,603.048,
94.000000,508.072,573.008,717.748,
95.000000,498.954,582.092,736.008,
