Time [ms],1000000000,1000000001,1000000002,1000000003,1000000004,1000000005,
0,555.963,614.996,593.49,593.92,544.96,525.97,
1000000000,510.08,506.12,552.971,574.188,489.929,514.961,
2000000000,500.92,459.18,580.976,648.19,511.052,511.984,
3000000000,486.003,571.074,550.42,587.104,553.92,556.992,
4000000000,525.89,633.884,551.872,608.22,543.936,578.092,
5000000000,533.976,556.03,562.464,527.256,570.979,585.865,
6000000000,509.065,498.512,556.053,553.08,567.935,575.897,
7000000000,504.961,518.96,546.064,544.905,540.56,558.13,
8000000000,531.011,534.011,512.036,530.08,538.94,546.878,
9000000000,520.924,554.064,475.059,537.182,535.052,505.98,
10000000000,562.092,508.084,506.042,533.915,537.902,508.956,
11000000000,548,529.403,520.562,536.968,520.017,494.048,
12000000000,516.04,507.504,534.85,530.03,525.484,502.008,
13000000000,479.928,500.986,487,513,504.952,467.064,
14000000000,473.906,498.96,478.152,510.975,479.064,467.032,
15000000000,501.042,477.09,482.024,481.966,476.964,470.89,
16000000000,501.596,517.942,472.968,480.994,475.472,499.072,
17000000000,481.046,504.048,451.934,519.915,483.508,499.068,
18000000000,519.9,508.552,485.928,525.92,492.5,490.923,
19000000000,512,511.953,487.016,507.582,469.988,501.028,
20000000000,512,528.98,474.98,514.996,489.924,498.969,
21000000000,487.89,504.214,459.993,510.07,505.056,512.46,
22000000000,532.954,518.915,464.077,478.992,498.04,511.196,
23000000000,497.922,507.059,469.004,509.968,492,494.019,
24000000000,528.984,489.017,475.988,486.015,492.938,497.5,
25000000000,483.082,484.928,477.023,488.48,486.03,492.518,
26000000000,515.09,480.082,473.004,469.04,478.078,530.097,
27000000000,507.04,464.536,450.048,463.064,460.05,470.078,
28000000000,470.035,458.038,448.042,466.01,457.04,476.002,
29000000000,484.112,477.57,449.508,469.96,468.924,504.939,
30000000000,481.966,460.469,455.504,464,444.1,503.988,
31000000000,482.056,457.48,448.524,457.982,466.948,481.64,
32000000000,465.118,455.55,451.516,453.018,439.076,476.922,
33000000000,466.464,471.003,439.92,452.96,449.496,477.997,
34000000000,482.98,479.995,458.007,474.962,446.992,500.057,
35000000000,470.922,472.492,467.976,476.032,441.006,526.952,
36000000000,478.625,493.52,451.948,492.976,461.025,579.922,
37000000000,489.519,473.478,459.52,496.035,465.972,550.52,
38000000000,490.484,488.103,453.038,516.985,459.957,536.959,
39000000000,485.152,499.063,460.992,502.937,449.068,533.1,
40000000000,491.085,492.102,454.019,478.032,462.005,527.987,
41000000000,473.517,491.02,456.964,482.042,450.067,514.008,
42000000000,466.05,481.923,435.98,473.924,451.064,485.936,
43000000000,446.528,469.045,442.076,469.92,448.037,471.524,
44000000000,460.554,470.978,435.51,453.99,447.984,448.52,
45000000000,455.46,467.976,445.492,459.97,446.972,445.017,
46000000000,449.05,472.956,444.05,458.946,441.032,457.026,
47000000000,455.536,475.968,442.53,462.02,443.988,452.984,
48000000000,453.001,463.058,432.976,450.92,447.948,443.528,
49000000000,456.017,467.006,443.005,459.965,436.016,452.995,
50000000000,466.977,459.956,447.004,472.005,438.99,445.563,
51000000000,451.986,465.904,435.928,468.507,442.025,443.546,
52000000000,468.057,493.098,443.004,481.976,450.044,461.508,
53000000000,457.982,476.96,441.006,508.544,453.016,460.036,
54000000000,486.05,493.976,446.93,481.021,447.975,462.496,
55000000000,451.069,484.078,442.05,486.5,453.425,472.6,
56000000000,457.054,478.895,439.005,507.06,449.487,456.973,
57000000000,472.944,457.976,439.988,517.97,434.612,465.448,
58000000000,467.962,484.061,452.508,505.095,437.012,440.984,
59000000000,463.031,479.956,439.967,494.104,440.492,459.921,
60000000000,458.103,464.994,437.456,492.93,453.98,456.498,
61000000000,457.974,472.019,445.982,498.922,442.97,458.024,
62000000000,457.99,453.03,434.024,488.944,446.063,453.912,
63000000000,450.012,455.039,437,477.055,442.955,466.067,
64000000000,446.999,455.986,436.944,481.009,435.968,445.964,
65000000000,452.976,445.934,434.994,477.981,440.996,453.052,
66000000000,440.063,459.952,434.016,485.997,434.954,446.03,
67000000000,457.955,455.026,447.999,469.924,434.04,463.987,
68000000000,474.083,473.05,430.001,475.027,440.944,449.013,
69000000000,478.951,464.03,449.027,479.963,434.993,452.986,
70000000000,465.968,496.94,439.02,486.95,438.989,457.945,
71000000000,473,492.05,442.946,489.08,450.072,457.936,
72000000000,461,470.913,435.026,484.96,454.516,462.994,
73000000000,453.888,489.99,439.05,488.966,459.485,476.928,
74000000000,452.903,451,435.016,477.076,457.981,437.945,
75000000000,455.055,454.03,428.054,487.992,454.504,459.959,
76000000000,458.925,449.512,436.992,471,452.5,460.899,
77000000000,452.91,452.483,436.968,479.079,445.02,462.054,
78000000000,451.06,456.98,438.04,474.035,450.5,458.064,
79000000000,447.952,450.894,428.032,470.965,440.486,466.062,
80000000000,458.006,445.996,427.983,475.05,439.024,445.072,
81000000000,437.025,454.025,432.95,465.953,447.016,462.03,
82000000000,464.988,443.995,429.01,478.005,445.96,466.091,
83000000000,462.98,452.984,436.964,477.03,444.956,456.104,
84000000000,466.528,458.06,438.006,462.018,448.992,475.062,
85000000000,456.021,456,430.993,483.065,446.016,469.878,
86000000000,440.932,441.99,429.992,485.968,445.512,445.053,
87000000000,443.946,448.989,438.484,487.021,445.488,462.086,
88000000000,441.07,444.504,434.96,479.032,442.488,448.949,
89000000000,446.975,444.512,441.022,474.013,444.956,472.102,
90000000000,437.997,441.976,433.52,468.988,447.548,441.062,
91000000000,450.036,437.98,438.488,469.074,439.484,445.052,
92000000000,447.006,445.504,442.968,469.947,444.968,450.982,
93000000000,440.042,446.984,425.997,464.948,444.98,440.074,
94000000000,437.951,440.97,435.017,447.967,436.054,456.027,
95000000000,439.005,433.971,436.98,463.915,445.96,444.946,
