Time [ms],1000000000,
0,471.982,
1000000000,452.991,
2000000000,441.976,
3000000000,448.04,
4000000000,463.99,
5000000000,477.04,
6000000000,476.982,
7000000000,472.975,
8000000000,474.036,
9000000000,459.972,
10000000000,459.997,
11000000000,449.97,
12000000000,433.014,
13000000000,432.044,
14000000000,441.01,
15000000000,434.032,
16000000000,426.952,
17000000000,432.004,
18000000000,432.966,
19000000000,439.512,
20000000000,433,
21000000000,435.972,
22000000000,436.986,
23000000000,443.952,
24000000000,428.989,
25000000000,445.522,
26000000000,431,
27000000000,432.988,
28000000000,441.042,
29000000000,434.48,
30000000000,436.492,
31000000000,439.52,
32000000000,430.992,
33000000000,430.488,
34000000000,434.988,
35000000000,425.034,
36000000000,429.476,
37000000000,421.017,
38000000000,423.492,
39000000000,433.04,
40000000000,427.496,
41000000000,435,
42000000000,441.496,
43000000000,429.48,
44000000000,434.504,
45000000000,433.532,
46000000000,428.514,
47000000000,417.492,
48000000000,420.992,
49000000000,428.004,
50000000000,430.992,
51000000000,428.528,
52000000000,425.496,
53000000000,429.944,
54000000000,441.512,
55000000000,432.996,
56000000000,433.024,
57000000000,427.494,
58000000000,436.504,
59000000000,423.488,
60000000000,426.504,
61000000000,423.016,
62000000000,430.972,
63000000000,430.96,
64000000000,429.96,
65000000000,428.506,
66000000000,428.504,
67000000000,427.996,
68000000000,425,
69000000000,420.984,
70000000000,419.508,
71000000000,423.02,
72000000000,421.484,
73000000000,422.985,
74000000000,429.01,
75000000000,425.552,
76000000000,415.48,
77000000000,421.532,
78000000000,419.507,
79000000000,418.532,
80000000000,429.021,
81000000000,429.504,
82000000000,428.504,
83000000000,418.984,
84000000000,419.512,
85000000000,420.982,
86000000000,423.004,
87000000000,427.495,
88000000000,433.008,
89000000000,425.488,
90000000000,427.996,
91000000000,430.976,
92000000000,418.984,
93000000000,418.488,
94000000000,422.016,
95000000000,426.984,
