Time [ms],1000000000,1000000001,1000000002,1000000003,
0,2238.69,1483.28,2817.86,2108.56,
1000000000,1850.22,1317.13,2121.04,1695.33,
2000000000,1662.3,1274.15,1452,1550.45,
3000000000,1622.46,1269.28,1623,1557.97,
4000000000,1485.99,1032.2,1462.07,1424.33,
5000000000,1332.09,980,1356,1346.17,
6000000000,1239.22,946,1178.37,1166.06,
7000000000,1112.94,957,1065.77,1198.74,
8000000000,1067.06,996.164,1075.22,1025.04,
9000000000,942.051,964.138,1084.22,950.292,
10000000000,915.118,827.808,1010.92,862.125,
11000000000,782.14,777,965.072,848.85,
12000000000,731.141,679.93,867.056,751.091,
13000000000,649.898,621.963,747.008,789.945,
14000000000,640.06,611.5,720.107,684.05,
15000000000,608.056,610.468,705.03,725.065,
16000000000,652.088,654.913,733.1,752.964,
17000000000,683.916,707.025,815.869,754.44,
18000000000,750.16,718.176,938.152,918.005,
19000000000,833.968,851.814,1151,1068.08,
20000000000,909.217,855.208,1186.07,1232.76,
21000000000,954.163,957.008,1239.16,1200.84,
22000000000,959.009,906,1213.23,1141.91,
23000000000,933,967.076,1046.06,1084.93,
24000000000,831.101,880.952,959.06,991.06,
25000000000,776.968,785.128,848.096,828.002,
26000000000,745.106,730.25,767.483,732.528,
27000000000,701.122,714.184,733.844,766.068,
28000000000,622.019,661.982,665.03,722.969,
29000000000,633.128,636.92,645.5,642.964,
30000000000,574.084,583.955,634.952,615.52,
31000000000,554.08,573,605.032,594.454,
32000000000,567.034,550.96,613.992,585.092,
33000000000,529.013,527.952,590.064,562.002,
34000000000,549.932,540.028,611.032,572.967,
35000000000,548,553.04,592.024,557.046,
36000000000,602.032,579.992,665.092,587.506,
37000000000,631.017,606.06,675.04,630.973,
38000000000,716.024,678,771.976,693.931,
39000000000,743.966,727,870,738.975,
40000000000,817.056,803.036,962.88,793.976,
41000000000,833.952,813.478,969.064,798.077,
42000000000,789.99,776.968,918.056,775.99,
43000000000,716.122,762.852,873.796,744.063,
44000000000,678.148,684.953,797.96,680.909,
45000000000,628.072,621.024,801,652.995,
46000000000,615.91,615.038,687.024,638.49,
47000000000,561.941,609.084,639.01,613.019,
48000000000,562.968,604.988,634.016,584.999,
49000000000,552.51,540.963,606.944,574.963,
50000000000,537.009,534.494,588,559.966,
51000000000,502.946,547.528,573.04,554.004,
52000000000,513.436,519.96,539.09,535.994,
53000000000,514.008,509,536.924,553.04,
54000000000,531.072,530.984,526.064,572.957,
55000000000,540.512,561.948,551.952,616.04,
56000000000,583.068,607.936,593.026,648.028,
57000000000,650.102,618.04,650.064,656.943,
58000000000,647.03,674.5,696.02,722.95,
59000000000,699.081,711.986,696.885,771.552,
60000000000,725.923,740.892,741.922,759.088,
61000000000,673.968,705.108,761.98,727.059,
62000000000,675.062,673,709.106,687.995,
63000000000,582.028,651.048,660.944,648.986,
64000000000,596.07,585.024,664.004,594.996,
65000000000,558.96,561.048,640.04,569,
66000000000,559.067,545.026,627.002,565.456,
67000000000,518.475,547.02,561.045,541.964,
68000000000,534.996,544.96,566,538.06,
69000000000,514.5,517,552.492,546.52,
70000000000,500.025,515.032,551.972,550.02,
71000000000,516.983,528.98,564.02,545.486,
72000000000,537.984,530.975,554.5,553.98,
73000000000,533.54,529.004,591.532,571.036,
74000000000,568.12,532.088,589.98,588.08,
75000000000,576.056,574.048,617.084,640.036,
76000000000,588.936,554.995,594.06,625.848,
77000000000,605.052,573.012,629.08,666.08,
78000000000,600.055,610.952,658.996,671.976,
79000000000,618.086,606.08,690.96,657.984,
80000000000,635.901,626,668.016,633.952,
81000000000,607.091,617.024,644.992,614.504,
82000000000,587.02,588.98,604.04,576.002,
83000000000,543.993,566,596.08,557.032,
84000000000,534.925,555.041,580.96,551.472,
85000000000,495,543.104,574,543.04,
86000000000,508.932,553,558.028,526.492,
87000000000,511.009,527.03,537.964,542.008,
88000000000,524.063,536.02,537.04,524.52,
89000000000,519.031,529.928,535,546.491,
90000000000,530.959,537.99,516.008,534.508,
91000000000,526,520.024,508.99,540.492,
92000000000,530.884,527.97,504.022,553.02,
