Frame number,1000000000,1000000001,1000000002,1000000003,1000000004,1000000005,1000000006,1000000007,
0.000000,618.188,552.027,632.448,568.916,559.06,664.08,612.144,544.928,
1.000000,504.864,481.992,602.92,513.064,578.816,479.92,571.176,483.95,
2.000000,519.1,578.5,662.04,602.112,655.648,498.85,629.054,534.61,
3.000000,571.124,613.98,731.754,706.255,766.85,522.843,668.334,616.649,
4.000000,567.276,576.554,735.84,647.144,729.122,543.907,723.176,579.012,
5.000000,567.096,538.6,681.525,638.204,703.359,510.154,617,551.404,
6.000000,525.092,531.42,665.698,617.162,602.416,514.984,654.905,535.82,
7.000000,544,506.045,590.9,558.142,543.418,495.5,584.688,489.27,
8.000000,478.008,507.04,542.138,491.086,505.502,469.48,613.993,482.915,
9.000000,485.06,465.992,526.134,527.012,484.91,450.006,561.154,473.069,
10.000000,484.98,478.916,529.894,523.992,482,446.492,549.878,445.064,
11.000000,511.01,493.92,519.964,491.032,483.94,441.5,571.032,460.075,
12.000000,510.138,491.416,522.06,479.458,479.252,430.062,515.036,443.972,
13.000000,517.992,510.072,534.928,472.55,469.9,456.052,538.915,449.058,
14.000000,473.42,501.545,530.92,485.03,487.54,435.989,529.01,447.084,
15.000000,508.424,527.04,521.776,518.906,507.496,447.003,531.024,458.063,
16.000000,528.04,524.904,599.856,516.104,508.6,462.52,606.398,477.059,
17.000000,523.6,593.116,675.056,546.882,635.552,509.984,692.486,510.038,
18.000000,565.073,668.192,733.592,622.85,791.636,490.965,794.033,529.991,
19.000000,631.918,815.024,799.948,751.258,853.44,524.143,929.78,587.09,
20.000000,645.266,824.952,945.525,768.852,962.068,577.58,864.921,632.933,
21.000000,669.1,785.24,887.35,763.75,1054.41,594.348,796.714,661.937,
22.000000,679.586,783.112,826.391,771.988,993.238,556.75,752.148,670.924,
23.000000,631.936,667.268,844.252,760.914,982.804,576.911,687.14,623.144,
24.000000,651.436,695.544,797.701,720.242,853.584,576.16,667.848,611.035,
25.000000,625.106,623.168,735.49,657.854,755.508,602.586,702.172,613.792,
26.000000,590.002,567.58,702.84,663.072,666,550.09,675.904,596.114,
27.000000,557.088,544.068,670.01,622.05,653.1,582.14,610.842,570.312,
28.000000,555.116,526.546,674.068,588.988,615.044,556.403,601.848,552.078,
29.000000,557.969,520.568,648.842,573.11,593.148,528.506,592.86,551.101,
30.000000,523.942,505.556,623.852,578.766,567.5,505.08,587.896,558.992,
31.000000,541.922,549.519,631.06,613.945,584,507.552,580.964,531.24,
32.000000,573.16,578.56,585.892,670.808,609.5,514.024,669.088,561.107,
33.000000,576.25,615.94,626.7,782.271,699.632,551.928,728.105,598.148,
34.000000,647.067,653.056,880.95,791.256,768.51,570.518,888.94,605.042,
35.000000,634.879,758.971,1070.19,913.731,772.012,582.222,1006.17,713.06,
36.000000,710.797,844.014,1125.41,889.022,948.76,657.452,1107.22,749.973,
37.000000,705.693,1004.85,1291.35,873.897,961.804,718.204,1167.61,813.12,
38.000000,747.64,991.289,1300.48,861.468,967.648,712.28,1093.56,839.168,
39.000000,757.436,982.079,1210.17,746.276,1047.94,756.488,978.74,922.64,
40.000000,731.336,992.756,1176.99,805.876,1009,800.204,1038.18,858.28,
41.000000,691.016,920.845,971.666,771.794,792.664,777.36,1085.38,882.88,
42.000000,569,922.14,988.536,758.764,829.528,760.572,1012.52,925.331,
43.000000,637.804,837.264,871.224,708.616,785.816,738.784,917.216,909.524,
44.000000,653.018,846.995,827.472,746.584,701.004,651.136,848.458,811,
45.000000,648.108,739.857,779.64,752.024,656.596,627.792,831.1,758.503,
46.000000,603.5,808.218,702.36,658.656,633,658.06,740.8,704.5,
47.000000,553.64,803.996,668,643.088,594.05,588.98,715.768,688.816,
48.000000,596.032,813.853,711.12,651.588,620.28,593.566,720.064,678.884,
49.000000,622.128,841.28,827.316,703.228,645.04,544.84,767.56,720.652,
50.000000,603.12,974.881,1085.18,728.84,636.968,533.884,835.116,673.318,
51.000000,647.44,1070.24,831.824,924.36,618.724,537,1093.22,790,
52.000000,641.768,1153.48,853.36,1041.46,901.66,548.98,1120.21,880.312,
53.000000,706.74,1182.03,902.3,969.992,855.2,533.95,1294.32,1058.42,
54.000000,690.632,1208.97,1024.18,882.36,729.596,523.572,1274.24,893.386,
55.000000,670.796,1084.05,700.612,841.404,721.48,526.48,1307,885.6,
56.000000,653.94,1238.01,978.916,845.008,942.224,534.588,987.792,874.426,
57.000000,619.692,1098.53,828.396,720.884,881.472,536.044,989.664,805.682,
58.000000,665.344,1105.07,718.732,654.312,851.904,513.036,885,794.04,
59.000000,656.88,1237.25,670.48,923.672,778.2,526.548,867.896,756,
60.000000,626.168,1060.52,640.68,843.932,738,518.13,842.06,785.584,
61.000000,632.824,1070.65,706.964,751.268,673.952,517.02,770.48,717.784,
62.000000,689.7,1054.46,737.4,810.22,648.64,520.986,710.492,662.42,
63.000000,683.528,1049.39,720.836,758.512,620.082,502,826.11,726.724,
64.000000,875.568,1039.5,860.136,797.72,684.8,515,870,717.642,
65.000000,912.08,1159.08,768.98,795.02,667.46,505.04,896.832,818.688,
66.000000,936.264,1233.41,862.456,773.696,714.32,501,1006.27,771.444,
67.000000,976.624,1338.41,918.42,791.448,822.826,522.968,1142.76,810.64,
68.000000,1015.32,1489.71,923.988,874.134,884,502.896,1228.72,743.564,
69.000000,1230.41,1427.31,882.616,871.3,849.66,548.175,1282.14,1366.18,
70.000000,1148.52,1466.17,808.94,804.832,806.684,501.011,1237.58,1140.84,
71.000000,963.776,1500.1,779.096,820.964,856,506.043,1245.61,1200.68,
72.000000,1080.1,1484.16,776.168,786.988,909.272,471.89,1158.5,1244,
73.000000,1056.14,1500.72,721.86,657.98,718.52,511.091,899.055,1052.91,
74.000000,949.9,1267.47,705.636,680.092,778.007,523.142,1058,988.424,
75.000000,931.5,1296.4,1217.22,776.88,652.04,514.064,1131.88,877.548,
76.000000,881.666,1221.11,1194.32,746.204,701.648,531,972.28,750.488,
77.000000,886.775,1192.72,1029.78,651.068,638.308,543.376,940.736,818.476,
78.000000,857.426,1203.94,1185.88,616.216,592.012,556.54,800.868,770.252,
79.000000,827.281,1292,1197.84,739.044,579.216,551.98,980.1,765.42,
80.000000,791.292,1434.89,1223.88,673.216,576.908,544.02,1295.78,828.024,
81.000000,777.693,1395.53,972.464,687.6,612.044,557.958,1324.37,904.22,
82.000000,731.958,1525.15,1060.22,668.428,626.736,544.912,1387.74,948.192,
83.000000,853,1505.43,1336.99,904.98,749.2,548.104,1391.81,891.912,
84.000000,889.746,1462.92,1480.4,927.18,766.392,532.544,1549.27,820.5,
85.000000,917.488,1334.55,1344.72,878.372,940.06,533.04,1450.41,1119.69,
86.000000,1013.38,1082.76,1400.69,931.612,981.963,538.515,1317.1,967.032,
87.000000,1041.52,1239.88,1355.48,1030.64,981.67,548,1263.74,960.36,
88.000000,997.776,972.372,1301.02,1023.98,878.504,523.988,1124.08,1298.95,
89.000000,972.664,907.66,1297.04,877.98,828.685,538.552,1046.1,1249,
90.000000,876.626,863.12,1211.54,900.028,955.61,542.968,1178.93,1249.6,
91.000000,850.422,856.116,1116.1,781.064,991.876,537.446,1132.06,1214.99,
92.000000,811.144,966.32,1015.84,801.796,998.092,515.4,1579.94,1117.9,
93.000000,741.09,862.26,910.26,715.496,892,571.056,1516.63,1012.48,
94.000000,676.396,802.12,912.444,757.996,903.44,551.104,1281.64,1346.47,
