Frame number,1000000000,
0.000000,42449.5,
1.000000,37855.8,
2.000000,38840.2,
3.000000,38673.2,
4.000000,36716.4,
5.000000,32791.7,
6.000000,27371.4,
7.000000,23767.2,
8.000000,21970,
9.000000,18192.4,
10.000000,16868.3,
11.000000,15676.1,
12.000000,13371.2,
13.000000,11732.8,
14.000000,11235.5,
15.000000,13552.2,
16.000000,18891.3,
17.000000,24489.1,
18.000000,25537.5,
19.000000,22848.6,
20.000000,21845.3,
21.000000,19425.5,
22.000000,15829,
23.000000,12121,
24.000000,9671.74,
25.000000,7783.83,
26.000000,6338.03,
27.000000,5412.78,
28.000000,4715.01,
29.000000,4812.46,
30.000000,6004.14,
31.000000,9593.62,
32.000000,14212,
33.000000,18836.7,
34.000000,18794.1,
35.000000,17322.8,
36.000000,15811.3,
37.000000,13298.9,
38.000000,10199.8,
39.000000,7681.56,
40.000000,6836.36,
41.000000,5567.56,
42.000000,4987.88,
43.000000,4241.56,
44.000000,3801.48,
45.000000,3815.42,
46.000000,5271.77,
47.000000,7828.7,
48.000000,11862.6,
49.000000,14787.2,
50.000000,14447.4,
51.000000,13842.8,
52.000000,13002.1,
53.000000,10850.5,
54.000000,8710.18,
55.000000,7197.84,
56.000000,6271.8,
57.000000,5411.33,
58.000000,4861.41,
59.000000,4211.5,
60.000000,4016,
61.000000,4200.01,
62.000000,5041,
63.000000,6935.99,
64.000000,9768.61,
65.000000,12337.3,
66.000000,12869.6,
67.000000,12405.1,
68.000000,11637.9,
69.000000,10284.7,
70.000000,8712.43,
71.000000,8064.32,
72.000000,7145.78,
73.000000,6484.6,
74.000000,6066.42,
75.000000,5297.9,
76.000000,5083.08,
77.000000,5259.49,
78.000000,6009.23,
79.000000,7419.14,
80.000000,9408.97,
81.000000,10659,
82.000000,11128.1,
83.000000,11263.2,
84.000000,10060.3,
85.000000,9086.3,
86.000000,8182.38,
87.000000,7329.94,
88.000000,6737.08,
89.000000,6079.06,
90.000000,5385.69,
91.000000,4844.58,
92.000000,4805.89,
