Frame number,1000000000,
0.000000,458.999,
1.000000,437.002,
2.000000,423.993,
3.000000,429,
4.000000,436.002,
5.000000,448.008,
6.000000,459.994,
7.000000,447.01,
8.000000,453.488,
9.000000,454.988,
10.000000,442.996,
11.000000,436.004,
12.000000,429.007,
13.000000,435.496,
14.000000,446,
15.000000,439.498,
16.000000,434.012,
17.000000,434.99,
18.000000,424,
19.000000,440.99,
20.000000,438,
21.000000,438.496,
22.000000,446.52,
23.000000,441,
24.000000,449.496,
25.000000,443.003,
26.000000,438.996,
27.000000,440.496,
28.000000,436.008,
29.000000,441.51,
30.000000,445.502,
31.000000,435,
32.000000,431.5,
33.000000,432,
34.000000,434.496,
35.000000,433,
36.000000,434.011,
37.000000,438,
38.000000,436.996,
39.000000,443.006,
40.000000,433.992,
41.000000,431.008,
42.000000,437.998,
43.000000,428.988,
44.000000,432.004,
45.000000,440.51,
46.000000,427.993,
47.000000,431.004,
48.000000,432,
49.000000,426.99,
50.000000,431.998,
51.000000,434.986,
52.000000,432.512,
53.000000,428.992,
54.000000,432.004,
55.000000,443.996,
56.000000,431.994,
57.000000,445.003,
58.000000,431.004,
59.000000,424.49,
60.000000,434,
61.000000,433.991,
62.000000,436.006,
63.000000,428.992,
64.000000,435.5,
65.000000,428.5,
66.000000,425.99,
67.000000,436.008,
68.000000,432.005,
69.000000,431.993,
70.000000,434.996,
71.000000,429.992,
72.000000,431,
73.000000,427,
74.000000,436.996,
75.000000,433.006,
76.000000,441,
77.000000,426.994,
78.000000,427.992,
79.000000,425.992,
80.000000,427.005,
81.000000,425,
82.000000,427.005,
83.000000,421,
84.000000,422.995,
85.000000,427,
86.000000,426,
87.000000,425,
88.000000,435.005,
89.000000,421,
90.000000,435.99,
91.000000,422.007,
92.000000,424.996,
93.000000,425.004,
94.000000,427.996,
95.000000,427.994,
96.000000,424.001,
