Frame number,1000000000,
0.000000,409.99,
1.000000,406.001,
2.000000,408.999,
3.000000,408.988,
4.000000,413.992,
5.000000,406.99,
6.000000,411.002,
7.000000,411.99,
8.000000,407.002,
9.000000,402,
10.000000,405.004,
11.000000,405.016,
12.000000,399.996,
13.000000,409.99,
14.000000,402.99,
15.000000,402.996,
16.000000,406.008,
17.000000,411.996,
18.000000,408.004,
19.000000,405.004,
20.000000,406,
21.000000,411.01,
22.000000,404.008,
23.000000,405.996,
24.000000,412.001,
25.000000,403.004,
26.000000,406.988,
27.000000,404.004,
28.000000,407.994,
29.000000,403.996,
30.000000,407.004,
31.000000,402.008,
32.000000,410.008,
33.000000,403.997,
34.000000,407.996,
35.000000,406.011,
36.000000,412,
37.000000,405.006,
38.000000,408.992,
39.000000,411.01,
40.000000,412.004,
41.000000,411.004,
42.000000,405.004,
43.000000,410.008,
44.000000,405.992,
45.000000,406.995,
46.000000,404,
47.000000,403.004,
48.000000,403.004,
49.000000,408.01,
50.000000,408.004,
51.000000,409.008,
52.000000,410.009,
53.000000,408.99,
54.000000,411.999,
55.000000,407.006,
56.000000,404.01,
57.000000,404.012,
58.000000,405.005,
59.000000,404,
60.000000,404.006,
61.000000,408,
62.000000,408.992,
63.000000,406,
64.000000,414,
65.000000,405.014,
66.000000,403.01,
67.000000,402.992,
68.000000,402.007,
69.000000,404.001,
70.000000,410.005,
71.000000,408.008,
72.000000,413.994,
73.000000,409.008,
74.000000,400.01,
75.000000,405,
76.000000,411.012,
77.000000,405.008,
78.000000,407.016,
79.000000,405.996,
80.000000,407.996,
81.000000,405.993,
82.000000,404.992,
83.000000,407,
84.000000,405.496,
85.000000,406.004,
86.000000,411.01,
87.000000,402.504,
88.000000,404.004,
89.000000,401.004,
90.000000,405.008,
91.000000,407.008,
92.000000,404.499,
93.000000,405,
94.000000,415,
