Frame number,1000000000,1000000001,1000000002,1000000003,
0.000000,1480.06,940.177,909.2,1489.81,
1.000000,1319.08,881.883,855.064,1422.83,
2.000000,1283.38,915.143,791.07,1572.81,
3.000000,1223.99,1023.2,829.065,1532.62,
4.000000,1119.04,1011.83,795.03,1382.93,
5.000000,1099.11,926.145,743.142,1329,
6.000000,1055.07,930.045,715.086,1300.73,
7.000000,1011.04,948.012,720.043,1125.94,
8.000000,967.056,916.11,713.958,1160.89,
9.000000,935.059,910.294,661.916,1006.14,
10.000000,875.88,862.312,692.048,1008.8,
11.000000,831,856.18,663.024,1042.78,
12.000000,843.128,846.91,649.524,1065.35,
13.000000,800.1,825.226,672.52,1061.29,
14.000000,751,809.052,680.98,1055.7,
15.000000,786.896,825.08,674.984,1042.72,
16.000000,792.02,796.097,643.989,1010.35,
17.000000,755.01,821.026,668.481,1042.44,
18.000000,770.08,791.046,671.488,990.704,
19.000000,792.049,817.08,668.564,1050.28,
20.000000,794.987,860.482,704.512,1070.03,
21.000000,794.911,869.912,686.015,1048.91,
22.000000,772.097,840.13,699.067,1043.2,
23.000000,776.156,819.982,697.036,1137.92,
24.000000,749.08,854.865,715.944,1135.87,
25.000000,757.96,891.056,703.032,1119.68,
26.000000,758,861.915,714,1111.75,
27.000000,763.117,844.968,722.988,1144.27,
28.000000,746.146,821.136,672.46,1095.2,
29.000000,758.092,826.012,655.044,1054.11,
30.000000,726.936,786.145,645.992,974,
31.000000,696.882,770.932,679.046,1000.12,
32.000000,711.91,755.088,656.492,945,
33.000000,691.088,804.968,675.532,948,
34.000000,703.104,728.998,644.965,1015.96,
35.000000,670.868,733.904,648.048,963.984,
36.000000,721.037,754.964,669.069,966.244,
37.000000,699.08,794.936,676.972,985.02,
38.000000,736.104,807.119,667.059,1009.08,
39.000000,702.893,796.17,697.96,1028.03,
40.000000,704.088,778.872,675.9,923.832,
41.000000,655.952,749.048,673.073,938.856,
42.000000,693.964,758.076,701.04,986.1,
43.000000,641.116,735.947,668.999,925.956,
44.000000,634.928,751.074,698.994,955.904,
45.000000,649,740.12,654.092,975.895,
46.000000,646.984,757,654.48,924.28,
47.000000,662.039,695.96,633.024,872.04,
48.000000,629.958,739.018,640.088,893.005,
49.000000,588,695.948,645.975,800.146,
50.000000,622.034,653.976,646.028,868.884,
51.000000,619.941,696.94,614.052,858.774,
52.000000,608.969,642.944,625.886,855.016,
53.000000,611.898,663,641.988,831.848,
54.000000,627.964,666,643.988,851.044,
55.000000,637.963,673.08,615.94,847.016,
56.000000,638.963,702.984,616,833.184,
57.000000,613.936,685.074,615,830.544,
58.000000,597.94,692.93,619.908,833.48,
59.000000,569.488,652.048,618.928,831.8,
60.000000,582.552,671.987,602.965,830.971,
61.000000,573.008,643.92,618.06,759.17,
62.000000,576.994,645.987,594.028,732.944,
63.000000,577.034,654.009,580.976,742.952,
64.000000,559.055,649.85,593.552,753.96,
65.000000,556.948,627.056,579.968,741.142,
66.000000,557.976,626.027,586.04,718.9,
67.000000,573.016,618.002,583.1,742.976,
68.000000,578.944,605.048,561.992,719.032,
69.000000,597.116,603.042,580.068,732.14,
70.000000,577.026,569.04,584.043,710.066,
71.000000,568.02,606.02,548.964,715.024,
72.000000,589.956,585.961,596.095,693.05,
73.000000,567,599.015,575.008,689.976,
74.000000,549.96,589.972,576.021,685.92,
75.000000,553.516,578.07,544.036,689.068,
76.000000,554.032,581.976,545.468,715.036,
77.000000,551.58,583.014,552.49,668.024,
78.000000,551.946,577,534.032,612.05,
79.000000,541.992,594.03,554.941,662.884,
80.000000,535.04,564.088,539.012,671.116,
81.000000,537.072,581.47,533.08,678.944,
82.000000,546.988,603.068,550.04,676.048,
83.000000,541.952,585.056,536.915,664.116,
84.000000,528.968,565.524,528.024,664.92,
85.000000,517,569.504,539.966,685.872,
86.000000,504.936,581.036,514.048,665.04,
87.000000,520.04,566.024,518.023,621.016,
88.000000,508.021,557.044,527,629,
89.000000,500.032,555.022,517.007,614.972,
90.000000,521.97,557.044,520.98,609.852,
91.000000,485.98,551.01,521.016,597.984,
92.000000,500.056,558.96,524.992,593.95,
93.000000,499.96,543.068,541.06,624.036,
