Frame number,1000000000,1000000001,1000000002,1000000003,
0.000000,1225.66,2012.89,972.08,1269.9,
1.000000,1008.74,1174.09,920.826,1083.68,
2.000000,938.44,1226.51,925.27,1156.57,
3.000000,1075.65,1584.13,1308.48,1314.67,
4.000000,1129.79,1785.67,1650.33,1455.08,
5.000000,1515.4,2288.45,1897.3,1596.43,
6.000000,1279.83,2616.32,2117.98,1368.25,
7.000000,1393.61,2412.54,1927.84,1473.87,
8.000000,1114.92,2163.22,1710.19,1290.88,
9.000000,990.82,1774.7,1702.46,1192.49,
10.000000,958.416,1434.87,1188.2,1052.53,
11.000000,930.352,1121.94,1012.31,1076.19,
12.000000,902.2,1109.41,1019.55,1017.92,
13.000000,836.174,970.788,900.592,920.932,
14.000000,877.688,975.592,953.014,890.16,
15.000000,765.16,1064.44,772.008,850.608,
16.000000,747.963,870.136,750.11,804.159,
17.000000,719.97,839.72,754.05,731.8,
18.000000,807.11,828.4,759.824,756.562,
19.000000,765.01,823.957,790.808,771.05,
20.000000,740.902,846.992,752.872,758.596,
21.000000,765.026,833.52,742.724,833.814,
22.000000,874.276,860.644,908.852,893.505,
23.000000,841.491,970.206,965.82,937.582,
24.000000,872.142,906.016,1010.77,1012.23,
25.000000,852.938,1171.43,937.3,995.031,
26.000000,853.849,989.206,974.036,1048.05,
27.000000,809.766,928.713,1085.65,983.056,
28.000000,779.886,969.784,1017.27,993.52,
29.000000,772.011,894.942,1006,969.452,
30.000000,702.9,811.05,941,899.726,
31.000000,645.94,761.1,882,899.826,
32.000000,832.513,788.324,857.848,835.585,
33.000000,755.868,785.984,836,832.52,
34.000000,761.957,777.123,838.012,794.344,
35.000000,715.182,751.437,795.028,731.951,
36.000000,745.501,733.009,793.42,762.995,
37.000000,757.036,734.125,749.604,743.088,
38.000000,674.01,729.166,781.92,734.99,
39.000000,718.035,709.52,744.504,772.168,
40.000000,718.124,716.084,803.54,738.446,
41.000000,688.04,725.005,761,781.438,
42.000000,736.857,770.184,765.942,820.136,
43.000000,719.292,799.952,814.512,844.792,
44.000000,749.916,813.802,841.52,833.272,
45.000000,760.256,805.202,855.5,835.584,
46.000000,730.002,811.5,862.068,841.256,
47.000000,710.152,833.328,835.816,824.205,
48.000000,715.245,763.81,858.1,811.89,
49.000000,716.939,839.126,847.8,776.75,
50.000000,689.98,780.957,874.74,808.334,
51.000000,692.176,772.003,848.048,762.082,
52.000000,690.07,769.016,782.032,771.91,
53.000000,654.151,775.72,797.788,774.512,
54.000000,643.072,764.976,761.1,727.256,
55.000000,646.054,773.725,718.968,714.06,
56.000000,658.02,777.176,717,688.971,
57.000000,644.848,723.76,693.096,718.187,
58.000000,671.888,741.944,684.12,703.052,
59.000000,686.632,800.6,702.864,715.49,
60.000000,678.975,783.96,722.936,747.939,
61.000000,697.712,783.466,767.264,778.52,
62.000000,673.352,803.93,752.648,757.48,
63.000000,673.982,814.88,762.636,786.924,
64.000000,651.76,821.769,808.068,764.42,
65.000000,642.072,814.988,819.799,789.928,
66.000000,620.057,830.907,743.86,730.594,
67.000000,624.032,799.008,753.22,753.414,
68.000000,630.16,759.816,782.9,736.498,
69.000000,582.94,770.12,744.12,730.066,
70.000000,580.924,728.592,752.128,759.433,
71.000000,567.008,796.053,700.88,726.127,
72.000000,600.984,786.805,701.848,720.572,
73.000000,730.06,736.005,717.976,703.4,
74.000000,713.952,746.036,668.8,683.072,
75.000000,718.364,731.962,681.016,700.128,
76.000000,719.59,665.106,667.1,698.519,
77.000000,656.56,750.83,670.132,690.06,
78.000000,705.559,731.992,688,706.476,
79.000000,722.036,732.94,699.096,722.544,
80.000000,718.596,747.308,682.884,750.09,
81.000000,727.228,788.212,699.916,723.262,
82.000000,723.516,769.91,703.92,747.998,
83.000000,741.408,759.012,723.88,740.972,
84.000000,656.034,802.834,745.166,719.919,
85.000000,666.592,784.298,677.524,733,
86.000000,676.62,787.638,735.992,728.228,
87.000000,692.52,785.682,715,757.25,
88.000000,639.17,755.638,700.85,728.038,
89.000000,654.092,716.716,773.004,739.004,
90.000000,648.544,724.799,703.544,735.12,
91.000000,663.508,742.204,724.432,731.893,
92.000000,638.036,708.042,690.98,716.014,
93.000000,640.628,725.186,676.996,702.15,
94.000000,645.256,699.162,666.88,685.026,
95.000000,604.004,704.1,682.04,688.06,
