Time [ms],1000000000,1000000001,1000000002,1000000003,
0,11936.9,16516.1,20740.3,16376.4,
1000000000,5690.72,7099.63,8273.97,8911.92,
2000000000,3280.2,4062.76,4742.42,5034.56,
3000000000,2654.06,3547.78,4103.4,4102.6,
4000000000,2425.65,3387.01,3796.25,3856.6,
5000000000,2327.72,3262.05,3322.25,2791.46,
6000000000,2410.19,2967.38,2755.7,2057.61,
7000000000,2705.97,2549.74,2482.35,1630.5,
8000000000,2484.72,2268.37,2227.64,1529.72,
9000000000,2036.81,1852.41,2085.4,1237.68,
10000000000,1707.94,1612.93,1895.84,1086.05,
11000000000,1459.51,1482.06,1573.94,941.856,
12000000000,1287,1304.91,1500.26,846.952,
13000000000,1266.73,1174.75,1320.92,744.592,
14000000000,1162.5,1121.78,1236.25,754,
15000000000,1113.97,1049.1,1098.46,706.048,
16000000000,1056.99,994.908,1113.56,728.032,
17000000000,1083.88,1072.22,1037.18,737.1,
18000000000,1099.7,1124.66,1164.82,849.872,
19000000000,1177.17,1290.04,1312.4,932.952,
20000000000,1299.83,1451.2,1520.98,1045.02,
21000000000,1361.15,1591.27,1579.82,1118.23,
22000000000,1425.32,1624.67,1450,1203.13,
23000000000,1435.98,1680.77,1553.2,1280.15,
24000000000,1454.02,1552.44,1479.84,1179.86,
25000000000,1388,1440.34,1387.95,1150.32,
26000000000,1350.91,1379.87,1269.92,1092.91,
27000000000,1253.63,1383.01,1230.95,1071.95,
28000000000,1181.08,1281.76,1176.25,1039,
29000000000,1069.82,1183,1098.99,993,
30000000000,1067.21,1146.87,1074.81,926.64,
31000000000,1034.05,1155.11,1040.03,935.2,
32000000000,1091.08,1014.39,968.788,888.02,
33000000000,1063.18,1036.97,937.078,840.178,
34000000000,949.056,1023.93,933,837.048,
35000000000,983.088,972.46,935.046,827.904,
36000000000,975.092,967.56,974.976,855.92,
37000000000,1033.09,1005.19,1005.08,930.03,
38000000000,1029.78,1084.31,1087.17,967.138,
39000000000,1184.24,1168.84,1180.11,991.612,
40000000000,1146.78,1207.19,1230.04,1099.38,
41000000000,1200.14,1240.26,1180.21,1119,
42000000000,1179.94,1180.91,1216.73,1078.9,
43000000000,1142.23,1196.87,1148.88,1106.16,
44000000000,1103.93,1175.07,1069.84,1002.04,
45000000000,1060.88,1088.1,1062.83,984.001,
46000000000,1018.15,1015.41,940.012,960.971,
47000000000,961.868,945.976,909.984,830.138,
48000000000,918.12,899.746,875.984,858.923,
49000000000,962.016,871.936,845.896,806.997,
50000000000,932.88,841.168,799.836,754.85,
51000000000,896.012,800.88,791.972,728.926,
52000000000,883.264,812.11,776.024,715.905,
53000000000,847.98,779.89,782.557,737.994,
54000000000,854.961,776.914,760.98,700.877,
55000000000,892.05,775,808.104,726.135,
56000000000,933.98,802.024,811.92,776.96,
57000000000,943.045,814.248,878.54,777.01,
58000000000,971.156,833.999,879.974,796.96,
59000000000,935.9,898.836,904.98,846.098,
60000000000,1000.85,900.532,900.23,822.016,
61000000000,984.143,916.85,899.5,819.098,
62000000000,986.985,859.046,860.954,849.112,
63000000000,952.993,873.468,873.612,797.096,
64000000000,931.862,848.02,850.968,817,
65000000000,920.088,829.88,791.016,767.136,
66000000000,818.919,800.104,766.938,711.932,
67000000000,814.024,765.06,719,687.396,
68000000000,790.928,775.014,725.047,682.156,
69000000000,794.768,719.976,699.952,683.454,
70000000000,793.116,741.52,674.016,666.062,
71000000000,762.525,723.948,698.958,676.093,
72000000000,789.464,706.1,700.114,642.2,
73000000000,765.036,694.088,658.05,658.082,
74000000000,764.642,687.08,657.88,667.06,
75000000000,771.568,689.06,678.064,647.948,
76000000000,815.478,732.96,673.956,658.186,
77000000000,823.545,681.96,691.028,654.956,
78000000000,816,679.018,688.124,662.09,
79000000000,808.912,722.968,712.98,671,
80000000000,836.028,729.492,728.064,692.934,
81000000000,817,719.44,728.992,683.097,
82000000000,784.596,737.042,733.168,684.124,
83000000000,811.48,755.88,699.091,691.958,
84000000000,803.14,753,707.16,664.946,
85000000000,790.96,771.108,729.94,687.08,
86000000000,780.924,730.824,711.02,675.056,
87000000000,764.096,747.128,695.054,659.96,
88000000000,756.084,742.04,690.954,697.04,
89000000000,767.864,706.064,682.51,673.056,
90000000000,727.12,728.069,672.946,681.944,
91000000000,734.94,718.92,647.998,671.96,
92000000000,698.982,710.104,663.014,672.132,
93000000000,705,688.032,650.976,692.004,
94000000000,665.97,695.979,637.928,683.125,
95000000000,700.026,706.968,688.964,670.014,
