Time [ms],1000000000,
0,435.99,
1000000000,418,
2000000000,423.5,
3000000000,424.496,
4000000000,428.014,
5000000000,423.024,
6000000000,425.974,
7000000000,419.98,
8000000000,419,
9000000000,419.98,
10000000000,413,
11000000000,422.984,
12000000000,414.024,
13000000000,419.024,
14000000000,420.994,
15000000000,419.992,
16000000000,416.98,
17000000000,417.996,
18000000000,416.5,
19000000000,421.98,
20000000000,427.004,
21000000000,424.974,
22000000000,420.982,
23000000000,423.986,
24000000000,421.03,
25000000000,415.003,
26000000000,415.528,
27000000000,420.02,
28000000000,407.028,
29000000000,417.998,
30000000000,421.028,
31000000000,421.016,
32000000000,416.008,
33000000000,416.01,
34000000000,417.048,
35000000000,421.004,
36000000000,419.012,
37000000000,418.012,
38000000000,418.003,
39000000000,423.019,
40000000000,423.98,
41000000000,418.98,
42000000000,413.998,
43000000000,411.02,
44000000000,413.994,
45000000000,411.01,
46000000000,409,
47000000000,412.03,
48000000000,414.996,
49000000000,417.965,
50000000000,408.981,
51000000000,411.492,
52000000000,418,
53000000000,412.985,
54000000000,415.017,
55000000000,409.999,
56000000000,412.992,
57000000000,415.028,
58000000000,418.981,
59000000000,413.008,
60000000000,411.008,
61000000000,418.016,
62000000000,417.959,
63000000000,414.996,
64000000000,407.016,
65000000000,408.995,
66000000000,413.04,
67000000000,418.025,
68000000000,417.995,
69000000000,410.984,
70000000000,409.022,
71000000000,413.488,
72000000000,415.512,
73000000000,410.524,
74000000000,406.012,
75000000000,410,
76000000000,412.504,
77000000000,408.516,
78000000000,409,
79000000000,408.992,
80000000000,412.51,
81000000000,407.5,
82000000000,416.984,
83000000000,409.978,
84000000000,409.984,
85000000000,417.002,
86000000000,415.492,
87000000000,408.998,
88000000000,409.98,
89000000000,411.012,
90000000000,409.008,
91000000000,411.026,
92000000000,409.488,
93000000000,410.01,
94000000000,408,
