Frame number,1000000000,1000000001,1000000002,
0.000000,1375.27,1068.74,1006.72,
1.000000,1058.74,737.484,738.52,
2.000000,965.482,739.141,899.175,
3.000000,824.124,664.186,735.417,
4.000000,699.243,670.209,683.659,
5.000000,793.544,726.412,906.516,
6.000000,709.358,605.904,713.568,
7.000000,718.871,610.36,716.82,
8.000000,656.1,662.416,741.898,
9.000000,694.4,605.263,730.415,
10.000000,645.2,604.992,574.184,
11.000000,589.183,677.034,547.841,
12.000000,563,628.888,548.138,
13.000000,576.088,668.997,528.95,
14.000000,564.964,681.14,555.4,
15.000000,573.55,672.7,530.167,
16.000000,699.272,787.988,580.192,
17.000000,727.843,868.561,674.728,
18.000000,750.61,1012.05,828.256,
19.000000,912.767,1020.97,861.198,
20.000000,905.436,1002.6,743.542,
21.000000,724.235,752.587,769.124,
22.000000,743.516,734.693,745.12,
23.000000,740.2,790.304,752.402,
24.000000,711.975,720.732,771.981,
25.000000,679.104,744.444,729.016,
26.000000,643.354,707.05,700.95,
27.000000,615.107,661.251,701.35,
28.000000,591.96,614.266,674.52,
29.000000,535.023,586.01,685.117,
30.000000,503.042,567.6,705.049,
31.000000,521.046,639.49,775.182,
32.000000,527.948,730.342,884.571,
33.000000,577.152,878.142,960.655,
34.000000,684.207,926.295,1111.53,
35.000000,730.849,821.16,1119.66,
36.000000,777.053,927.605,1027.75,
37.000000,740.654,886.556,1087.39,
38.000000,754.995,762.467,920.27,
39.000000,753.762,775.195,905.725,
40.000000,683.198,790.059,806.237,
41.000000,683.23,718.109,755.788,
42.000000,688.932,692.003,714.184,
43.000000,624.987,657.1,676.327,
44.000000,615.257,638.5,705.859,
45.000000,569.556,600.941,646.897,
46.000000,555.606,582.035,663.928,
47.000000,549.509,616.97,696.293,
48.000000,559.113,678.866,755.1,
49.000000,591.416,772.954,825.645,
50.000000,662.01,834.718,894.093,
51.000000,723.252,852.416,898.488,
52.000000,789.833,908.328,932.658,
53.000000,817.05,792.768,935.489,
54.000000,843.595,734.15,829.186,
55.000000,805.704,702.036,857.83,
56.000000,823.624,627.979,849.663,
57.000000,789.012,602.775,831.758,
58.000000,690.015,601.009,807.028,
59.000000,626.994,581.995,703.408,
60.000000,644.776,596.455,699.475,
61.000000,596.188,537.014,642.008,
62.000000,618.149,544.006,634.109,
63.000000,592.978,546.985,662.05,
64.000000,586.967,579.99,692.04,
65.000000,603.2,641.969,756.048,
66.000000,651.126,645.854,767.976,
67.000000,706.82,742.138,768.66,
68.000000,790.68,752.948,834.936,
69.000000,790.84,725.026,793.36,
70.000000,804.271,680.04,781.291,
71.000000,787.635,726.68,751.703,
72.000000,832.1,693.15,780.742,
73.000000,750.193,644.025,748.858,
74.000000,719.178,610.793,694.6,
75.000000,704.845,604.035,687.814,
76.000000,636.588,595.078,635.133,
77.000000,627.444,591.166,637.091,
78.000000,621.34,587.53,679.798,
79.000000,550.025,629.91,689.75,
80.000000,603.875,667.022,653.779,
81.000000,602.995,779.208,731.264,
82.000000,644.724,814.82,785.552,
83.000000,665.082,810.962,766.34,
84.000000,700.942,809.807,761.188,
85.000000,770.292,774.018,812.34,
86.000000,758.52,706.09,823.537,
87.000000,821.676,695.181,751.938,
88.000000,751.717,662.078,756.868,
89.000000,798.535,591.1,761.608,
90.000000,738.261,590.043,752.8,
91.000000,705.973,584.008,767.36,
92.000000,657.135,576,797.68,
93.000000,631.02,617.012,801.07,
94.000000,621.993,652.908,849.014,
95.000000,613.191,673.88,874.936,
