Time [ms],1000000000,1000000001,1000000002,
0,3040.83,7559,3293.55,
1000000000,1708.6,2737.36,1506.35,
2000000000,1339.65,1838.24,1145.93,
3000000000,1191.48,1700.29,1072.95,
4000000000,1262.01,1792.54,1060.09,
5000000000,1154.92,1684.03,1070.22,
6000000000,1102.15,1540.73,951.948,
7000000000,1145.98,1335.1,946.484,
8000000000,966.433,1395.2,888.456,
9000000000,950.408,1247.98,861.103,
10000000000,927.893,1152.76,833.11,
11000000000,815.928,1115.13,807.012,
12000000000,868.054,1042.9,787.927,
13000000000,899.866,1014.36,767.027,
14000000000,970.908,1092.5,816.034,
15000000000,1240.02,1239.9,891.36,
16000000000,1276.88,1455.96,904.015,
17000000000,1292.38,1504.78,974.87,
18000000000,1233.05,1577.67,1017.94,
19000000000,1193.78,1629.14,960.022,
20000000000,1126.01,1631.9,1058.11,
21000000000,946.613,1551.97,1094.79,
22000000000,947.848,1508.08,1026.92,
23000000000,839.94,1379.11,840.08,
24000000000,857.024,1329.92,934.264,
25000000000,779.984,1222.98,920.94,
26000000000,812.96,1142.95,866.044,
27000000000,796.988,1061.1,837.075,
28000000000,709.874,1028.37,807.176,
29000000000,770.038,1044.98,794.912,
30000000000,767.928,1007.01,834.86,
31000000000,843.86,1015.1,826.032,
32000000000,895.536,1099.82,880.056,
33000000000,978.86,1155.93,944.088,
34000000000,1012.11,1172.88,970.894,
35000000000,1012.77,1245.2,1084,
36000000000,1012,1308.12,1099.16,
37000000000,948.156,1257.61,1054.99,
38000000000,937,1220,968.784,
39000000000,909.21,1257.84,1007.97,
40000000000,887.84,1243.49,879.088,
41000000000,872.82,1106.88,871,
42000000000,838.008,1016.91,802.055,
43000000000,801.99,1000.96,775.092,
44000000000,799.864,944.92,764.118,
45000000000,772.114,953.584,741.08,
46000000000,773.092,890.088,739.54,
47000000000,761.044,864.105,724.456,
48000000000,795.92,873.084,703.125,
49000000000,837.416,929.976,715.948,
50000000000,892.448,1029.86,722.057,
51000000000,921.1,1102,822.044,
52000000000,937.568,1179.03,790.13,
53000000000,966.682,1165.9,845.003,
54000000000,991.027,1217.04,848.892,
55000000000,937.016,1178.47,852.048,
56000000000,913.968,1136.45,856.204,
57000000000,880.318,1024,820.114,
58000000000,830.49,984.112,769.92,
59000000000,805.424,891.192,758.02,
60000000000,771.991,867.088,731.902,
61000000000,760.5,839.03,683.064,
62000000000,736.625,819,688.96,
63000000000,709.96,753.928,659,
64000000000,720.996,740.993,651.084,
65000000000,686.444,775,640.08,
66000000000,716.056,755.983,645.02,
67000000000,731,778.938,638.956,
68000000000,761.626,778.994,641.028,
69000000000,784.488,835.984,632.005,
70000000000,800.539,873.88,677.12,
71000000000,799.625,863.76,689.968,
72000000000,784.484,911.12,703.016,
73000000000,812.92,972.054,716.846,
74000000000,792.532,939.97,754.892,
75000000000,776.986,924.12,760.036,
76000000000,756.966,897.224,753.96,
77000000000,736.496,876.91,747.998,
78000000000,691.58,881.904,705.814,
79000000000,688.568,804.977,684.14,
80000000000,658.1,796.958,652.04,
81000000000,657.564,775.084,647.98,
82000000000,650.992,753.068,643.98,
83000000000,630.928,710.064,630.006,
84000000000,637.584,688.896,639.084,
85000000000,645.904,691.03,600.968,
86000000000,649.066,704,609.94,
87000000000,653.045,695.97,612.94,
88000000000,669,698.008,586.988,
89000000000,669.081,701.99,618.04,
90000000000,687.16,709,627.008,
91000000000,694.103,729.949,634.94,
92000000000,683.998,736.915,638.128,
93000000000,692.946,742.963,635.94,
94000000000,707.924,775.944,653.934,
95000000000,673.029,777,666.996,
