Time [s],1000000000,1000000001,1000000002,1000000003,
0.000000,599.035,644.264,651.956,675.01,
1.000000,622.824,655.168,656.984,720,
2.000000,585.064,643.074,570.104,645.424,
3.000000,512.056,554.4,538.104,573,
4.000000,487.948,551.992,524.998,558.484,
5.000000,478.912,508.135,496.008,522.044,
6.000000,468.042,517.072,497.002,506.06,
7.000000,467.012,492.011,472.976,506.516,
8.000000,455.003,487.936,467.464,483.042,
9.000000,477.992,496.05,474.93,507.017,
10.000000,480.031,519.004,494.96,513.063,
11.000000,476.02,548.06,506.035,570.06,
12.000000,516.068,614.895,571.98,610.004,
13.000000,562.05,733.921,621.125,690.21,
14.000000,590.956,800.105,692.147,778.278,
15.000000,613.078,777.782,700.97,819.91,
16.000000,583.096,743.925,648.912,849.097,
17.000000,562,644.514,598.907,712.1,
18.000000,496.076,542.06,549.016,622.98,
19.000000,471.978,534.572,501.033,545.024,
20.000000,460,510.44,477.996,527.976,
21.000000,455.95,496.528,473.06,523.06,
22.000000,457.006,489.048,481.005,494.981,
23.000000,438.969,472.904,471.978,491.91,
24.000000,439.992,467.496,463.996,476.908,
25.000000,458.006,484.45,469.938,500.98,
26.000000,463.972,507.036,490.02,503.942,
27.000000,461.014,509.544,482,520.984,
28.000000,487.94,555.04,509.036,549.947,
29.000000,521.065,613.052,543.027,571.13,
30.000000,548.934,687.08,583.076,686.039,
31.000000,572.092,719.008,599.94,689.018,
32.000000,568,712.972,601,692.104,
33.000000,541.937,631.672,571.952,645.03,
34.000000,494.932,568.551,517.088,561.045,
35.000000,475.032,539.48,496.025,520.02,
36.000000,460.996,507.02,484.025,500.04,
37.000000,456.04,481.946,460.008,477.952,
38.000000,438.985,477.98,441.996,484.997,
39.000000,445.976,474.06,454.048,460.996,
40.000000,438.984,468.003,448.976,463,
41.000000,446,489.016,465.04,487.993,
42.000000,467.088,506.528,472.96,495.044,
43.000000,472.032,529.088,505.068,504,
44.000000,469.04,521.04,499.938,520.963,
45.000000,504.02,560.632,542.5,596.9,
46.000000,526.011,628.192,584.08,629.1,
47.000000,550.031,662.406,596.1,661.074,
48.000000,526.969,646.776,590.052,668.06,
49.000000,515.039,595.936,552.925,620.096,
50.000000,475.008,556.386,511.048,558.858,
51.000000,467.08,512.526,474.036,521.995,
52.000000,456.982,492.008,461.02,485.016,
53.000000,445.02,492.028,457.05,476.96,
54.000000,434.01,469.551,449.98,471.992,
55.000000,441.974,456.52,444.988,455.968,
56.000000,436.98,456.032,446.079,457.016,
57.000000,447.996,461.99,470.98,482.034,
58.000000,449.985,484.484,470.96,480,
59.000000,462.056,504.52,486.986,493.952,
60.000000,468.04,529.512,496.032,514.048,
61.000000,477.98,564.98,515.056,563.975,
62.000000,511.908,601.094,536.025,589.979,
63.000000,518.04,643.056,557.948,634.08,
64.000000,511.976,629.14,573.925,587.027,
65.000000,491.06,539.999,517.946,569.979,
66.000000,456,528.44,469,511.935,
67.000000,451.024,485.49,464.05,481.044,
68.000000,433.97,463.996,456.973,475.024,
69.000000,426.023,461.504,450,472.965,
70.000000,439.024,456.039,449.499,453.994,
71.000000,424.042,456.016,450.004,457.042,
72.000000,426,444.984,430.99,441.964,
73.000000,438.028,453.029,452.025,469.982,
74.000000,442.977,492.017,466,477.05,
75.000000,439.074,494.056,479.993,487.98,
76.000000,449.974,488.051,485.48,502.98,
77.000000,476.953,538.982,515.504,509.971,
78.000000,481.976,597.126,519.032,572,
79.000000,486.049,612.046,539.06,570.015,
80.000000,506.015,556,538.089,574.914,
81.000000,467.99,524.9,513.946,547.12,
82.000000,440.98,506.975,470.024,498.944,
83.000000,443.006,467.973,458.008,482.005,
84.000000,429.996,458.048,439.989,467.032,
85.000000,415.009,468.005,445.016,451.066,
86.000000,426.016,447.994,436.016,450.04,
87.000000,421.984,446.005,432.975,435.02,
88.000000,423.996,440.03,436.996,444.976,
89.000000,427.996,458.005,442.002,455.02,
