Time [ms],1000000000,1000000001,1000000002,1000000003,
0,484,508.96,626.004,484.96,
1000000000,497.084,597.056,662.6,543.035,
2000000000,582.061,714.844,742.55,627.092,
3000000000,628.592,805.2,951.928,714,
4000000000,676.416,819.195,1106.84,747.104,
5000000000,703.94,781.996,1116.94,768.085,
6000000000,687.496,728.99,1117.51,718.122,
7000000000,732.002,803.93,1011.79,681.964,
8000000000,681.936,739.004,894.64,647.136,
9000000000,619.008,651.53,862.444,589.968,
10000000000,601.576,649.04,822.552,572.084,
11000000000,568.472,622.979,750.468,551.928,
12000000000,553.12,575.064,676.903,541.939,
13000000000,510.929,560.08,642.74,517.055,
14000000000,507.02,530.066,616.076,511.966,
15000000000,505.064,544.078,610.128,500.024,
16000000000,501.52,526.08,600,486.04,
17000000000,476.968,503.943,574.084,479,
18000000000,476.98,511.032,559.995,483.036,
19000000000,477.062,520.996,552.068,510,
20000000000,481.014,562.003,595.496,523.05,
21000000000,492.058,606,624.048,554.04,
22000000000,546.512,591.592,688.08,546,
23000000000,536.936,621.56,708,590.982,
24000000000,570.496,617.1,744.132,568.974,
25000000000,559.03,644.002,730,579.04,
26000000000,537.024,594.964,716.96,542.961,
27000000000,534.552,582.07,690.956,545.978,
28000000000,511.49,576.96,687.113,513.99,
29000000000,511.592,575.058,630.944,495.966,
30000000000,487.98,528.096,630.032,475.997,
31000000000,466.48,520.002,598.52,483,
32000000000,495.51,512.06,594.992,492.062,
33000000000,471.996,494.006,583.48,480.008,
34000000000,474.52,477.1,558.12,471.026,
35000000000,472.005,481.034,575.96,470.959,
36000000000,474.96,485.96,556,479.058,
37000000000,464,508,546.024,471.008,
38000000000,476.026,504.942,566.97,476.001,
39000000000,479.02,511.07,583.07,500.04,
40000000000,489.476,546,599.987,515.984,
41000000000,501.456,528.064,635.852,513.073,
42000000000,495.51,535.045,663.1,516.062,
43000000000,500.484,536,654.876,513.036,
44000000000,516.072,555.958,672.108,519.992,
45000000000,491.486,558.08,647.184,505.047,
46000000000,479.012,525.996,643.08,493.92,
47000000000,481.475,509.074,601,500.08,
48000000000,476.532,499.961,591.088,480.952,
49000000000,471.504,508.056,570.016,478.024,
50000000000,463.54,489.067,551.951,469.986,
51000000000,461.508,490.002,533.988,471.97,
52000000000,459.49,484.042,535.976,465.006,
53000000000,465.005,483.05,525.956,464,
54000000000,473.998,482.06,535.54,457.028,
55000000000,466.52,489.999,549.04,465.993,
56000000000,454.039,490.972,548.05,470.014,
57000000000,458.016,502.056,557.072,473.016,
58000000000,456.016,487.986,551.132,494,
59000000000,456.48,499.034,578.064,481.96,
60000000000,458.51,486.085,606.024,487.064,
61000000000,450.528,517.942,610.013,488.988,
62000000000,458.509,500.032,613.948,489.008,
63000000000,470.522,505.944,587,490,
64000000000,441.499,493.039,583.048,484.004,
65000000000,457.998,484.1,573.017,484.016,
66000000000,450.971,478.96,551.108,476.038,
67000000000,456.05,478,546.984,463.992,
68000000000,456.009,466.02,534.976,462.983,
69000000000,449.998,468.024,521.944,456.008,
70000000000,463.96,472.96,525.037,463,
71000000000,443.98,483.032,534.95,462,
72000000000,439.032,474.032,515.947,448.025,
73000000000,448.996,482.032,523.96,454.024,
74000000000,452.064,482.982,511.003,457.984,
75000000000,448.019,472.02,518.018,463.992,
76000000000,454.98,477.036,510.936,463.991,
77000000000,454.035,475.474,527.048,464,
78000000000,440.021,475.998,521.996,466.972,
79000000000,452.03,487.947,529.98,478.048,
80000000000,449.028,475.05,515.97,471.04,
81000000000,450.976,476.004,549.08,469.992,
82000000000,446.04,471.506,532.976,470,
83000000000,460.022,488.048,535.988,468.002,
84000000000,465.025,479.488,527.035,470.978,
85000000000,449.994,462.039,519.96,440.995,
86000000000,448.98,465.006,524.054,467.005,
87000000000,453.956,483.983,525.92,463.985,
88000000000,493.03,498.992,549.974,492,
89000000000,450.032,475.958,521.072,464.026,
90000000000,479.025,486.5,538.05,488.016,
91000000000,454.992,465.52,514.992,472.02,
92000000000,446.98,469.511,505.992,452.016,
93000000000,515.98,544.024,604.032,534.042,
94000000000,532.05,553.524,607.017,554,
