
Intensity Median
 ==================== 
Time [s],1000000000,1000000001,1000000002,1000000003,1000000004,1000000005,1000000006,
0.000000,8178.82,8559.83,10364,3344.42,6070.27,5098.61,2442.79,
1.000000,3202.48,2968.98,3894.82,1899.26,2411,3395.27,1495.83,
2.000000,2035.5,1777.19,2089.51,1160.07,1395.61,2317,1115.94,
3.000000,2759.37,2162.42,2726.65,1440.98,1708.3,2859.93,1291.8,
4.000000,6375.8,4722.53,6931.54,3433.05,3887.4,10837.4,3857.31,
5.000000,5191.48,4671.31,6647.58,3615.41,4368.17,13291.8,4384.23,
6.000000,4207.33,3780.07,5019.96,3314.99,3532.65,10786.3,3844.35,
7.000000,3664.37,3181.4,3986.06,2993.8,3299.92,8007.49,3050.98,
8.000000,3315.64,2600.04,2928.77,2535.13,2854.08,6186.45,2725.24,
9.000000,2584.9,2295.85,2280.42,2105,2239.75,4997.52,2201.86,
10.000000,2026.31,1983,1808.13,1913.9,1824.5,4127.34,1766.98,
11.000000,1813.46,1665.47,1537.5,1508.02,1703.82,3387.4,1592.22,
12.000000,1459.02,1345.11,1315.51,1319.94,1428.88,2901.68,1323.03,
13.000000,1272.98,1232.82,1131.67,1180.53,1180.86,2546.5,1240.1,
14.000000,1268.58,1109.96,1106.45,1034,1199.98,2743.05,1110.05,
15.000000,1271.41,1176.3,1220.2,968.08,1200,2393.59,1023.89,
16.000000,1273.09,1190.25,1365.62,923.04,1242.7,1912.74,977.148,
17.000000,1143.42,1197.2,1249.81,925.008,1325.09,1739.13,989.988,
18.000000,1243.93,1147.89,1207.48,844.6,1271.87,1471.07,1039.07,
19.000000,2394.96,1991.59,2105.71,1230.07,2365.85,1307.85,2040.03,
20.000000,4363.79,3991.1,5197.46,1995.06,4631.68,2273,4018.96,
21.000000,4056.68,4168.02,5475.39,2389.19,4308.64,4139.2,4099.59,
22.000000,3639.49,3961.55,4585.26,2439.92,3663.18,4741.08,3792.98,
23.000000,2888.14,3122.58,3987.39,2397.11,2913.31,4779.58,3543.09,
24.000000,2391.95,2614.99,3156.43,2340,2624.29,4419.96,3236.45,
25.000000,2049.36,2139.54,2582.64,2218.98,2136.27,3931.06,2936.43,
26.000000,1723.68,1690.23,1996.37,2380.08,1790.75,3216.61,2467.4,
27.000000,1436.97,1385.71,1537.56,2786.4,1446.77,2613.61,1995.59,
28.000000,1270.24,1151.52,1266.13,1883.22,1179.94,2308.33,1600.97,
29.000000,1112.07,1005.93,1027,1381.02,1035.98,2288.27,1344.94,
30.000000,1178.16,912.04,974.962,1313.86,972.464,2048.29,1153.74,
31.000000,1221.1,1011.71,986.189,1285.03,1035.6,1713.56,1042.44,
32.000000,1298,950.228,1077.23,1164.09,1031.99,1436.25,945.44,
33.000000,1218.83,908.964,1084.1,1025.88,1085.44,1239.42,910.105,
34.000000,1164.24,1002.32,1019.7,1021.35,1247.88,1089.02,1011.02,
35.000000,1933.28,1645.67,1548.95,1623.6,2276.02,1067.96,1768.6,
36.000000,3215.94,3221.19,3567.96,2799.4,3484.91,1995.98,3177.92,
37.000000,3177.9,3781.93,4797.79,2894.71,3220.78,3117.61,3680,
38.000000,2958.6,3583.01,4419.26,2515.12,2915.83,3226.9,3684.95,
39.000000,2621.36,3361.31,3983.91,1985.12,2726.87,3121.81,3506.41,
40.000000,2327.02,3230.54,3590.5,1637.51,2510,2787.42,3274.64,
41.000000,2021.42,2706.33,2793,1384.51,2177.7,2599.66,2975.42,
42.000000,1753.28,2163.46,2261.21,1184.95,1855,2382.73,2485.96,
43.000000,1456.95,1767.69,1796.95,1020.98,1485.97,2047.28,2192.2,
44.000000,1232.47,1424.96,1459.27,904.045,1288.5,1775.76,1906.74,
45.000000,1135.65,1252.83,1246.54,875.972,1165.51,1544.55,1575.61,
46.000000,1023.02,1075.44,1102.52,867.964,1021.46,1416.38,1380.98,
47.000000,1023.44,989.54,1056.5,847.038,964.983,1363.01,1184.7,
48.000000,1032.04,996.408,1021.54,931.444,1054.04,1210.49,1021.19,
49.000000,1067.5,958.46,1094.93,924.032,1031.74,1033.72,976.128,
50.000000,1064.08,1054.46,1088.11,1161.85,1113.01,950.52,1083.07,
51.000000,1423.14,1599.66,1452.82,2005.17,1819.83,1226.41,1606.5,
52.000000,2070.1,2743.35,2676.04,2703.99,2774.32,2070.51,2211.88,
53.000000,2416.58,3725.57,4204.91,2652.91,2986.25,2833.84,2540.99,
54.000000,2371.1,3785,4376.08,2420.74,2854.42,2972.21,2530.49,
55.000000,2299.33,3429.4,3843.22,1997.03,2597.93,2754.89,2410.34,
56.000000,2056.83,3083.24,3519.33,1720.21,2391.72,2407.07,2341.48,
57.000000,1969.2,2560.72,2983.13,1438.85,2265.79,2019.79,2108.86,
58.000000,1841.24,2156.83,2369.12,1254.05,1974.79,1744.65,1833.08,
59.000000,1581.03,1844.38,1875.98,1098.16,1616.67,1542.51,1611.94,
60.000000,1425.07,1531.62,1632.88,970.02,1389.96,1328.47,1384.89,
61.000000,1303.19,1333.94,1354.62,896.996,1215.04,1218.6,1138.6,
62.000000,1146.94,1116.54,1151.52,873.992,1057,1072.12,1052,
63.000000,987.808,1037.39,1041.01,828.872,1003,1008.62,953,
64.000000,941.109,1020.05,958.048,829.044,980.888,989.03,871,
65.000000,951.048,978,1020.95,854.996,982.96,909.128,796.887,
66.000000,990.9,1005.99,1001.19,1154.81,1078.77,844.92,834.794,
67.000000,1215.08,1316.19,1296.25,1535.37,1331.73,1085.45,1136.06,
68.000000,1606.01,2147.94,1920.2,1759.9,1790.52,1928.26,1455.84,
69.000000,1810.93,2634.99,2553.94,1830.02,2134.55,2179.83,1616,
70.000000,1885.92,2458.04,2639.61,1682.72,2013.05,2269.6,1658.56,
71.000000,1774.47,2283.64,2482.02,1482.18,1854.61,2173.59,1650.26,
72.000000,1623,2111.94,2276.42,1385.97,1705.06,1912.36,1574.01,
73.000000,1467.78,1805.6,1895.24,1173.2,1643.14,1788.25,1463.03,
74.000000,1337.06,1568.86,1704.8,1065.6,1438.8,1578.4,1380.01,
75.000000,1212.86,1298.5,1415.06,945.565,1282.02,1486.07,1207.8,
76.000000,1153.04,1147.07,1269.28,900.48,1135.85,1325.1,1084.9,
77.000000,1001.82,1035.09,1046.08,851.5,1022.14,1194.71,989.097,
78.000000,893,913.97,959.95,806.56,915.892,1119.82,891.894,
79.000000,891.88,867.907,864,788.544,841.964,1046.41,810.024,
80.000000,798.968,811.024,830.048,801.492,835.098,922.126,755.085,
81.000000,736.024,824.015,788.456,838.535,844.592,887.328,738.946,
82.000000,735.072,886.982,824.088,980.76,897.1,847.02,761.03,
83.000000,806.998,1125.89,1045.45,1298.17,1145.98,932.284,989.997,
84.000000,1080.78,1438.72,1381.06,1390.23,1436.51,1405,1174.35,
85.000000,1250.84,1573.88,1812.52,1428.03,1489.1,1598.86,1214.55,
86.000000,1355.26,1643.95,1825.77,1345.98,1358.84,1644.16,1258.05,
87.000000,1320.19,1534.14,1586.84,1275.94,1315.4,1620.4,1229.46,
88.000000,1231.14,1410.04,1532.68,1170.02,1268.86,1535.48,1219.48,
89.000000,1176.46,1298.04,1384.05,1124.99,1235.64,1359.03,1189.03,
90.000000,1056.92,1153.18,1288.9,1025.99,1086.4,1295.1,1150.01,
91.000000,1007.46,1062.96,1134.78,963.938,1056.99,1221.61,1062.96,
92.000000,912.014,943.498,1004.05,873.063,956.826,1182.64,974.97,
93.000000,850.376,873.25,890.944,836.888,876.923,1130.47,868.01,
94.000000,867.902,818.986,879.128,824.056,824,1010.54,828.992,
95.000000,787.088,793.112,784.015,772,755.06,1002.95,769.937,
