Frame number,1000000000,1000000001,1000000002,
0.000000,756.646,685.9,1365.62,
1.000000,704,741.203,1040.64,
2.000000,1189.53,1056.91,900.116,
3.000000,1665.93,1659.51,1255.67,
4.000000,1297.37,1749.44,1461.4,
5.000000,1344.29,1893.2,1464.85,
6.000000,1451.37,1377.66,1358.52,
7.000000,899.198,1143.32,1375.44,
8.000000,758.622,940.8,1303.11,
9.000000,788.59,832.792,1135.29,
10.000000,683.417,761.708,1004.69,
11.000000,710.888,674.755,842.726,
12.000000,668.824,687.923,786.106,
13.000000,653.04,642.336,672.778,
14.000000,613.232,614.36,657.117,
15.000000,592.8,611,624,
16.000000,618.999,548.961,610.892,
17.000000,597.91,564.845,601.18,
18.000000,642.18,595.359,623.952,
19.000000,721.284,671.814,707.256,
20.000000,797.82,811.049,874.125,
21.000000,750.016,949.119,1196.55,
22.000000,860.894,1223.31,1515.3,
23.000000,864.625,981.54,992.318,
24.000000,818.807,880.694,981.863,
25.000000,755.14,838.908,867.515,
26.000000,682.625,702.08,841.2,
27.000000,662.256,653,685.328,
28.000000,625.007,635.179,638.071,
29.000000,576.913,565.804,608.6,
30.000000,564.1,581.104,532.068,
31.000000,545.066,587.072,553.051,
32.000000,513.029,546.926,519.03,
33.000000,529.038,536.125,500.914,
34.000000,521.931,531.1,524.07,
35.000000,543.965,516.2,527.52,
36.000000,555.527,558.864,521.108,
37.000000,632.992,604.092,568.034,
38.000000,706.754,656.95,700.364,
39.000000,764.337,721.105,813.034,
40.000000,824.024,795.635,767.325,
41.000000,878.181,792.931,825.172,
42.000000,875.09,763.907,767.383,
43.000000,783.935,718.202,713.744,
44.000000,757.315,612.932,650.748,
45.000000,686.1,605.264,600.22,
46.000000,645.853,551.878,577.574,
47.000000,603.963,554.036,564.525,
48.000000,589.934,513.069,537.578,
49.000000,549.091,506.05,526.998,
50.000000,547.968,508.003,504.126,
51.000000,534.947,526.616,516.088,
52.000000,544.116,523.524,510.872,
53.000000,567.018,595.05,517.05,
54.000000,581.816,610.91,577.048,
55.000000,667.971,645.243,621.184,
56.000000,706.112,723.556,680.8,
57.000000,777.41,709.04,774.729,
58.000000,844.217,739.885,904.538,
59.000000,895.64,827.51,830.775,
60.000000,797.916,781.232,859.511,
61.000000,633.3,676.89,774.395,
62.000000,578.015,636.204,713.863,
63.000000,534.834,571.706,641.306,
64.000000,550.133,549.9,575.948,
65.000000,520.105,551.956,564.92,
66.000000,499.99,529.094,544.902,
67.000000,516.969,529.902,519.118,
68.000000,506.034,510.012,517.933,
69.000000,515.118,533.063,537.911,
70.000000,508.272,516.862,534.96,
71.000000,532.15,542.11,524.898,
72.000000,522.919,553.176,551.948,
73.000000,642.08,576.742,584.936,
74.000000,683.44,616.92,667.9,
75.000000,750.1,683.134,757.105,
76.000000,758.304,671.932,794.063,
77.000000,747.634,690.213,789.13,
78.000000,705.488,652.129,721.266,
79.000000,686.436,619.077,650.392,
80.000000,609.136,581.154,637.867,
81.000000,581.05,558.15,613.008,
82.000000,559.001,532.981,555.054,
83.000000,534.047,535.015,533.082,
84.000000,551.952,518.99,494.011,
85.000000,524.018,517.118,513.975,
86.000000,547,507.97,512.002,
87.000000,554.1,514.002,510.062,
88.000000,554.104,526.008,507.984,
89.000000,575.532,532.942,533.166,
90.000000,550.12,539.744,544.958,
91.000000,615.18,552.854,561.02,
92.000000,593.965,632.912,617.964,
93.000000,632.265,655.358,633.96,
94.000000,659.28,646.753,672.588,
95.000000,634.146,622.64,682.36,
