Time [ms],1000000000,1000000001,1000000002,1000000003,
0,1613.2,2904.45,3938.44,2205.47,
1000000000,1377.54,2500.36,3292.88,2513.96,
2000000000,1565.62,2193.19,3423.42,2012.57,
3000000000,2035.93,2329.66,3962.41,2106.58,
4000000000,2518.22,2893.04,4099.82,2270.81,
5000000000,2685.36,3018.36,5994.23,2414.28,
6000000000,2968.46,3059.46,5056.98,2388.57,
7000000000,2639.16,2547.58,5040.19,2256.68,
8000000000,2730.59,2760.75,4673.09,2313.2,
9000000000,2422.5,2565.58,3905.67,2183.61,
10000000000,2278.05,2605.81,3972.17,2199.24,
11000000000,2150.51,2465.45,3208.09,2096.16,
12000000000,2926.32,2342.54,3477.48,1979.36,
13000000000,2823.86,2409.4,3394.5,1903.97,
14000000000,3088.86,2064.25,3030.36,1908.17,
15000000000,3104.02,2208.5,2950.52,1713.37,
16000000000,3097.03,2222.82,2692.12,1614.69,
17000000000,2312.86,2146.67,2610.33,1524.2,
18000000000,3022.66,2089.68,2709.47,1534.12,
19000000000,2773.14,2129,2576.9,1581.14,
20000000000,2920.06,2222.26,2560.68,1812.33,
21000000000,3311.96,2272.63,2643.35,1804.93,
22000000000,3563.91,2378,2683.95,1882.74,
23000000000,3592.9,2436.42,2711.11,1850.36,
24000000000,3708.26,2444.57,2643.93,1842.59,
25000000000,3015.4,2313.77,2184.92,1910.12,
26000000000,2807.32,2405.47,2679.15,1773.46,
27000000000,2842.74,2064.88,2442.57,1726.49,
28000000000,2923.7,2289.69,2220.07,1681.87,
29000000000,2862.87,2223.47,2101.12,1573.01,
30000000000,2827.78,2265.6,2083.1,1580.56,
31000000000,2802,2019.46,2072.75,1556.92,
32000000000,2097.9,2138.49,2081.77,1516.63,
33000000000,2980.56,2052.16,1971.63,1417.07,
34000000000,3026.06,2117.18,1870.88,1517.86,
35000000000,2642.39,2100.48,1825.92,1398.95,
36000000000,2443.76,1911.5,1875,1416.46,
37000000000,2686.2,2173.61,2032.5,1422.29,
38000000000,2467.86,2345,1880.02,1522.05,
39000000000,2609.7,2328.92,1975.32,1499.52,
40000000000,1707.3,2430.55,1919.46,1429.37,
41000000000,2758.42,2315.21,2062.08,1513.61,
42000000000,2705.26,2409.62,1945.41,1576.9,
43000000000,3049.22,2390.15,2039.6,1614.5,
44000000000,3006.13,2399.35,1850.74,1554.49,
45000000000,2848.32,2539.18,1993.23,1622.72,
46000000000,2758.02,2575,1969.45,1540.84,
47000000000,2815.34,2354.75,1759.28,1490.9,
48000000000,2290.84,2348.61,1821.53,1525.82,
49000000000,1967.82,2411.12,1879.73,1504.52,
50000000000,2097.92,2406.86,1830.66,1404.08,
51000000000,2110.96,2349.78,1754.52,1428.02,
52000000000,1951.74,2291,1708.19,1383.46,
53000000000,1940.42,2202.5,1790.98,1290.09,
54000000000,1931.12,2398.12,1740.78,1358.68,
55000000000,1918.52,2530.31,1745.41,1265.84,
56000000000,1800.2,2596.37,1686.53,1267,
57000000000,1678.73,2498.18,1710.99,1303.57,
58000000000,1807.07,2419.88,1687.27,1268.55,
59000000000,1818.46,2609.18,1706.24,1283.45,
60000000000,1851.28,2580.94,1669.94,1272.11,
61000000000,1822.38,2632.45,1773.7,1227.01,
62000000000,1820.06,2630.4,1758.41,1259.06,
63000000000,1690.42,2606.19,1629.82,1334.96,
64000000000,1854.94,2549.22,1696.3,1263.02,
65000000000,1723.24,2486.57,1758.41,1277.54,
66000000000,1546.7,2426.5,1681.52,1270.99,
67000000000,1716.72,2397.86,1649.09,1229.13,
68000000000,1684.72,2470.41,1668.62,1243.89,
69000000000,1782.9,2350.77,1657.54,1250.16,
70000000000,1633.49,2271.59,1631.55,1192.93,
71000000000,1658.47,2354.33,1656.23,1214.34,
72000000000,1666.12,2296.06,1641.92,1219.09,
73000000000,1603.36,2364.23,1604.38,1170.98,
74000000000,1609.5,2277.9,1504.52,1121.61,
75000000000,1571.2,2437.61,1544.58,1142.55,
76000000000,1616.36,2253.19,1456.29,1124.94,
77000000000,1463.05,2306.41,1551.62,1132.52,
78000000000,1490,2260.73,1541,1115.51,
79000000000,1536.03,2411.86,1509.14,1109.96,
80000000000,1529.9,2294.99,1539.53,1110.99,
81000000000,1519.81,2298.37,1511.32,1098.26,
82000000000,1598.77,2353.71,1561.94,1129.26,
83000000000,1611.95,2291.42,1413.83,1087.89,
84000000000,1544.12,2279.52,1490.19,1093.09,
85000000000,1487.42,2255.59,1491.04,1143.95,
86000000000,1513.62,2323.63,1568.86,1109.86,
87000000000,1575.34,2263.21,1503.77,1137.77,
88000000000,1592.32,2218.19,1497.29,1129.86,
89000000000,1579.1,2250.68,1484.97,1138.15,
90000000000,1578.54,2221,1414.03,1078.97,
91000000000,1551.23,2169.34,1455.95,1081.23,
92000000000,1498.8,2120.06,1468.04,1131.74,
93000000000,1471.84,2103.51,1380.84,1080.98,
94000000000,1470.63,2046.87,1384.25,1077.13,
95000000000,1527,2067.84,1408.07,1040,
