
Intensity Median
 ==================== 
Time [s],1000000000,1000000001,1000000002,1000000003,1000000004,1000000005,1000000006,
0.000000,729.984,642.912,600.02,731.832,558.064,666.552,945.964,
1.000000,751.007,653.46,602.054,712.03,540.986,671.022,728.056,
2.000000,693.998,677.042,585.968,695,558.965,632.088,679.992,
3.000000,719.063,731.998,618.048,692.97,590.944,639.972,702,
4.000000,981.976,1091.03,855.92,1039.92,667.008,871.544,904.856,
5.000000,1380.95,1691.98,1660.16,1833.88,1007.92,1328.96,1381,
6.000000,1542.96,1928.92,2159.08,2412.48,1276.08,1521.94,1849.98,
7.000000,1525.95,2046.84,2209.7,2388.55,1393.94,1674.01,1895.08,
8.000000,1509.95,2091.21,2418.05,2263.61,1409.91,1648.18,1772.28,
9.000000,1502.97,2090.87,2280.2,2253.1,1345.98,1626.54,1695.78,
10.000000,1500.03,1999.16,2384.13,2266.44,1291.98,1591.91,1625.77,
11.000000,1430.91,1900.94,2198.85,2110.42,1210.05,1416.61,1594.09,
12.000000,1334.9,1838.81,1974.69,1971.61,1141.08,1402.76,1495.19,
13.000000,1253.08,1764.93,1847.42,1758.7,1040.95,1344.08,1525.01,
14.000000,1189.1,1687.25,1587.84,1726.93,990.6,1275.02,1576.1,
15.000000,1125.99,1567.8,1424.32,1554.04,914.972,1194.01,1420.38,
16.000000,1045.07,1418.81,1325.04,1404.02,872.026,1138.99,1351.86,
17.000000,1005.98,1290.01,1188.62,1332.02,866.02,1140.11,1262.04,
18.000000,951.509,1218.95,1134.87,1273.12,808,1093.16,1166,
19.000000,1004.89,1208.97,1107.47,1219.87,833.94,1195.01,1185.97,
20.000000,1180.2,1188.85,1339.93,1408.94,903.96,1418.13,1350.13,
21.000000,1328.33,1393.89,1585.06,1628.09,1014.91,1532.84,1426.97,
22.000000,1419.2,1632.99,1713.26,1820.75,1038.93,1690.83,1512.64,
23.000000,1433.09,1721.2,1831.01,2017.7,1109.03,1671.38,1575.27,
24.000000,1444.2,1814.77,1834.99,2104.77,1060.83,1656.75,1560.16,
25.000000,1417.04,1855.66,1809.7,2143.13,1102.96,1618.97,1574.16,
26.000000,1383.08,1783.86,1787.98,2029.89,1039.92,1532.32,1423.05,
27.000000,1296.06,1743.84,1538.99,1961.7,985.984,1409.82,1371.54,
28.000000,1206.02,1605.05,1473.01,1720.15,958.068,1393.94,1356.03,
29.000000,1115.01,1540.98,1414.09,1675.89,949.56,1285.98,1297.88,
30.000000,1028.99,1386.13,1231.04,1463.8,860.032,1181.01,1191.9,
31.000000,959.029,1285.12,1190.13,1318,802.984,1100.87,1147.02,
32.000000,928.457,1169.07,1113.14,1222.98,772.02,1024.02,1064.93,
33.000000,883.98,1070,997.044,1141.07,754.026,1001.08,1036.11,
34.000000,880.056,1064.82,1021.03,1089.98,704.936,1013.98,1020.92,
35.000000,986.072,992.929,1082.81,1086.51,765.04,1097.86,1061.91,
36.000000,1026.06,1067.01,1140.05,1181.6,817.02,1220.06,1119.14,
37.000000,1015.06,1202.16,1186.93,1272.1,881.488,1292.85,1158.5,
38.000000,1075.06,1256.12,1212.19,1411.86,879.952,1266.7,1151.03,
39.000000,1038.02,1306.67,1294.12,1399.4,895.952,1335.67,1177.5,
40.000000,1045.06,1241.19,1236.79,1272.02,922.028,1345.89,1183.02,
41.000000,999.428,1284.96,1232.6,1244.22,863.032,1283.12,1178.01,
42.000000,930.344,1237.91,1203.54,1223.99,815.056,1249.08,1156.83,
43.000000,955.54,1180.12,1125.99,1168.04,790.988,1173.08,1105.82,
44.000000,899.6,1087.54,1126.08,1133.1,785.955,1203.86,1054.48,
45.000000,857.976,1066.02,1020.54,1071.03,756.075,1095,1031,
46.000000,798.952,1004.48,967.01,969.024,719.028,1071.16,935.908,
47.000000,758.56,926.027,896.976,890.521,679.925,1023.05,886.868,
48.000000,734.04,894.898,840.945,881.5,661.966,919.067,852.488,
49.000000,709.388,828.948,830.032,832.579,645.023,896.096,809.016,
50.000000,724.032,828.522,837.956,821.995,674.008,944.92,864.071,
51.000000,757.072,855.463,833.06,835.056,697,930.048,830.016,
52.000000,747.033,887.529,865.416,913.028,698.968,963.264,889.848,
53.000000,802.968,864.592,878.952,954.082,758.025,976.914,875.12,
54.000000,812.12,893.104,883.95,1009.44,755.032,993.004,876.938,
55.000000,780.994,880.94,909.922,1022.48,760.55,918.067,874.094,
56.000000,762.496,829.596,883.98,991.96,704.005,930.02,867.12,
57.000000,771,822.081,826.984,973.536,693.5,925.99,860.011,
58.000000,731.928,791.972,818.018,927.52,682.465,887.055,841.136,
59.000000,730.064,765.888,792.04,871.056,651.058,874.936,819.088,
60.000000,673.03,722.894,766,844.012,653.975,848.08,766.089,
61.000000,633.048,736.944,750.952,808.466,638.976,826.946,749.522,
62.000000,658.536,696.91,720.028,790.98,627.97,769.996,735.514,
63.000000,654.552,679,676.96,770.029,586.032,768.998,693.004,
64.000000,635.052,664.04,667.018,730.94,604.949,744.909,680.947,
65.000000,643.984,643,655.882,720.072,624.088,754.024,702.965,
66.000000,658.008,674.92,671.043,726.97,618,742.1,694.926,
67.000000,671.968,660.995,678,759.998,629.096,734.059,696.014,
68.000000,665,671.088,688.976,766,644.504,760.984,719.996,
69.000000,704.5,648.952,710.976,809.912,662,782.04,720.96,
70.000000,679.528,665.88,700.99,810.102,636.011,751.94,699.092,
71.000000,656,640.076,690.984,810.92,659.032,743.92,686.049,
72.000000,652.992,646.944,686.052,804.939,628.96,735.989,694.976,
73.000000,658.104,621.022,686.042,762.948,613.024,717.936,687.071,
74.000000,640.054,626.94,661.985,722.98,614.036,714.03,694.007,
75.000000,609.034,603.038,662.98,701.026,611.042,711.04,668.021,
76.000000,597.944,609.08,636.02,727.977,590.924,686.92,667.955,
77.000000,606.972,593.984,627.524,686.962,583.08,662.872,624,
78.000000,595.037,576.964,607.976,694.954,563.032,646.976,633.964,
79.000000,571.976,585.024,599.012,644.967,559.008,638.92,623,
80.000000,578.95,574.488,603.96,649,568.492,639.943,621.995,
81.000000,581.088,581.016,600,638.509,570.525,654.076,601.04,
82.000000,585.96,587.976,606.95,632.544,577.984,666.966,607.05,
83.000000,595.06,593.024,629.06,664.058,597.96,666.99,617.06,
84.000000,586.07,589.04,636.988,656.99,604.956,672.044,648.048,
85.000000,582.048,589.95,654.968,669.088,607.008,651.944,645,
86.000000,603.918,568.989,625.012,674.52,593.99,658.023,616.506,
87.000000,568.984,603.975,623.994,666.96,583.45,658.977,612.056,
88.000000,586.938,571.525,612.959,686.029,599,637.928,607.954,
89.000000,562.972,562,634.021,649.968,590.012,645.974,621.028,
90.000000,573.056,575.492,588.96,635.002,551.995,624.036,607.04,
91.000000,557.968,563.944,583.012,625.935,547.01,606.904,562.015,
92.000000,561.952,541.034,563.99,615.004,549.49,601,587.034,
93.000000,545.028,547.98,551.048,619.15,529.97,614.04,590.984,
94.000000,547,537.035,558.988,605.971,542.992,573.972,561,
95.000000,524.053,541.03,555.032,580.98,531.019,591.98,559.956,
