Frame number,1000000000,1000000001,1000000002,1000000003,1000000004,
0.000000,1445.75,1295.73,1476.31,1069.77,2569.79,
1.000000,1553.87,1257.15,1809.18,1090.43,2131.8,
2.000000,2137.33,1951.65,1572.64,1524.22,2798.46,
3.000000,2123.08,1477.72,725.523,1446.48,3987.63,
4.000000,2291.52,1209.58,758.269,1703.96,5573.48,
5.000000,2469.35,1022.39,1080.58,2070.05,4191,
6.000000,2414.54,1260.46,1367.65,1823.66,1286.94,
7.000000,2475.8,1086.27,1941.76,1418.78,774.724,
8.000000,1789.53,1339.47,2659.63,1446.45,1037.31,
9.000000,1812.22,1459.69,1684.43,886.033,1230.29,
10.000000,1573.79,1757.45,2533.31,939.882,1269.29,
11.000000,1525.24,847.015,3187.36,1031.51,1433.92,
12.000000,1256.77,1262.79,1242.15,1099.39,973.839,
13.000000,987.503,1071.41,2419.49,1112.91,1101.12,
14.000000,1047.25,1505.95,1627.39,1050.05,979.144,
15.000000,994.904,1678.26,2537.99,1047.28,930.469,
16.000000,880.1,1777.34,1833.66,1105.32,809.565,
17.000000,956.311,1847.28,2292.27,1140.11,783.962,
18.000000,1018.85,978.729,2891.72,1243.98,855.646,
19.000000,1137.38,1612.71,2126.37,1377.38,866.648,
20.000000,1147.85,2047.2,3597.19,1510.19,946.167,
21.000000,941.89,2120.42,2443.6,1459.68,926.008,
22.000000,1135.87,3599.75,1615.73,1365.15,994.314,
23.000000,1126.41,4426.02,2230.03,1225.81,961.604,
24.000000,1177.98,2576.4,2955.1,1266.56,743.954,
25.000000,1420.18,2649.4,2734.08,1365.72,960.054,
26.000000,1444.69,3589.83,2567.82,1503,958.988,
27.000000,1140.62,4334.89,2047.24,1458.5,1052.63,
28.000000,1189.54,4450.62,1887.13,1427.63,899.121,
29.000000,1122.06,3396.78,3769.22,1340.02,688.262,
30.000000,1023.15,1070.08,3780.86,1383.8,689.112,
31.000000,789.616,1313.73,3797.43,1335.56,661.254,
32.000000,835.47,1471.8,4145.57,1281.32,771.862,
33.000000,895.849,1381.33,5645.9,1261.76,773.858,
34.000000,838.972,2248.02,3963.92,1266.79,757.75,
35.000000,924.569,2039.8,3643.74,1331.31,679.408,
36.000000,967.509,3519.96,2310.75,1363.52,794.492,
37.000000,887.888,4024.35,2818.53,1459.03,931.973,
38.000000,1083.77,1552.54,4059.95,1493.09,1019.81,
39.000000,1054.36,2662.65,6481.48,1448.6,1035.53,
40.000000,1127.9,1887.73,5458.82,1354.04,962.42,
41.000000,1079.29,2339.33,4316.4,1412.64,975.302,
42.000000,999.519,1362.27,4647.71,1480.26,969.67,
43.000000,1021.65,1430.18,1339.76,1399.25,938.79,
44.000000,1024.03,2668.16,1739.25,1395.8,953.21,
45.000000,974.48,2757.53,2001.71,1304.08,957.338,
46.000000,959.442,4024.37,3026.89,1380.48,927.57,
47.000000,941.749,911.721,4054.5,1183.41,951.544,
48.000000,867.72,1301.8,1562.24,1181.06,933.678,
49.000000,896.12,1887.45,1613.79,1265.67,942.492,
50.000000,873.378,2259.48,3088.64,1221.88,993.52,
51.000000,815.84,2178.42,4352.8,1197.1,968.85,
52.000000,827.739,1212.33,3281.13,1201.44,1046.91,
53.000000,818.349,1532.46,3824.73,1309.67,1028.59,
54.000000,849.793,3632.37,3569.43,1309.55,1027.2,
55.000000,840.488,2425.44,3534.27,1490.35,1100.51,
56.000000,872.84,4598.4,6295.71,1464.47,1154.54,
57.000000,875.4,2354.36,7205.02,1503.56,1100.02,
58.000000,877.292,983.307,4274.84,1378.05,1132.83,
59.000000,856.14,1452.34,4411.16,1379.34,1057.35,
60.000000,850.16,2137.85,3704.62,1344.26,1108.8,
61.000000,875.944,2604.78,3678.65,1309.07,1062.45,
62.000000,865.216,5116.95,4172.7,1216.96,1085.3,
63.000000,788.344,4659.68,2583.27,1214.95,1183.5,
64.000000,835.6,2733.25,2071.82,1128.54,1095.57,
65.000000,810.596,2838.18,3091.29,1143.79,1146.76,
66.000000,915.296,2519.25,1565.27,1170.93,1099.8,
67.000000,830.12,2304.82,4260.65,1206.2,1042.6,
68.000000,859.104,3957.88,5674.97,1245.28,1057.12,
69.000000,826.384,2825.44,6830.34,1241.52,1072.5,
70.000000,904.296,3618.67,4442.16,1160.44,953.669,
71.000000,949.492,2905.92,5407.77,1216.47,847.99,
72.000000,900.32,4548.11,5018.75,1116.56,837.058,
73.000000,866.312,1956.58,4397.68,1083.46,829.575,
74.000000,868.446,2090.01,4518.85,1064.62,807.918,
75.000000,872.86,2707.83,4065.35,1096.44,696.704,
76.000000,874.316,2934.53,3116.27,1011.1,703.428,
77.000000,823.992,1907.56,3100.73,1000.78,696.896,
78.000000,844.8,2249.7,2919.72,987.214,766.849,
79.000000,847.78,3632.53,4684.11,982.868,798.284,
80.000000,834.24,3846.73,4036.57,1002.45,784.579,
81.000000,784.696,4216.87,2322.12,1019.83,712.551,
82.000000,847.028,3902.62,3713.99,1045.2,771.797,
83.000000,904.98,1534.37,2658.14,1066.86,780.562,
84.000000,889.06,1192.66,2848.83,1075.63,745.142,
85.000000,851.644,1348.36,3646.5,1039.8,713.421,
86.000000,881.204,2440.63,3130.67,1038.06,778.239,
87.000000,864.824,1869.17,3832.87,930.962,827.886,
88.000000,820.664,2826.06,5073.57,955.144,766.92,
89.000000,801.164,1696.47,5081.79,938.072,714.287,
90.000000,839.892,3225.66,4092.46,933.576,723.58,
91.000000,865.968,1707.9,2342.88,913.738,718.199,
92.000000,852.796,3750.29,2638.22,933.83,678.149,
93.000000,782.1,1572.45,4320.67,908.76,729.06,
94.000000,790.966,2359.46,2567.28,897.95,761.846,
95.000000,827.99,4127.59,2294.32,877.159,733.894,
