Time [ms],1000000000,1000000001,1000000002,1000000003,
0,723.073,700.5,763.104,671.096,
1000000000,855.986,811.22,891.416,790.16,
2000000000,1076,969.034,1259.12,920.2,
3000000000,1232.16,1121.25,1691.67,1139.32,
4000000000,1400.09,1317.53,1944.7,1235.32,
5000000000,1558.09,1327.37,1830.34,1317.24,
6000000000,1469.78,1223.24,1548.58,1283.06,
7000000000,1274.64,1112.99,1367.86,1187.14,
8000000000,1034.96,980.324,1123.09,1051.15,
9000000000,861.168,899.126,1007.44,891.089,
10000000000,756.168,837.096,873.6,807.636,
11000000000,695.912,754.08,766.948,713.416,
12000000000,657.132,653.06,704.448,688.6,
13000000000,593.424,618.442,671.96,600.085,
14000000000,573.062,620.016,635.028,596.5,
15000000000,519.058,595.038,596.488,575.984,
16000000000,514.5,564.964,558.984,552.5,
17000000000,511.08,539.02,553.98,543.047,
18000000000,542.046,565.025,584,578.008,
19000000000,567.016,600,644.984,599.091,
20000000000,631.04,689.104,701.824,672,
21000000000,722.048,834.72,827.912,709.96,
22000000000,825,946.188,827.08,754.04,
23000000000,885.963,945.24,888.228,816.768,
24000000000,875.2,830.254,876.24,785.965,
25000000000,807.12,804.909,750.99,728.926,
26000000000,767,768.103,731.944,663.134,
27000000000,710.088,740.021,711.048,605.076,
28000000000,632.06,685.004,658.86,626.976,
29000000000,598.02,673.022,589.005,593.998,
30000000000,582.952,614.036,600.025,562.928,
31000000000,550.985,584.93,567.985,554.956,
32000000000,539.036,584.023,540.946,528.025,
33000000000,527.05,554.01,537.016,551,
34000000000,510.009,546.962,526.976,513.042,
35000000000,502.544,539.078,529.08,521.024,
36000000000,518.034,524.958,529.924,525.944,
37000000000,518.536,530.04,577.052,552.49,
38000000000,543.511,537.984,602.95,582.928,
39000000000,550.928,600.048,679.096,622.892,
40000000000,573.012,609.969,668.032,607.948,
41000000000,592.984,628,663.996,638.848,
42000000000,598.058,633,650.986,639.985,
43000000000,566.504,621.972,634.002,608.05,
44000000000,575.968,582.048,629.048,592.96,
45000000000,559,574.984,598.04,572.976,
46000000000,560.936,561.936,565.988,581,
47000000000,555.93,554,556.979,563.026,
48000000000,525.04,542.02,550.032,537.968,
49000000000,519,541.06,532.06,523.508,
50000000000,518.492,515.962,533.982,518.506,
51000000000,506.016,507.986,516.05,512.5,
52000000000,494.008,505.948,504.98,498.934,
53000000000,487.968,498.956,514,506.998,
54000000000,483.514,509.992,511.976,503.025,
55000000000,482.508,512.024,531.084,526.992,
56000000000,500.5,522.05,535,525.497,
57000000000,513.03,549.96,552,548.02,
58000000000,511.47,565.042,549.97,541.973,
59000000000,498.56,544,556.936,553.973,
60000000000,526.98,531.968,569.016,530.072,
61000000000,511.51,533.038,552.984,541.025,
62000000000,514.952,532.992,539.032,542.04,
63000000000,510.52,512.964,551.036,531.012,
64000000000,494.53,514.015,541.961,527.98,
65000000000,493.49,499.95,520.072,512.004,
66000000000,496.006,501.952,500.982,505.98,
67000000000,495.04,497,506.05,517.028,
68000000000,477.012,488.025,494.996,498.556,
69000000000,481.556,477.977,495.51,479.944,
70000000000,469.026,483.02,497.996,490,
71000000000,482.488,475.504,492.964,496.038,
72000000000,483.032,480.972,498.012,505.956,
73000000000,474.52,479.04,513.964,493.488,
74000000000,471.5,494.02,510.035,510.047,
75000000000,481.96,494.96,502,513.992,
76000000000,495.984,493.49,505.034,517.028,
77000000000,478.012,492,503.968,504.044,
78000000000,484.08,477.054,508.96,510.016,
79000000000,467.986,493.048,487.024,481.985,
80000000000,476.04,494.965,490,492.983,
81000000000,490.032,480.06,499.036,497.011,
82000000000,469.006,473.988,488.975,499.984,
83000000000,476.01,470.968,491.962,492.976,
84000000000,472.04,473.017,478.036,479.034,
85000000000,475.004,468.976,480.992,485.038,
86000000000,466,469.966,476.964,489.996,
87000000000,474.02,477.017,479.026,481.992,
88000000000,472.992,479.05,486.05,482.036,
89000000000,468.976,474.02,495.052,485.04,
90000000000,458.032,476,473.04,494,
91000000000,464.056,465.02,492,486.044,
92000000000,468.992,474.02,486.008,490.016,
93000000000,459.99,489.004,487.973,492.032,
94000000000,465.466,473.972,474.981,487.008,
