Time [ms],1000000000,1000000001,1000000002,1000000003,
0,601.48,597.1,568.934,557.036,
1000000000,614.086,621.04,601.019,639.54,
2000000000,764.112,739.084,728.088,775.912,
3000000000,918,827.088,945.96,893.97,
4000000000,1026,848.104,926.984,937.168,
5000000000,1042.9,876.836,989.212,949.112,
6000000000,970.676,785.05,910.115,913.84,
7000000000,921.016,810.06,821.809,818.114,
8000000000,859.02,741.996,821.026,814.884,
9000000000,803.108,702,787.988,741.942,
10000000000,770.924,672,680.92,716.95,
11000000000,732.1,651.96,672.96,644,
12000000000,684.068,633.048,669.032,633.008,
13000000000,678.97,579.116,626.084,600.924,
14000000000,644.045,586.084,595.02,568.012,
15000000000,644.854,578.144,610.015,545.904,
16000000000,605.028,572.023,580.952,535.048,
17000000000,576.996,588.04,578.069,556.95,
18000000000,580.03,587.06,550,542.505,
19000000000,583.016,561.928,579.03,564.022,
20000000000,593.969,583.862,562.953,575.5,
21000000000,640.055,618.071,560.92,636.436,
22000000000,684.982,680.93,670.108,689.48,
23000000000,714.93,715.96,700.047,718.105,
24000000000,703.898,708.792,755.949,722.063,
25000000000,693.956,687.064,720.91,701.022,
26000000000,663.044,678.924,720.003,686.999,
27000000000,670.09,648.188,687.997,670.495,
28000000000,643.848,643.92,623.976,659.52,
29000000000,607.96,615.114,696.054,642.476,
30000000000,601.126,593.992,615.125,590.476,
31000000000,593.01,569.968,615.107,577.945,
32000000000,578.994,604.9,599.002,577.533,
33000000000,573.948,591.096,568.945,557.007,
34000000000,549.064,568.946,572.982,544.52,
35000000000,547.039,574.928,566.967,553.42,
36000000000,544,539,534.899,534.072,
37000000000,538.964,521.942,506.978,522.05,
38000000000,520.003,537,505.984,523.016,
39000000000,544.932,546.9,509.974,515.996,
40000000000,583.003,568.952,508.088,542.512,
41000000000,618.822,582.009,520.902,548.49,
42000000000,644.986,615.936,553.987,567.975,
43000000000,646.082,617.981,569.013,586.947,
44000000000,628,618.961,613.064,613.504,
45000000000,630.032,604.073,588.004,599.96,
46000000000,619.007,630.976,608.078,603.55,
47000000000,604.047,595.16,606.112,584.99,
48000000000,596.016,592.914,582.915,575.443,
49000000000,584.96,574.947,593.003,559.94,
50000000000,562.05,577,571.002,557.464,
51000000000,595.967,557.969,540.958,528.49,
52000000000,570.022,549,551.92,544.54,
53000000000,547.051,558,533.051,540,
54000000000,520.996,547.968,520.036,504.488,
55000000000,530.003,524.055,518.995,517.48,
56000000000,547.1,536.052,508.954,517.51,
57000000000,546.092,510.038,504.011,517.999,
58000000000,542.04,546.916,500.022,521.03,
59000000000,549.08,550.944,507.993,515.462,
60000000000,561,578.971,515.92,545.482,
61000000000,569.512,591.968,502.009,546.518,
62000000000,584.514,578,524,542.05,
63000000000,566.5,550.015,539.009,562.967,
64000000000,578.58,573.016,542.025,570,
65000000000,578.49,539.068,540.04,551.495,
66000000000,560.972,561.984,541.956,531.552,
67000000000,574.032,559,542.062,538.55,
68000000000,550.984,542.088,507.033,531.948,
69000000000,523.456,504.971,539.96,527.032,
70000000000,540.06,530.943,495.951,507.976,
71000000000,506.999,536.9,504.986,528.968,
72000000000,523.008,535.032,518.023,512.988,
73000000000,512.98,524.008,498.05,506.007,
74000000000,513.014,503.036,501.99,512.006,
75000000000,512.992,507.944,487.056,505.976,
76000000000,513.515,519.04,502.98,493.023,
77000000000,510.468,523.016,499.968,501.964,
78000000000,518.046,525,491.037,521.508,
79000000000,529.6,533.038,487,507.518,
80000000000,540.516,524.988,500.002,511.5,
81000000000,530.468,524.942,509.995,510.999,
82000000000,526.97,528.05,504.997,532.08,
83000000000,536.52,545.952,503.058,517.047,
84000000000,528.05,540,506.94,503.998,
85000000000,515.463,514.026,501.981,513.096,
86000000000,505.008,514,500.058,516.004,
87000000000,517.512,508.928,509.93,484.943,
88000000000,521.504,523.024,502.987,511.06,
89000000000,498.008,522.96,501.961,503.92,
90000000000,511.504,502.976,483.964,502.972,
91000000000,497.025,500.02,487.017,485.986,
92000000000,489.532,486.964,499.048,493.02,
93000000000,493.98,500.984,495.956,495.002,
94000000000,493.51,499.013,485.008,488.04,
95000000000,497.468,499.008,490.008,483,
