Frame number,1000000000,1000000001,1000000002,
0.000000,28001.4,65529.2,55212.6,
1.000000,16255.2,46833.1,35186.2,
2.000000,16938.4,16491.3,16431.9,
3.000000,14516.5,8021.72,9108.68,
4.000000,12302.2,4037.01,7358,
5.000000,9851.32,3585.6,5725.02,
6.000000,7075.86,3017,4390.23,
7.000000,6317.38,2640.57,4063.38,
8.000000,5150.22,2269.71,3502.25,
9.000000,4997.8,2065.57,3040.58,
10.000000,4893.1,1966.94,3475.82,
11.000000,4348.34,1807.46,3254.78,
12.000000,3968.85,1705.82,3164.45,
13.000000,3768.9,2013.5,3087.71,
14.000000,3659.62,2737.07,3309.81,
15.000000,4079.87,4093.4,4234.07,
16.000000,5210.67,5126.82,5161.87,
17.000000,7080.11,5222,5030.59,
18.000000,7641.52,4736.1,4864.75,
19.000000,6973.55,3998.62,4777.13,
20.000000,6157.05,3466.68,4365.31,
21.000000,5413.73,2960.34,3788.88,
22.000000,4043.6,2374.72,3004.38,
23.000000,3482.83,1967.1,2546.78,
24.000000,3158.86,1738,2178.8,
25.000000,2833.44,1470.76,2078.78,
26.000000,2364.33,1394.14,1715.94,
27.000000,2870.79,1423.52,1817.89,
28.000000,3015.49,1426.04,1756.76,
29.000000,2805.57,1598.24,1695.16,
30.000000,3088.49,2246.25,1926.27,
31.000000,3764.28,3218.16,2939.95,
32.000000,5249.42,3650.3,3309.32,
33.000000,5898.68,3576.33,3183.95,
34.000000,5491.6,3141.81,3100.94,
35.000000,4716.08,2856.72,2899.35,
36.000000,4004.05,2685.02,2890.14,
37.000000,3296,2298.25,2774.28,
38.000000,2714.26,2234.97,2460.19,
39.000000,2554.98,2018.92,2169.49,
40.000000,2081.14,1968.78,1747.14,
41.000000,1864.24,1861.77,1619.93,
42.000000,1573.19,1676.93,1442.16,
43.000000,1484.84,1662.86,1329.27,
44.000000,1426.77,1622.11,1296.24,
45.000000,1566.15,1766.25,1318.15,
46.000000,1827.84,2450.66,1597.73,
47.000000,2540.63,3337.45,2247.9,
48.000000,3612.85,4097.69,2998.64,
49.000000,4396.21,3883.9,3171.9,
50.000000,4271.44,3578.91,2823.3,
51.000000,3818.5,3058.72,2520.79,
52.000000,3437.83,2689.1,2275.78,
53.000000,2783,2303.13,1974.24,
54.000000,2397.99,1969.05,1928,
55.000000,1975.29,1754.86,1720.34,
56.000000,1665.5,1603.2,1512,
57.000000,1494,1448.13,1337.96,
58.000000,1439.49,1333.95,1248.93,
59.000000,1387.11,1289.02,1147.04,
60.000000,1375.89,1376.03,1073.96,
61.000000,1401.6,1693,1056.88,
62.000000,1609.2,2315.86,1272.25,
63.000000,2261.32,3260.81,1602.74,
64.000000,3206.88,3798.5,2227.75,
65.000000,3794.72,3808.77,2558.08,
66.000000,3809.89,3408.08,2649.5,
67.000000,3506.86,3032.05,2337.52,
68.000000,3007,2653.79,2097,
69.000000,2531.64,2289.03,1934.46,
70.000000,2276.1,2056.89,1778.6,
71.000000,2026.97,1792.15,1588.82,
72.000000,1847.49,1645.04,1394.48,
73.000000,1668,1475.87,1253.86,
74.000000,1547.08,1395.1,1196.15,
75.000000,1515.94,1404.07,1178.19,
76.000000,1434.82,1437.97,1003.76,
77.000000,1502,1762.02,976.952,
78.000000,1814.84,2465.23,1058.83,
79.000000,2547.49,3304.18,1296.29,
80.000000,3403.56,3861.34,1767.62,
81.000000,3752.06,3777.17,2266.89,
82.000000,3663.08,3336.06,2227.4,
83.000000,3274.98,2927.77,2147.02,
84.000000,2828.2,2539.2,2070.33,
85.000000,2372.06,2325.8,1944.18,
86.000000,2120.31,2033.12,1697.25,
87.000000,1908.8,1833.9,1587.82,
88.000000,1693.26,1602.97,1440.73,
89.000000,1593.07,1547.95,1346.82,
90.000000,1450.12,1400.8,1183.8,
91.000000,1367,1362.1,1134.16,
92.000000,1317.9,1405.03,1028.94,
