Frame number,1000000000,1000000001,
0.000000,20081.7,7620.38,
1.000000,8089.07,4953.12,
2.000000,9552.02,6623.92,
3.000000,16165.8,7888.76,
4.000000,14549.1,7396.76,
5.000000,11759,7051.31,
6.000000,9514.8,5736.13,
7.000000,6444.02,4884.43,
8.000000,5671.2,4177.97,
9.000000,4526.16,3709.73,
10.000000,3963.81,3081.75,
11.000000,3478.47,2761.5,
12.000000,3029.47,2369.53,
13.000000,2662.76,2126.52,
14.000000,2115.62,1862,
15.000000,1866.51,1825.34,
16.000000,1781.78,2367.32,
17.000000,2292.35,2927.91,
18.000000,2946.03,4174.24,
19.000000,3611.51,4479.08,
20.000000,3926.62,4370.74,
21.000000,3973.95,3867.65,
22.000000,3860.2,3374.26,
23.000000,3600.49,3253.72,
24.000000,3231.76,2669.06,
25.000000,3031.99,2602.14,
26.000000,2822.3,2348.36,
27.000000,2438.95,1951.22,
28.000000,2228.79,1805.7,
29.000000,2043.56,1781.21,
30.000000,1863.13,1618.56,
31.000000,1821.69,1695.11,
32.000000,1706.92,1721.21,
33.000000,1737.62,2119.5,
34.000000,1926.03,2611.2,
35.000000,2203.75,3178.01,
36.000000,2462.11,3485.66,
37.000000,2760.57,3471.55,
38.000000,2821.14,3329.74,
39.000000,3003.84,3164.53,
40.000000,2849.99,2791.25,
41.000000,2806.69,2412.41,
42.000000,2450.37,2219.6,
43.000000,2384.57,1994.17,
44.000000,2308.83,1806.17,
45.000000,2071.4,1562.26,
46.000000,1931.73,1501.11,
47.000000,1822.94,1515.38,
48.000000,1745.85,1482.79,
49.000000,1648.63,1603.38,
50.000000,1617,1820.59,
51.000000,1704.9,2054.33,
52.000000,1780.01,2345.82,
53.000000,2025.43,2483.8,
54.000000,2051.66,2619.68,
55.000000,2385.6,2624.79,
56.000000,2542.7,2460.72,
57.000000,2442.13,2209.1,
58.000000,2519.34,2084.54,
59.000000,2192.45,1801.7,
60.000000,2275.08,1717.74,
61.000000,2118.25,1487,
62.000000,1951.01,1379.2,
63.000000,1789.55,1288.76,
64.000000,1745.08,1197.04,
65.000000,1723.32,1181.02,
66.000000,1586.5,1169.09,
67.000000,1628.3,1291.9,
68.000000,1647.5,1440.8,
69.000000,1655.36,1710.16,
70.000000,1685.1,1834.2,
71.000000,1702.9,2069.82,
72.000000,1830.45,2280.34,
73.000000,1942.55,2176.31,
74.000000,2013.38,2049.52,
75.000000,2072,1940.06,
76.000000,2010.1,1778.92,
77.000000,1910.47,1625.28,
78.000000,1875.92,1496.09,
79.000000,1696.16,1438.99,
80.000000,1659.84,1267.06,
81.000000,1580.09,1146.78,
82.000000,1474.62,1127.17,
83.000000,1361,1138.75,
84.000000,1421.31,1197.88,
85.000000,1336.67,1211.4,
86.000000,1350.3,1382.8,
87.000000,1285.91,1529.92,
88.000000,1465.48,1679.47,
89.000000,1391.89,1823.11,
90.000000,1628.24,1870.52,
91.000000,1731.04,1852.41,
92.000000,1688.35,1768.12,
93.000000,1787.03,1639.01,
94.000000,1880.65,1551.94,
