Time [ms],1000000000,1000000001,1000000002,1000000003,
0,653,598.1,586.992,524.978,
1000000000,635.92,639.156,584.04,551.033,
2000000000,702.59,687.878,719.034,585.516,
3000000000,775.813,829.738,747,643.499,
4000000000,873.196,901.744,829.112,723.508,
5000000000,840.028,944.8,867.908,758.001,
6000000000,932,941.376,898.206,767.566,
7000000000,874.86,936.944,835.84,744.89,
8000000000,871.278,860.928,832.06,744.964,
9000000000,849.969,863.188,808.86,716.09,
10000000000,855.04,757.18,756.071,676.061,
11000000000,800.005,715.156,687.1,660.026,
12000000000,775.854,741.968,655.384,652.976,
13000000000,723.091,642.67,626.016,607.016,
14000000000,699.873,606.878,603.473,598.973,
15000000000,630.017,626.19,591.504,573.112,
16000000000,609.842,579,563.85,548.97,
17000000000,611.176,578.078,549.056,536.012,
18000000000,605.079,542.948,556.032,561.076,
19000000000,604.011,559.008,553.07,539.078,
20000000000,598.1,564.948,549.952,542.99,
21000000000,628.077,600.92,580.484,540.968,
22000000000,653.018,646.157,592.48,560.008,
23000000000,707.855,721.961,651.484,567.97,
24000000000,742.875,797.938,666.46,619.039,
25000000000,717.13,727.042,675.028,606.856,
26000000000,734.876,703.139,697.086,600.073,
27000000000,664.095,699.184,662.412,606.1,
28000000000,664.075,698.244,667.552,589.072,
29000000000,657.159,631.054,629.56,559.064,
30000000000,616.115,604.932,634.015,553.044,
31000000000,643.954,604.796,573.033,525.935,
32000000000,624.068,611.03,620.056,534.088,
33000000000,619,583.142,575,522.09,
34000000000,624.664,570.085,579.536,514.008,
35000000000,586.53,548.076,552.499,533.912,
36000000000,570.6,522.052,565.528,502.928,
37000000000,586.948,524.984,531.5,498.959,
38000000000,562.509,542.087,522.938,512.98,
39000000000,561.582,533.084,535.52,499.082,
40000000000,566.062,587.051,534.6,491.986,
41000000000,613,598.98,567.125,526.008,
42000000000,615.024,635.888,579.521,532.08,
43000000000,638.516,661.914,576.448,549.988,
44000000000,667.052,624.052,582.956,544.952,
45000000000,652.11,666.888,598.467,566,
46000000000,653.488,620.16,605.608,543.96,
47000000000,629.1,629.936,586.376,545.944,
48000000000,601.56,580.935,597.543,530.964,
49000000000,601.528,577.999,576.995,513.022,
50000000000,582.005,547.048,562.494,510.982,
51000000000,582.064,537.074,543.044,514,
52000000000,550.08,525.896,559.489,501.072,
53000000000,549.512,532.04,536.108,486.94,
54000000000,536.982,522.942,531.47,500.992,
55000000000,539.572,527.984,513.024,485.02,
56000000000,539.004,509.076,530.437,477.944,
57000000000,528.416,515.943,512.98,484.991,
58000000000,551.008,519.939,529.52,481.002,
59000000000,542.448,554.949,528.996,494.936,
60000000000,581.076,545.01,541.564,481.936,
61000000000,607.527,587.092,554.534,513.97,
62000000000,603.5,575.013,553.969,499,
63000000000,592.04,601.14,562.042,527.044,
64000000000,601.496,573.07,576.53,532.936,
65000000000,581.502,590.152,539.015,492.983,
66000000000,580.56,551.946,550.02,515.959,
67000000000,570.54,520.056,532.496,489.938,
68000000000,578.48,521.043,546.552,493,
69000000000,577.532,496.906,535.508,486.066,
70000000000,533.528,551.064,534.47,484.078,
71000000000,550,517.952,529.02,472.96,
72000000000,532.492,516.007,520.456,479.068,
73000000000,538.504,500.838,532.004,469.04,
74000000000,516.992,522.959,512.94,471.028,
75000000000,527.112,514.112,500.04,476.985,
76000000000,541.504,521.02,502.014,472.04,
77000000000,530.486,523.036,515.48,470.016,
78000000000,547.504,513.044,536.495,481,
79000000000,552.016,534.952,523.526,472.979,
80000000000,560,533.027,551.496,470.944,
81000000000,542.036,531.972,531.967,478,
82000000000,570.592,537.952,516.96,478.016,
83000000000,547.58,544.932,537.88,483.992,
84000000000,546.436,531.037,534.92,469,
85000000000,579.48,519.968,545.971,493.024,
86000000000,537.052,515.968,526.081,482.955,
87000000000,523.979,513.983,506.064,479.95,
88000000000,542.988,504.044,513.96,477.973,
89000000000,521.02,505.956,527.964,480.96,
90000000000,541.528,506.912,517.984,463.944,
91000000000,524.046,502.04,512.015,474.04,
92000000000,530.49,504.02,512.026,472.05,
93000000000,519.46,507.024,523.013,468.92,
94000000000,513,519.08,508.985,474.976,
95000000000,530.532,509.02,496.904,480.016,
