Time [ms],1000000000,1000000001,
0,2437.5,2482.61,
1000000000,2435.58,1716.09,
2000000000,2086.36,1620.91,
3000000000,2232.62,1736.77,
4000000000,3636.92,1897.15,
5000000000,2758.83,1781.07,
6000000000,2732.31,2073.09,
7000000000,2745.94,1922.6,
8000000000,2578.05,1881.69,
9000000000,2306.96,1771.18,
10000000000,1901.59,1692.68,
11000000000,1680.25,1423.32,
12000000000,1495.8,1466,
13000000000,1413.18,1382.67,
14000000000,1283.89,1303.69,
15000000000,1171.16,1214.26,
16000000000,1094.66,1087.09,
17000000000,1114.07,1044.12,
18000000000,1106.98,1099.94,
19000000000,1049.03,1139.81,
20000000000,1123.89,1245.91,
21000000000,1112.1,1257.36,
22000000000,1084.13,1268.76,
23000000000,1139.52,1179.08,
24000000000,1194.94,1152.1,
25000000000,1157.92,1064.14,
26000000000,1091.98,1052.89,
27000000000,1066.95,1021.08,
28000000000,993.124,944.5,
29000000000,934.967,889.05,
30000000000,909.038,859.954,
31000000000,863.098,842.003,
32000000000,842.004,818.105,
33000000000,837.9,818.92,
34000000000,836.964,826.896,
35000000000,812.956,841.02,
36000000000,780.942,793.024,
37000000000,830.996,748.02,
38000000000,856.016,776.12,
39000000000,845,784.94,
40000000000,810.028,748.065,
41000000000,794.016,757.023,
42000000000,744.056,747.976,
43000000000,740.026,742.068,
44000000000,697.025,727.993,
45000000000,674.936,743,
46000000000,663.977,716.028,
47000000000,662.968,678.952,
48000000000,662.974,684.993,
49000000000,666,691.03,
50000000000,633.045,682.036,
51000000000,659.976,684.955,
52000000000,667.016,675.031,
53000000000,681.044,679.048,
54000000000,678.99,689.075,
55000000000,633.955,660.024,
56000000000,653.026,636.936,
57000000000,629.963,659.99,
58000000000,613.981,627.478,
59000000000,597.056,605.968,
60000000000,603.98,614,
61000000000,575.956,603.992,
62000000000,587.475,599.026,
63000000000,589.52,609.028,
64000000000,602.041,589.024,
65000000000,596.055,590.973,
66000000000,592.005,587.022,
67000000000,586.026,596.024,
68000000000,603.974,592.04,
69000000000,596.05,592.996,
70000000000,595.988,575.992,
71000000000,579.966,576.992,
72000000000,567.025,570.98,
73000000000,563.472,562.026,
74000000000,568.003,561.99,
75000000000,555.476,559.977,
76000000000,543.024,547.048,
77000000000,545.484,541.99,
78000000000,559.994,552,
79000000000,551.04,553.004,
80000000000,549.005,555.024,
81000000000,568,548.028,
82000000000,554.472,554.985,
83000000000,549.504,552.056,
84000000000,560.04,547.508,
85000000000,537.52,534.01,
86000000000,543.092,530.964,
87000000000,550.004,539.015,
88000000000,537.006,549.52,
89000000000,540.04,530.965,
90000000000,535.028,538.055,
91000000000,553.948,532.019,
92000000000,531.984,513.004,
93000000000,532.932,496.978,
94000000000,545.996,488.984,
95000000000,544.056,506.984,
