Frame number,1000000000,1000000001,1000000002,1000000003,
0.000000,588.08,584.912,548.05,562.04,
1.000000,608.912,589.976,599.548,608.52,
2.000000,776,620.125,686.556,690.051,
3.000000,987.5,660.386,652.093,843.1,
4.000000,979.9,697.37,741.948,992.88,
5.000000,1223.32,827.25,789.192,729.918,
6.000000,1059.27,771.096,805.118,784.912,
7.000000,894.356,751.72,745.987,797.056,
8.000000,932.192,747.25,654.06,776.12,
9.000000,917.89,755.047,660.06,808.056,
10.000000,826.72,651.6,644.12,745.042,
11.000000,751.926,670.93,603.15,597.456,
12.000000,694.048,584.509,590.056,601.952,
13.000000,680.102,571.992,610.004,590.036,
14.000000,721.992,587.02,581.954,570.022,
15.000000,674.93,569.042,546.978,576.976,
16.000000,650.032,563.972,551.53,548.972,
17.000000,606.952,576.54,536.05,548,
18.000000,642.017,539.016,523.017,526.96,
19.000000,651.86,543.976,520.994,545.52,
20.000000,630.904,568.528,525.02,542.518,
21.000000,698.928,591.992,566.928,566.958,
22.000000,759.98,578.002,582.008,573.038,
23.000000,771.416,602.01,558.552,566.989,
24.000000,790.984,583.884,592.44,582.932,
25.000000,765.98,555.55,574.072,569.084,
26.000000,720.42,554.032,556.048,582.056,
27.000000,691.944,569.992,559.955,570.064,
28.000000,641.048,536.128,552.004,563.05,
29.000000,565.024,557.024,537.036,544.014,
30.000000,583.948,516.072,517.924,529.007,
31.000000,565.048,532.004,484,521.996,
32.000000,540.952,524.004,513.04,499.452,
33.000000,543.976,517.984,509.02,505,
34.000000,541.92,500.979,496.04,491.956,
35.000000,552.96,491.016,486.032,486.024,
36.000000,530.922,501.952,496.034,487.018,
37.000000,521.05,497.962,486.986,485.994,
38.000000,523.988,497.956,503.092,483.997,
39.000000,538.034,489.032,479.994,490.451,
40.000000,554.488,487.952,502.95,486.896,
41.000000,548.987,528.992,531.028,519,
42.000000,610.05,519.96,517.005,522.92,
43.000000,628.5,508.957,518.016,519.06,
44.000000,603,504.02,538.058,531.02,
45.000000,602.96,511.006,518.504,504,
46.000000,572.996,479.5,492.534,517.936,
47.000000,564.468,490.024,496.96,504.986,
48.000000,537.025,476.963,496.019,494.014,
49.000000,557.937,482.04,484.985,491.056,
50.000000,553.964,478.004,485.992,500.016,
51.000000,544.04,466.044,480.973,489,
52.000000,500.993,470.984,476.992,486.008,
53.000000,486.028,456.024,469.45,476.016,
54.000000,504.988,462.016,458.026,470.044,
55.000000,504.031,465.984,453.989,476,
56.000000,490.046,470.027,465.04,478.975,
57.000000,478.973,479.014,454.03,472.06,
58.000000,491.97,469.992,460.976,462.964,
59.000000,512.032,482.952,467.98,474.003,
60.000000,514.018,500.036,476.016,487.035,
61.000000,495.458,463.012,478.996,475.08,
62.000000,475.02,478.987,471.008,475.015,
63.000000,502.012,477.995,463.962,475.048,
64.000000,484.976,472.03,474.984,496.96,
65.000000,492,470.958,464.991,494.011,
66.000000,488.996,473.016,457,482.973,
67.000000,475.982,471.035,453.98,486.987,
68.000000,470.99,462.981,461.018,482.528,
69.000000,487.024,465.996,451.975,465.991,
70.000000,468.986,462.027,445,468.025,
71.000000,466.962,448,447.008,464.48,
72.000000,463.952,449.986,439.992,469.972,
73.000000,465.989,459,437.504,449.504,
74.000000,466.026,451.986,438.504,461.994,
75.000000,492.051,462.004,439.983,473,
76.000000,481.95,460.001,449.965,461.988,
77.000000,481.941,465,448.964,486.012,
78.000000,472.994,471.04,442.976,489.036,
79.000000,487.044,461.972,458.016,477,
80.000000,483.983,461.016,456.044,480.024,
81.000000,476.516,461.022,453.995,476.969,
82.000000,476.992,465.996,438.995,474.008,
83.000000,483.516,446.032,453.009,467.969,
84.000000,476.512,449.035,446.014,466.987,
85.000000,469.048,465.009,457,462.025,
86.000000,456.044,450.99,441.992,473.025,
87.000000,458.06,451.96,441.972,444.044,
88.000000,468.008,439.008,434.049,451.96,
89.000000,455.973,449.008,446,451.006,
90.000000,460.983,448.027,434.024,454.98,
91.000000,453.976,430.04,435.994,444,
92.000000,464.014,441.99,441.031,454.018,
93.000000,456.976,438.98,439.046,456.014,
94.000000,473.02,443.044,451.044,458.984,
95.000000,463.016,458.992,436.98,463.045,
