Frame number,1000000000,1000000001,1000000002,1000000003,
0.000000,691.008,1397.58,1026.09,873.98,
1.000000,1063.02,1791.16,1621.96,860,
2.000000,1473.08,1641.99,2032.94,1085.44,
3.000000,1858.42,1892.96,2710.28,1537.85,
4.000000,2145.12,2166.1,3391.27,2279.18,
5.000000,2153.86,2235.18,3710.95,2437.91,
6.000000,2186.48,2312.04,3712.78,2567,
7.000000,2060.64,2169.78,3503.46,2331.77,
8.000000,1959.86,2185.69,3566.92,2380.1,
9.000000,1826.42,2055.16,3202.85,2288.83,
10.000000,1728.95,1954.16,3042,2262.95,
11.000000,1704.68,1863.79,2890.63,2294.2,
12.000000,1568.01,1762.05,2680.54,2399.28,
13.000000,1603.91,1745.79,2442.38,2357.02,
14.000000,1623.13,1738.22,2405.01,2191.76,
15.000000,1634.12,1691.2,2316.61,2151.89,
16.000000,1566.32,1632.15,2315.38,1896.13,
17.000000,1597.11,1678.15,2346.36,1784.91,
18.000000,1632.09,1698.72,2490.49,1700.91,
19.000000,1842.03,1731.27,2538.07,1705.99,
20.000000,1798.12,1872.68,2583.52,1643.06,
21.000000,1802.08,1850.28,2519.93,1622.08,
22.000000,1792.2,1856.17,2475.89,1666.83,
23.000000,1788.96,1767.03,2308.14,1624.76,
24.000000,1568.32,1610.48,2123.99,1618.9,
25.000000,1486.14,1488.4,2215.56,1448.91,
26.000000,1408.13,1400.84,2122.1,1332.04,
27.000000,1317.94,1305.88,1974.9,1361.92,
28.000000,1222.91,1285.11,1922.11,1286.03,
29.000000,1196.96,1196.09,1757.89,1269.88,
30.000000,1154.07,1203.93,1663.05,1226.89,
31.000000,1109.92,1118.25,1493.52,1189.94,
32.000000,1092.97,1135.03,1437.03,1151,
33.000000,1223.93,1139,1409.63,1121.91,
34.000000,1302.96,1228.41,1492.1,1171.01,
35.000000,1370.07,1206.02,1519.81,1173.61,
36.000000,1413.96,1227.13,1441.58,1167.99,
37.000000,1348.5,1224.23,1445.4,1160.57,
38.000000,1388.59,1232.03,1448.53,1101.39,
39.000000,1286.02,1155,1453.59,1207.88,
40.000000,1191.52,1100.02,1424.91,1310.18,
41.000000,1107.5,1055.82,1456.24,1228.08,
42.000000,1043.54,1010.93,1344.93,1140.08,
43.000000,1012.95,973.9,1320.96,1191.58,
44.000000,979.932,960.952,1291.83,1076.11,
45.000000,949.588,933.072,1233.24,1067.91,
46.000000,941.956,886.068,1206.08,1047.6,
47.000000,894.4,860.894,1159.14,1122.07,
48.000000,895.98,893.926,1119.28,1116.12,
49.000000,939.52,935.038,1153.39,1115.99,
50.000000,961.956,947.15,1189.49,1142.9,
51.000000,928,934.006,1179.13,1178.9,
52.000000,953.892,909.04,1153.71,1141.99,
53.000000,995.248,939.12,1225.93,1096.41,
54.000000,1001.94,937.848,1207.07,1112.5,
55.000000,983.204,914.986,1170,1116.92,
56.000000,949.976,907.009,1145.95,1171.06,
57.000000,934.898,917.973,1132.26,1190.94,
58.000000,861.92,855.098,1111.13,1205.06,
59.000000,844.06,847.978,1054.16,1127.94,
60.000000,830.948,830.914,1000.89,1071.94,
61.000000,785,795.082,927,1043.06,
62.000000,771.94,774.985,980.088,1051,
63.000000,782.002,750.9,900,929.1,
64.000000,783.018,761.968,946.692,868.064,
65.000000,810.909,774.14,937.764,910.888,
66.000000,788.08,732.84,928.852,939.811,
67.000000,829.884,777.018,916.904,952.068,
68.000000,850.99,791.1,948,979.91,
69.000000,873.076,801.06,929.928,1005.15,
70.000000,861.52,766.948,942.616,977.088,
71.000000,870.488,778.008,911.668,970.109,
72.000000,823.5,741.516,860.77,1006.94,
73.000000,795.044,740.012,883.06,1047.99,
74.000000,787.052,748.492,884.948,1007.92,
75.000000,757.576,708.428,880.9,972.045,
76.000000,727.788,719.04,819.97,956.006,
77.000000,732.915,690.496,854.04,976.112,
78.000000,716.058,685.1,770.864,968.035,
79.000000,788.952,690.6,764.134,922.856,
80.000000,723.919,671.008,850.118,910.974,
81.000000,720.95,668.072,844.132,874.03,
82.000000,750.472,670.08,880.488,876.08,
83.000000,724.988,715.082,798.994,918.064,
84.000000,744.4,689.944,909.034,854.996,
85.000000,762.472,682.028,899.95,878.104,
86.000000,760.988,690.032,878.01,876.044,
87.000000,745.928,676.966,866.88,911.068,
88.000000,722.5,670.952,854.928,917.057,
89.000000,688.012,659.04,861.98,866.01,
90.000000,690.504,668.92,826.116,872.944,
91.000000,684,647.976,790.068,873.976,
92.000000,675.968,653.944,752.096,852.075,
93.000000,673.956,622.016,795.98,842.03,
94.000000,651.008,672.024,796.484,826.974,
95.000000,652.484,664.924,779.94,835.953,
