Time [ms],1000000000,1000000001,1000000002,
0,681.06,527.947,548.998,
1000000000,888.938,729.06,607.572,
2000000000,1200.58,850.912,602.94,
3000000000,1558,1322.54,707.926,
4000000000,2020.33,1509.68,766.98,
5000000000,1931.75,1565.19,829.4,
6000000000,1739.92,1722.23,895.12,
7000000000,1734.52,1537.73,889.44,
8000000000,1573.58,1092.36,850.02,
9000000000,1236.95,1081.94,788.128,
10000000000,1156.89,1042.15,773.512,
11000000000,1135.98,916.056,662.031,
12000000000,1017.05,907,685.134,
13000000000,875.352,743.052,637.952,
14000000000,812.094,692.096,609.944,
15000000000,742.501,639.014,594.884,
16000000000,686.044,628.104,598.007,
17000000000,663.532,632.028,581.048,
18000000000,613,584.02,603.923,
19000000000,636.48,624,590.91,
20000000000,622.06,618.984,609.066,
21000000000,626.976,675.084,629.078,
22000000000,681.588,724.6,663.976,
23000000000,686.508,776,714.464,
24000000000,718.104,797.468,769.44,
25000000000,683.132,792.544,718.109,
26000000000,662.08,747.077,724.965,
27000000000,731.084,743.14,727.025,
28000000000,755.575,698.188,664.952,
29000000000,713.072,706.07,658.126,
30000000000,682.476,640,612.086,
31000000000,661.92,609.028,591.065,
32000000000,662.925,577.98,572,
33000000000,650.037,614.026,572,
34000000000,638.992,635.132,582,
35000000000,599.96,582.035,566.976,
36000000000,591.944,619.06,561.976,
37000000000,599.96,593.916,547.055,
38000000000,611.005,586.014,554.04,
39000000000,646.035,604.952,551.056,
40000000000,660.016,595.026,558.013,
41000000000,692.064,618.024,556.98,
42000000000,752.08,656.116,591.096,
43000000000,779.944,617.788,579.04,
44000000000,793.08,610.893,589.035,
45000000000,753.982,621.92,554.049,
46000000000,730.024,576.93,543.038,
47000000000,677.02,586.968,563.016,
48000000000,641.04,596.128,540.056,
49000000000,615.523,589.96,560.984,
50000000000,613,578.948,563.001,
51000000000,603.472,567.056,541.98,
52000000000,581.986,543.952,551.042,
53000000000,581.98,562.96,535.04,
54000000000,579.024,553.06,533,
55000000000,575.48,567.956,523.996,
56000000000,574.072,552.008,544.032,
57000000000,616.968,589.934,545.968,
58000000000,619.047,615.02,530.848,
59000000000,613.468,611.92,573.98,
60000000000,647.06,614.972,539.976,
61000000000,632.948,563.04,545.988,
62000000000,630.04,561.016,530.504,
63000000000,603.2,588.916,516.464,
64000000000,593.964,563.975,495.04,
65000000000,602.128,558.985,504.966,
66000000000,571.516,534.978,495.982,
67000000000,560.992,536.946,510.032,
68000000000,555.996,509.99,497.005,
69000000000,554.452,521,489.965,
70000000000,545.052,502.974,484.978,
71000000000,536.952,504.928,488.981,
72000000000,557.45,498.964,494.04,
73000000000,540.952,517.995,498.987,
74000000000,547.496,502.052,508,
75000000000,558.02,497.98,504.96,
76000000000,544.48,511.978,503.98,
77000000000,552.444,508.02,507.056,
78000000000,542.04,529,513.058,
79000000000,564.024,510.496,478.995,
80000000000,540.496,504,491.065,
81000000000,542.98,526.524,502.032,
82000000000,529.944,517.044,492.056,
83000000000,531.996,522.988,489.002,
84000000000,526.04,512.992,502.046,
85000000000,519.952,510.452,499.048,
86000000000,511.975,507.996,478.965,
87000000000,500.999,490.528,500.975,
88000000000,512,487,495.032,
89000000000,494,491.992,468.974,
90000000000,505.976,489.528,486.992,
91000000000,494.988,469.508,479.048,
92000000000,510.02,487.044,487.035,
93000000000,518.044,485.944,495,
94000000000,527,494.979,476.99,
95000000000,515.952,502.94,489.972,
