Frame number,1000000000,1000000001,
0.000000,582.098,553.074,
1.000000,629.155,550.98,
2.000000,649.91,619.127,
3.000000,819.464,668.8,
4.000000,878.216,708.304,
5.000000,840.988,668.232,
6.000000,757.538,634.776,
7.000000,697.98,580.036,
8.000000,591.844,546.12,
9.000000,558.36,489.054,
10.000000,529.036,504.444,
11.000000,531.008,485.528,
12.000000,493.956,474.544,
13.000000,506.947,471.95,
14.000000,485,463.996,
15.000000,507.05,460.988,
16.000000,491.942,482.964,
17.000000,487.077,485.938,
18.000000,532.011,560.075,
19.000000,539.5,592.968,
20.000000,609.03,626.224,
21.000000,648.05,623.89,
22.000000,656.518,592.896,
23.000000,635.56,590.112,
24.000000,637.037,584.028,
25.000000,587.504,576,
26.000000,563.57,523.98,
27.000000,539.023,499.971,
28.000000,526.973,494.055,
29.000000,493.544,483.512,
30.000000,476.516,462.5,
31.000000,484.52,463.972,
32.000000,458.024,453,
33.000000,462.53,453.988,
34.000000,464.996,461,
35.000000,468.057,451,
36.000000,471.004,478.096,
37.000000,466.952,473.052,
38.000000,478.532,536.976,
39.000000,505.962,534.93,
40.000000,540.481,559.956,
41.000000,587.965,550.85,
42.000000,579.505,557.082,
43.000000,567.018,554.045,
44.000000,576.94,526.062,
45.000000,535.976,482.944,
46.000000,555.986,487.084,
47.000000,505.93,478.02,
48.000000,514.982,479.036,
49.000000,473.504,458.035,
50.000000,478.48,455.028,
51.000000,461.504,457.023,
52.000000,459.008,454.97,
53.000000,461.016,441,
54.000000,445.496,459.05,
55.000000,446.992,470,
56.000000,452.536,473.99,
57.000000,454,476.944,
58.000000,459.992,514.06,
59.000000,470.04,531.025,
60.000000,508.04,554.026,
61.000000,515.06,541.94,
62.000000,554,556.06,
63.000000,558.036,547.064,
64.000000,528.002,504.98,
65.000000,532.497,507.48,
66.000000,532.552,497.968,
67.000000,500.483,487.993,
68.000000,483.042,474.928,
69.000000,456.487,451.048,
70.000000,458.52,469.036,
71.000000,447.496,452.034,
72.000000,452.019,443.978,
73.000000,448.508,458.984,
74.000000,452.072,448.96,
75.000000,438.487,446.05,
76.000000,459,456.982,
77.000000,443.001,458.014,
78.000000,452.016,491.1,
79.000000,451.008,504.074,
80.000000,466.004,528.018,
81.000000,476.016,509.17,
82.000000,505.51,526.902,
83.000000,519.505,494.976,
84.000000,514.466,526.006,
85.000000,518.595,499.98,
86.000000,506.108,488.008,
87.000000,500.932,478.96,
88.000000,480.036,461,
89.000000,468.086,458.496,
90.000000,461.988,458.986,
91.000000,450.04,446.032,
92.000000,454.04,448,
93.000000,447.04,450.974,
94.000000,436.941,440,
