
Intensity Median
 ==================== 
Time [s],1000000000,1000000001,1000000002,
0.000000,541.936,555.984,474.004,
1.000000,523.96,529.986,460.034,
2.000000,507.051,498.96,456.02,
3.000000,515.964,495.96,461.008,
4.000000,540.956,495.012,449.984,
5.000000,571.928,518.01,466.98,
6.000000,581.52,554.016,482.512,
7.000000,640.528,602.952,485.52,
8.000000,613.024,583.92,477.984,
9.000000,660.936,627.022,472.04,
10.000000,689.984,642.936,472.512,
11.000000,693.934,616.102,475.968,
12.000000,686.068,581,463.002,
13.000000,688.992,621.962,480.992,
14.000000,606.016,580.06,460.52,
15.000000,582.053,597.96,470.504,
16.000000,587.964,577.024,483.968,
17.000000,568.02,584.008,470.978,
18.000000,528.018,548,453.02,
19.000000,522.024,557.035,470.496,
20.000000,522.95,575,454.476,
21.000000,538.948,542.032,454.96,
22.000000,522.008,546.98,462.983,
23.000000,531.98,532.972,449.013,
24.000000,569.02,576.952,461.018,
25.000000,579.92,574.08,458.024,
26.000000,587.504,602.976,459.988,
27.000000,579,579.032,470.956,
28.000000,598.972,614.988,461.992,
29.000000,575.92,599.988,460,
30.000000,568.05,563.068,459.005,
31.000000,566.042,586.1,461.96,
32.000000,582.05,593.04,473.5,
33.000000,540.886,553.995,466.989,
34.000000,552.03,561.016,459.504,
35.000000,559.104,526.892,451.528,
36.000000,544.947,538.944,446.978,
37.000000,543.992,536,456.036,
38.000000,541.016,506.536,451.984,
39.000000,516.014,507.964,443.999,
40.000000,512.886,535,450.016,
41.000000,530.968,522.968,457.986,
42.000000,527.032,540,450.984,
43.000000,515.061,522.463,460.044,
44.000000,538.464,552.06,444.025,
45.000000,534.504,541.016,441.04,
46.000000,543,559.108,456.04,
47.000000,535.04,512.035,446.014,
48.000000,562.976,537.104,465.52,
49.000000,552.008,516.976,466.99,
50.000000,577.508,526.976,463.01,
51.000000,519.972,504.96,464.036,
52.000000,523.05,500.976,459.988,
53.000000,505.018,497.008,452.02,
54.000000,495,501.952,450.965,
55.000000,480.035,487.058,443.974,
56.000000,490.064,488.982,447,
57.000000,494,483.976,448.038,
58.000000,482.952,471.037,449.028,
59.000000,489.045,472.496,438.988,
60.000000,486.02,493.05,441,
61.000000,481.982,482.97,445.972,
62.000000,496.05,468.02,452.98,
63.000000,489.015,491.972,448.003,
64.000000,489.03,472.048,457.008,
65.000000,501.027,476.96,434.983,
66.000000,517.04,471.965,451.988,
67.000000,471.02,501.952,455.5,
68.000000,483.056,477.09,432.997,
69.000000,478.984,466.983,438.02,
70.000000,464,463.966,432.516,
71.000000,468.02,467.5,443.996,
72.000000,461.008,474.024,458.992,
73.000000,453.04,452.98,436.016,
74.000000,461.992,480,427.008,
75.000000,456,475.032,436.968,
76.000000,469.969,461.035,430.992,
77.000000,462,470.986,440.988,
78.000000,473.503,476.92,429.98,
79.000000,473.008,450.98,436.988,
80.000000,479.016,474.994,439.008,
81.000000,475.936,482.034,434.988,
82.000000,465.008,466.052,445.962,
83.000000,461.996,455.952,438.035,
84.000000,471.976,473.008,438.04,
85.000000,452.008,451.924,436.025,
86.000000,467.488,471.016,435.02,
87.000000,448.48,450,429.066,
88.000000,467.992,473.023,426.02,
89.000000,452.99,461.036,433.99,
90.000000,454.5,462.016,435.95,
91.000000,454.014,465.032,444.96,
92.000000,458.006,446.012,436.025,
93.000000,463.961,449.036,438.958,
94.000000,461.05,448.979,434.957,
95.000000,456.006,447.983,442.009,
96.000000,458.04,457.49,434.988,
97.000000,453.939,464,436.002,
