Time [ms],1000000000,1000000001,1000000002,1000000003,
0,50287.3,53673.3,45564.4,45377.9,
1000000000,18043.7,12115.7,9867.55,13796.6,
2000000000,8872.96,3683.21,2959.38,4796.78,
3000000000,4861.31,1894.08,1154.97,2460.16,
4000000000,3560.33,1461.96,1238.94,1819.02,
5000000000,3103.27,1204.04,1210.02,1455.98,
6000000000,2542.66,1105.04,1147.91,1374.86,
7000000000,2297.89,1112.99,1208.94,1278.91,
8000000000,1980.03,1050.52,1186.14,1188.84,
9000000000,1740.15,1049.43,1223.12,1176.64,
10000000000,1555.83,1011.03,1327.09,1111.12,
11000000000,1467.48,1017.97,1600.15,1080.14,
12000000000,1317.49,1164.54,1824.26,1041.63,
13000000000,1157.02,1474.94,1206.08,1004.04,
14000000000,1068.01,1474.08,957.992,959.104,
15000000000,1053.95,1259.94,852,906.92,
16000000000,1013.42,1118.01,858.998,916.168,
17000000000,980.964,1181.08,872.96,874.116,
18000000000,1096.94,1265,856.996,896.336,
19000000000,1250.59,1329.97,834.043,871.578,
20000000000,1342,1464.12,837.476,898.544,
21000000000,1491.05,1449.96,846,911.085,
22000000000,1624.7,1533.94,907.75,946.131,
23000000000,1740,1573.55,1038.65,930.09,
24000000000,1690,1572.15,1206.73,974.588,
25000000000,1550.97,1436.98,1302.86,995.528,
26000000000,1522.87,1437.96,1450.77,1015.94,
27000000000,1476.92,1358.09,1467.86,974.803,
28000000000,1346,1201.91,1421.51,943.448,
29000000000,1252.99,1146.6,1248.4,911.034,
30000000000,1179.91,1131.96,1111.98,909.032,
31000000000,1108.13,1129.52,1062,877.962,
32000000000,1069.11,1132.08,1022.06,856.02,
33000000000,1010.91,1100.92,979.464,806.998,
34000000000,933.925,1091.03,993.92,780.06,
35000000000,941.04,1111.97,1019.51,766.942,
36000000000,934.022,1228.04,978.986,768.075,
37000000000,1012.05,1301.17,997.944,728.016,
38000000000,1057.97,1281.04,925.984,730.008,
39000000000,1130.17,1340.08,913.957,726.064,
40000000000,1175,1378.01,960.036,716.023,
41000000000,1288.96,1388.92,961.12,754.038,
42000000000,1220.21,1388.05,1048.83,776.99,
43000000000,1241.09,1459.52,1160.17,786.01,
44000000000,1215.07,1416.18,1218.58,809.023,
45000000000,1215.17,1317.02,1302.18,832.08,
46000000000,1203.97,1182.09,1316.67,808.032,
47000000000,1185.62,1184.96,1303.02,831.984,
48000000000,1163.83,1126.01,1226.03,802.998,
49000000000,1063.01,1062.5,1167.07,818.016,
50000000000,1022.05,1004.98,1125.02,793.992,
51000000000,957.006,997.512,1093,738.54,
52000000000,956.048,1038.98,1079.44,766.02,
53000000000,892.97,1060.01,1029.09,729.056,
54000000000,913.06,1115.13,983.96,707.896,
55000000000,921.028,1115.91,995.032,732.059,
56000000000,970.056,1147.92,905,682.92,
57000000000,953.08,1156.47,896.96,687.012,
58000000000,996.12,1138.92,881.148,666.078,
59000000000,968.064,1105.08,879.09,681.96,
60000000000,1046,1103.04,830.016,673.022,
61000000000,1033.87,1105.15,869.11,672.005,
62000000000,1017.25,1106.99,927.1,663.024,
63000000000,1066.19,1115.04,935.084,672.03,
64000000000,974,1117.96,971.856,671.075,
65000000000,964.04,1094.04,1092,689.008,
66000000000,937.984,1051.92,1103.9,706.014,
67000000000,957.9,955.49,1090.96,709.95,
68000000000,941.926,941.496,1080.01,685.929,
69000000000,924.56,937.048,1056.1,714.95,
70000000000,872.056,924.918,1031.01,682.972,
71000000000,899.786,949.988,1043.88,704.999,
72000000000,888.008,936.99,1007.99,710.056,
73000000000,947.756,996.084,949.036,702.05,
74000000000,967.88,1014.03,895.056,683.983,
75000000000,981.032,1009.08,859.94,683.944,
76000000000,1014.12,988.12,823,679.04,
77000000000,1058.07,1000.06,802.972,670.049,
78000000000,1063.98,967,801.98,661.953,
79000000000,1024.81,955.5,784.99,655.976,
80000000000,1054.98,969.11,762.03,647.92,
81000000000,1016.9,949.04,748.54,647.984,
82000000000,944.88,935.991,798.852,643.04,
83000000000,996.86,930.096,847.064,646.944,
84000000000,922,930.1,873.116,664.976,
85000000000,930.08,908.943,917.04,651.862,
86000000000,960.925,924.11,933.508,646.108,
87000000000,932.064,911.468,949.112,663.048,
88000000000,934.139,874.884,997.498,675.964,
89000000000,945.125,882.944,998.072,679.944,
90000000000,956.064,869.02,989.07,686.008,
91000000000,945.056,901.941,931,708.93,
92000000000,971.04,897.508,899.068,701.985,
93000000000,949.592,934.088,883.999,699.937,
94000000000,968.022,916.982,888.492,691.028,
95000000000,973.952,913.982,876.08,694.956,
