Frame number,1000000000,1000000001,
0.000000,987.251,853.011,
1.000000,883.1,832.285,
2.000000,778.67,1022.19,
3.000000,933.42,1330.24,
4.000000,1253.24,1555.21,
5.000000,1028.33,1265.95,
6.000000,1254.94,1238.55,
7.000000,812.987,1202.74,
8.000000,927.015,1237.12,
9.000000,859.842,986.639,
10.000000,879.806,988.845,
11.000000,823.7,732.088,
12.000000,825.556,712.84,
13.000000,837.268,660.17,
14.000000,757.91,693.294,
15.000000,731.692,650.004,
16.000000,732.034,701.736,
17.000000,783.992,637.672,
18.000000,876.502,738.402,
19.000000,1017.91,874.336,
20.000000,1183.28,974.502,
21.000000,1391.92,1069.65,
22.000000,1101.19,1029.94,
23.000000,893.514,1125.08,
24.000000,879.945,1144.35,
25.000000,919.663,1033.18,
26.000000,966.521,867.576,
27.000000,928.691,890.407,
28.000000,821.282,738.07,
29.000000,860.568,711.8,
30.000000,822.898,697.946,
31.000000,743.564,649.93,
32.000000,725.46,672.442,
33.000000,716.4,693.77,
34.000000,801.264,682.022,
35.000000,855.207,767.994,
36.000000,872.19,778.522,
37.000000,928.519,807.52,
38.000000,1028.6,838.168,
39.000000,1036.06,838.366,
40.000000,1056.33,893.232,
41.000000,984.715,852.486,
42.000000,989.857,784.327,
43.000000,870.334,751.882,
44.000000,797.584,814.595,
45.000000,767.622,712.423,
46.000000,713.523,642.602,
47.000000,693.195,643.054,
48.000000,635.924,656.298,
49.000000,641.06,593.656,
50.000000,620.749,645.412,
51.000000,646.783,676.234,
52.000000,650.554,707.248,
53.000000,691.16,634.58,
54.000000,724.208,672.72,
55.000000,717.81,711.559,
56.000000,783.534,661.74,
57.000000,709.5,672.6,
58.000000,843.518,702.429,
59.000000,817.622,695.312,
60.000000,789.533,700.784,
61.000000,719.313,705.664,
62.000000,810.888,628.84,
63.000000,790.32,603.776,
64.000000,823.093,590.052,
65.000000,702.706,618.644,
66.000000,732.572,570.004,
67.000000,705.678,552.579,
68.000000,673.33,532.539,
69.000000,661.064,544.899,
70.000000,678.168,531.44,
71.000000,718.032,582.009,
72.000000,739.512,554.06,
73.000000,805.84,581.752,
74.000000,861.952,555.708,
75.000000,945.216,658.08,
76.000000,965.166,623.94,
77.000000,943.65,636.2,
78.000000,988.522,628.064,
79.000000,915.721,633,
80.000000,871.666,587.976,
81.000000,875.21,609.26,
82.000000,837.861,643.4,
83.000000,746.386,620.05,
84.000000,796.161,619.695,
85.000000,728.037,594.042,
86.000000,696.205,558.696,
87.000000,677.191,548.507,
88.000000,665.165,539.103,
89.000000,717.788,538.248,
90.000000,751.698,564.988,
91.000000,734.603,586.8,
92.000000,760.416,566.64,
93.000000,747.097,583.184,
94.000000,685.012,613.216,
