
Intensity Median
 ==================== 
Time [s],1000000000,1000000001,1000000002,
0.000000,2702.34,6225.6,4855.55,
1.000000,2674.74,4228.46,6035.2,
2.000000,2310.03,4197.9,4053.02,
3.000000,3935.04,5867.08,3752.75,
4.000000,8553.17,9556,4833.06,
5.000000,11533.8,11276.5,5676.2,
6.000000,8702.76,10598.2,5866.45,
7.000000,8173.82,9102.76,5572.63,
8.000000,6494.87,8206.82,5304.62,
9.000000,5309,6709.12,5054,
10.000000,4263.16,6237.56,4637.68,
11.000000,3951.28,5016.06,4156.24,
12.000000,3196.09,4515.71,3518.4,
13.000000,2697.77,3662.49,2857.34,
14.000000,2250.75,2996.45,2217.67,
15.000000,1912.26,2671.74,1818.82,
16.000000,1668.27,2329.25,1487.88,
17.000000,1456.2,2196.88,1400.34,
18.000000,1681.88,2360.91,1450.76,
19.000000,2825.01,3338.6,1811.02,
20.000000,3810.76,4617.16,2791.61,
21.000000,3466.19,5091.25,3833.78,
22.000000,3119.08,4861.73,4175.69,
23.000000,2671.42,4528,4109.6,
24.000000,2439.58,3997.5,4060.91,
25.000000,2215.12,3810.38,3822.12,
26.000000,1923.35,3450.02,3385.76,
27.000000,1729.32,2906.66,2827.51,
28.000000,1438.9,2553.93,2431.01,
29.000000,1261.98,2173.77,1939.23,
30.000000,1126.99,1953.37,1642.8,
31.000000,1042.24,1752.69,1333.78,
32.000000,981.03,1683.11,1199.19,
33.000000,1245.99,1762.98,1113.76,
34.000000,2014.93,2350.12,1372.04,
35.000000,3065.21,3413.99,2409.38,
36.000000,3224.62,4030.06,4181.65,
37.000000,3105.5,4027.32,5014.52,
38.000000,2777.35,3825.44,5100.04,
39.000000,2468.9,3542.2,4730.4,
40.000000,2164.6,3157.13,4179.35,
41.000000,1859.06,2802.01,3582.54,
42.000000,1627,2533.95,2944.06,
43.000000,1436.1,2189.9,2438.32,
44.000000,1273.29,1911.94,1844.18,
45.000000,1188.38,1792.93,1540.19,
46.000000,1141.15,1648.96,1308.58,
47.000000,1040.21,1576.02,1144.57,
48.000000,1125.16,1595,1079.85,
49.000000,1531.86,2142.97,1055.12,
50.000000,2491.75,3217.1,1774.38,
51.000000,3320.8,4096.18,3299.01,
52.000000,3351.98,4336.87,4478.07,
53.000000,3048.29,4068.78,4898.88,
54.000000,2654.26,3636.15,4450.92,
55.000000,2409.15,3200.3,3828.23,
56.000000,2008.26,2774.86,3195.72,
57.000000,1702.82,2545.4,2901.35,
58.000000,1414.07,2228.4,2319.17,
59.000000,1317,1881.13,1847.7,
60.000000,1181.87,1731.42,1581.22,
61.000000,1106.06,1639.3,1380.98,
62.000000,1073.95,1454.07,1183.8,
63.000000,1110.06,1511.21,1106.9,
64.000000,1270.44,1884.18,1095,
65.000000,2005.36,2936.86,1418.45,
66.000000,2990.75,3851.28,2348.79,
67.000000,3222.76,4229.09,3565.01,
68.000000,2945.14,4002.09,4185.99,
69.000000,2671,3753.5,4115.6,
70.000000,2229.72,3355.99,3552.28,
71.000000,1979.44,3013,3133.1,
72.000000,1631.2,2573.38,2737.2,
73.000000,1440,2252,2352.11,
74.000000,1233.58,2041.53,1952.02,
75.000000,1133.92,1839.26,1684.4,
76.000000,1059.1,1756.24,1486.81,
77.000000,1024.02,1615.2,1364,
78.000000,1024,1580.84,1222.18,
79.000000,1157.11,1664.06,1119.1,
80.000000,1464.26,2292.82,1162.79,
81.000000,2126.73,3187.1,1614.24,
82.000000,2802.96,3581.37,2628.22,
83.000000,2756.75,3533.36,3859.84,
84.000000,2448.61,3149.61,3753.3,
85.000000,2204.68,2754.72,3674,
86.000000,1802.15,2483.04,3319.36,
87.000000,1553.51,2301.99,2940.43,
88.000000,1363.4,2037.68,2621.5,
89.000000,1178.95,1929.67,2284.52,
90.000000,1103.99,1747.94,1899.01,
91.000000,1011.97,1788.88,1611.39,
92.000000,965,1617.04,1483.09,
93.000000,932.014,1566.71,1373.08,
94.000000,1005.08,1523.04,1284.99,
95.000000,1221.06,1636.18,1185.96,
