Frame number,1000000000,1000000001,1000000002,1000000003,1000000004,1000000005,
0.000000,6311.2,4453.29,3462.97,4581.54,2720.01,4636.67,
1.000000,6720.45,6383.1,3037.42,4623.57,2844,5172.63,
2.000000,5571.32,6972.55,2486.9,3756.55,2724.75,4823.06,
3.000000,4332.81,5622.84,2198.15,3050.6,2966.57,4670.71,
4.000000,3698.11,4722,1961.19,2604.44,3102.44,4047.21,
5.000000,3284.47,4023.04,1936.04,2391.85,3097.01,3500.26,
6.000000,3353.08,3865.53,1916.09,2326.11,3140.65,2926.46,
7.000000,3045.91,3638.44,2350.15,1861.53,3016.95,2556.16,
8.000000,2929.65,3221.74,2409.19,1448.45,2740.15,2222.07,
9.000000,2970.72,2930.87,2159.75,1156.04,2550.03,1996.15,
10.000000,2045.42,2572.8,1859.07,977.05,2366.93,1693.97,
11.000000,1625.41,2429.14,1630.85,931.611,2246.25,1340.98,
12.000000,1755.1,2889.46,1524.01,978.792,2022.84,1210,
13.000000,2090.25,2069.5,1493.5,1193.99,1827.59,1216.99,
14.000000,2771.69,2802.39,1779.72,1675.17,1720.91,1218.07,
15.000000,3592.02,2890.62,1914,1765.76,1831.06,1403.1,
16.000000,3878.44,2761.16,1784.04,2358.55,1978.9,1657.84,
17.000000,3719.75,1557.56,1310.01,2711.31,2164.16,1685.03,
18.000000,3869.98,3212.46,2146.79,2579.9,2561.28,1672.99,
19.000000,3922.2,3555.29,1999.8,2494.56,2945.08,2154.04,
20.000000,3787.27,3689.09,1991.99,2208.36,3959.88,3132.61,
21.000000,3106.49,3578.14,2130.54,1978.28,5673.66,3235.22,
22.000000,2692,3413.32,4767.16,1690.57,5756,3191.97,
23.000000,2153.05,3086.64,4488.43,1455.85,5104.88,3037.56,
24.000000,1896.05,2731.37,3397.34,1333.07,4154.42,2469.09,
25.000000,1744.05,2574.46,3112.77,1245.09,3471.67,1943.11,
26.000000,1605.94,2353.43,2671.5,1159.15,2913.02,1687.05,
27.000000,1462.07,2510.02,2402.49,1110.14,2584.52,1606.91,
28.000000,1399,2301.7,2602.58,1086,2245.82,1605,
29.000000,1437.04,2232.1,2514.51,1139.73,2027.97,1570.01,
30.000000,1625,2151.04,2566.7,1209.13,1969.14,1596.07,
31.000000,1852.68,2047.29,2689.93,1566.94,1781.97,1624,
32.000000,2053.02,1870.1,2644.98,1907.86,1788.53,1663.86,
33.000000,2272.06,1735.01,2659.73,1993.88,1731.05,1724.13,
34.000000,2410.92,1737.85,2848.73,2265.68,1748.04,1843.68,
35.000000,2476.72,1726.06,2851.53,2362.98,1660.91,2092.89,
36.000000,2721.28,1859.96,3038.84,2525.32,1793.43,2354.56,
37.000000,2668.9,1978,2916.6,2341.45,1847.02,2443.3,
38.000000,2631.03,2059,3008.18,2131.78,1940.97,2510.88,
39.000000,2500.91,2161.1,2862.01,2000.44,2055.09,2406.07,
40.000000,2434.79,2102.8,2925.28,1863.78,2098.94,2272.1,
41.000000,2271.3,2108.82,2896.11,1837.83,2141.97,2021.09,
42.000000,2101.39,2044.06,2730.72,1661.08,2285.92,1883.89,
43.000000,2040.45,1996.26,2652.34,1494.84,2153.91,1753.11,
44.000000,1856.06,1966.84,2526.2,1419.97,2098.43,1689.92,
45.000000,1782.99,1885.98,2662.1,1406.05,2057.04,1618.98,
46.000000,1811.18,1918.86,2621.4,1375.94,2027.05,1683.81,
47.000000,1997.89,2087.92,3049.92,1531.86,2197.94,1706.87,
48.000000,2067.79,2023.96,2998.81,1630.84,2078.03,1718.08,
49.000000,2146.56,2007.96,2733.82,1762.34,1990.95,1760.13,
50.000000,2083.47,1925.11,2683.51,1847.44,1926,1871.96,
51.000000,2344.07,1961.13,2704.65,2099.17,1891.86,1972.93,
52.000000,2338.75,2003.72,2570.9,2292.33,1842.06,1971.22,
53.000000,2404.4,2028.62,2712.64,2209.07,1813.02,2295.94,
54.000000,2413.4,1983.89,2703.32,2092.26,1700.91,2361.84,
55.000000,2251.48,1983.54,2703.46,1962.57,1647.13,2180.87,
56.000000,2175.68,1919.76,2585,1814.53,1577,2027.13,
57.000000,2060.96,1833.05,2558,1766.73,1510.19,2006,
58.000000,1922.1,1865.42,2425.12,1607.94,1417.08,1758.96,
59.000000,1720.67,1811.96,2275.82,1525.28,1383.03,1628.9,
60.000000,1721.05,1813.11,2270,1352.86,1372.94,1505.06,
61.000000,1609.47,1711.92,2240.29,1284.53,1399.11,1422.05,
62.000000,1515.13,1726,2140.89,1225.73,1404.93,1398,
63.000000,1408.06,1725.01,2088.3,1214.2,1419.95,1395.11,
64.000000,1465.99,1685.19,2186.54,1149.97,1383.5,1354.08,
65.000000,1424.98,1621.37,2251.7,1239.83,1425.94,1342.89,
66.000000,1546.76,1654.31,2419.33,1227.92,1517.16,1355,
67.000000,1690.98,1717.35,2538.68,1336.61,1522.48,1364.02,
68.000000,1775.16,1695.47,2535,1329.16,1576.98,1391.88,
69.000000,1907.18,1782.94,2531.36,1473.51,1641.04,1491.14,
70.000000,2067.78,1831.03,2612.29,1558.68,1651.05,1606.02,
71.000000,2137.06,1867.93,2699.72,1602.92,1700.99,1683.96,
72.000000,2206.1,1856.96,2711,1639.05,1677.84,1758.88,
73.000000,2092.02,1841.28,2679,1627.86,1645.96,1864.94,
74.000000,2151.2,1848.87,2649.26,1681.41,1634.89,1883.91,
75.000000,2084.72,1839.35,2539.18,1668.35,1570.93,1883.96,
76.000000,2010.83,1858.64,2473.13,1689.24,1504.15,1894,
77.000000,1946.05,1822.68,2335.38,1691.38,1455,1850.09,
78.000000,1789.14,1763.44,2279.96,1566.2,1400.03,1857.97,
79.000000,1752.2,1717.98,2211.02,1458.97,1391.97,1711.49,
80.000000,1568.92,1723.34,2100.38,1410.66,1362.5,1657.89,
81.000000,1592.04,1655.77,2041.69,1407.59,1323.08,1625.04,
82.000000,1545.94,1614.58,2027.69,1325.49,1296.02,1522.01,
83.000000,1446.18,1593.86,1994.41,1330.16,1314.94,1455.94,
84.000000,1424.86,1555.1,2041.77,1292.09,1314.97,1383.08,
85.000000,1483.94,1556.5,2054.86,1305.22,1307.01,1355.95,
86.000000,1442.02,1598.18,2192.46,1308.55,1307.98,1250.96,
87.000000,1532.83,1611.64,2233.44,1320.33,1366.95,1255.06,
88.000000,1590.91,1600.31,2227.4,1333.17,1382.03,1212.08,
89.000000,1661.92,1575.07,2303.58,1314.92,1430.06,1242.98,
90.000000,1653,1652,2321.88,1237.4,1441,1246.14,
91.000000,1733.92,1691.44,2295.58,1299.77,1435.95,1298.1,
92.000000,1806.04,1717.58,2344.1,1260.96,1427.09,1389.03,
93.000000,1853.81,1711.35,2338.14,1304.97,1438,1438.98,
