Frame number,1000000000,1000000001,1000000002,1000000003,1000000004,1000000005,1000000006,1000000007,
0.000000,584.049,595.147,630.934,649.131,632.609,614.585,576.966,623.174,
1.000000,531.057,584.976,604.08,728.912,606.214,691.844,584.054,610.154,
2.000000,717.091,654.088,699.008,887.021,686.163,689.556,593.05,685.878,
3.000000,630.041,746.3,731,1026.19,748.176,757.111,682.032,741.11,
4.000000,687.03,763.921,772.128,1129.74,732.949,769.557,723.928,769.7,
5.000000,694.943,696.848,707.666,956.808,773,728.438,691,717.105,
6.000000,623.027,658.94,697.02,838.098,662.04,668.098,650.91,694.992,
7.000000,588.925,638.019,582.032,660.079,672.464,647.083,615.928,654.955,
8.000000,595.588,605.061,556.15,608.395,586.98,581.96,555.044,576.023,
9.000000,537.945,570.982,543.94,594.52,587.067,573.522,545.024,543.954,
10.000000,560.063,517.102,557.028,583.04,546.024,550.036,554.957,524.996,
11.000000,545.997,517.042,593.063,538.034,530.953,539.073,549.048,500.935,
12.000000,538.049,499.979,550.095,530.454,556.067,512.968,509.05,507.993,
13.000000,530.995,519.992,546.05,531.04,548.93,536.563,508.512,527.039,
14.000000,545.943,537.038,571.988,523.005,563.48,542.03,536.06,540.01,
15.000000,618.566,617.929,710.081,555.02,661.328,592.985,569.001,633.029,
16.000000,686.488,701.891,748.292,622.559,751.46,670.075,633.018,716.955,
17.000000,791.024,859.109,819.292,727.042,873.56,777.043,707.492,874.92,
18.000000,881.79,955.846,962.284,802.491,959.32,833.098,774.071,885.038,
19.000000,906.451,885.056,974.105,817.419,977.509,853.863,797.86,951.15,
20.000000,829.544,849.831,868.182,810.596,902.793,799.851,793.028,845.902,
21.000000,791.48,858.914,844.997,750.563,788.972,772.007,766.948,829.917,
22.000000,703.933,739.818,744.125,667.063,709.426,721.987,741.068,767.062,
23.000000,662.076,675.22,658.915,633.032,648.4,680.07,658.042,654.004,
24.000000,595.6,664.955,606.903,596.96,593,621.024,588.968,614.932,
25.000000,579.536,570.068,568.964,557.97,565.002,579.103,574.05,523.042,
26.000000,550.548,560.025,557.966,521.022,578.5,531.007,538.961,526.52,
27.000000,520.56,528.103,531.988,503.491,523,539.971,501,497.984,
28.000000,494.025,504.988,507.982,487.5,505.504,509.045,504.984,479.04,
29.000000,487.06,503.987,492.994,504.54,485.576,481.032,493.012,475.98,
30.000000,486.972,535.965,494.995,478.49,496.048,485.02,478.008,506.015,
31.000000,513.56,526.02,576.985,476.503,512.992,483.956,506.014,517.03,
32.000000,550.074,543.952,557.042,478.502,595.58,521.019,523.995,549.6,
33.000000,629.988,608.92,635.091,482.54,645.564,555.978,557.088,613.84,
34.000000,717.116,717.076,701.905,513.5,718.538,614.938,631,732.96,
35.000000,783.864,742.125,795.108,553.016,816.284,714.907,662.92,832.976,
36.000000,846.564,865.96,763.919,553.042,802.252,742.993,733.952,945.714,
37.000000,790.048,783.618,764.917,613.874,757.095,726.932,710.084,891.075,
38.000000,718.1,759.002,699.837,580.031,747.96,704.122,718.056,808.911,
39.000000,671.094,667.948,634.89,578.57,613.05,647.948,675.98,644.88,
40.000000,659.5,583,612.032,523.064,577.104,596.056,593.028,627.111,
41.000000,596,623.984,537.07,576.974,562.011,586.023,582.994,592.895,
42.000000,567.516,576.928,520,558.085,492.023,522.94,555,562.948,
43.000000,536.02,567.528,486.055,569.052,496.99,518.051,526.952,558.004,
44.000000,507.552,547.521,490.05,538.072,519.472,492.046,502.026,582.005,
45.000000,489.008,504.006,476.95,529.06,500.996,491.976,487.006,562.013,
46.000000,497.496,508.05,464.962,487.966,502.04,476.968,478.999,577.015,
47.000000,460.956,499.046,457.98,473.04,503.902,488.987,466.012,542.956,
48.000000,473.992,492.015,476.984,478.062,506.93,485.5,460.036,573.895,
49.000000,479.02,497.004,492,453.04,503.06,472.512,464.05,628.073,
50.000000,514.976,511.975,539.925,477.046,547.059,475.021,478.008,642.918,
51.000000,579.022,529.93,592.971,492.05,591.5,529.04,501.036,732.91,
52.000000,647.535,577.915,646.206,535.094,616.096,547.015,523,763.96,
53.000000,639.98,628.961,627.834,577.174,661.939,570.912,569.052,779.845,
54.000000,656.048,625.094,673.086,625.127,670.932,617,569.048,804.931,
55.000000,681.562,619.999,671.772,656.085,731.08,605.912,580.08,748.036,
56.000000,643.042,645.116,630.146,608.112,633.963,583.992,572.036,640.841,
57.000000,618.53,572.063,610.914,595.097,598.005,563,556.981,602.114,
58.000000,556.98,552.124,551.986,528.066,540.944,542.946,535.04,535.05,
59.000000,539.539,554.025,561.1,514.082,549.98,510.998,525.954,547.024,
60.000000,507,540.986,510.026,490.03,557.031,506.952,493.988,504.057,
61.000000,512.08,508.03,498,504.068,493.048,484,486.022,500.024,
62.000000,492.533,488.055,479.984,477.014,502.043,489.016,476.03,499.039,
63.000000,481.988,477.04,483.048,453.986,506.036,467.984,467.017,488.492,
64.000000,475.512,481.041,493.04,458.009,479.978,467,465.982,476.984,
65.000000,470.008,497.02,450.983,445.016,470.005,452.986,475,482.018,
66.000000,462,457.014,456.996,445.013,467,460,452.999,497.04,
67.000000,462.996,482.004,461.05,455.02,484.968,444.99,451.96,497.084,
68.000000,485.02,454.99,464.024,447.025,485.056,443.02,444.992,529,
69.000000,499.017,474.028,489.062,452.999,529.04,452.978,455.999,571.577,
70.000000,498.952,495.022,546.925,456.029,549.896,472.024,464,644.525,
71.000000,526.976,492.975,525.981,486.044,587.978,471.016,474.995,660.488,
72.000000,573.078,490.995,551.094,519.104,553.956,489,476,684.434,
73.000000,552.935,529.987,572.912,533.072,558.04,491.48,492.008,644.5,
74.000000,577.002,528.049,582.04,575.057,568.1,512.515,501.04,613.564,
75.000000,518,527.51,540.933,560.049,537.952,476.046,495.488,563.016,
76.000000,522,556.969,511.017,532.036,546.025,501.986,481.512,535.448,
77.000000,496.023,502.944,498.05,508.082,502.925,484.954,484.038,530.478,
78.000000,477.976,521.082,476.983,499.013,498.96,492.05,474.02,515.999,
79.000000,474,486.979,469,452.008,501.998,473.965,459.962,469.98,
80.000000,470.054,489.002,454.014,456.016,485.012,462.98,451.496,475.498,
81.000000,474.005,497.002,455.018,447.992,470.006,454.016,447,467.02,
82.000000,461,468.05,455.971,447.016,461,449.986,433,460.022,
83.000000,449.04,470.024,437.98,433.012,442.993,447.998,444.992,459.011,
84.000000,438.986,460,440.006,437.012,455,444.016,439.504,452.992,
85.000000,441.02,448.995,437.02,430.991,447,438.01,434.996,482.496,
86.000000,441.5,456.024,445.995,434.976,471.046,442.015,433.504,479.014,
87.000000,455.495,448.988,435.984,424.988,467.008,437.984,429.004,527.479,
88.000000,442.504,454.988,454.98,431.995,487.96,430.018,424.021,541.516,
89.000000,462.54,454.992,470.996,439.992,491.016,434,430.99,568.54,
90.000000,478.973,457.012,468.01,444.978,499,441,441.984,580,
91.000000,481.998,444.004,475.934,459,486.984,441.012,447.984,546.529,
92.000000,474.019,470.011,500.997,461.05,511.946,454.032,449.013,543.941,
93.000000,477.05,465.009,478.02,448,536.952,452.02,455.008,511.984,
94.000000,485.032,487.001,476.02,455,538.021,460.03,442.998,516.04,
