Time [ms],1000000000,1000000001,
0,3164.26,5487.2,
1000000000,2631.59,3171.27,
2000000000,1665.43,2453.08,
3000000000,1900.24,2467,
4000000000,2011,2278.04,
5000000000,1861.55,2118.02,
6000000000,1689.55,1999.89,
7000000000,1541.93,1917.99,
8000000000,1481.2,1680,
9000000000,1354.82,1643.14,
10000000000,1272.44,1522.85,
11000000000,1257.12,1382.14,
12000000000,1157.85,1320.04,
13000000000,1202.58,1217.95,
14000000000,1120.1,1229.8,
15000000000,1120.16,1232.99,
16000000000,1034.12,1199.04,
17000000000,995.152,1221,
18000000000,1089,1287.9,
19000000000,1089.04,1274.04,
20000000000,1086.53,1310.01,
21000000000,1116.96,1342.09,
22000000000,1124.96,1334,
23000000000,1167.18,1284.94,
24000000000,1162,1341,
25000000000,1101.34,1299.05,
26000000000,1065.76,1282.06,
27000000000,1011.09,1229.52,
28000000000,988.92,1183.98,
29000000000,947.24,1078.89,
30000000000,953.096,1072.98,
31000000000,931.726,1059.97,
32000000000,929.064,1065.96,
33000000000,941.1,1087.05,
34000000000,908.08,1044.94,
35000000000,896.48,1026.06,
36000000000,902.04,1046,
37000000000,906.552,1083.93,
38000000000,907.04,1074.12,
39000000000,919.252,1088.11,
40000000000,920.88,1062.02,
41000000000,872.82,1045.91,
42000000000,863.156,972.94,
43000000000,868,995.94,
44000000000,835.082,930.932,
45000000000,777.06,937.972,
46000000000,770.936,883.108,
47000000000,815.05,875.028,
48000000000,766.116,848.056,
49000000000,705.87,828.988,
50000000000,702,847.976,
51000000000,753.568,844.972,
52000000000,782,829.952,
53000000000,760,866.16,
54000000000,747.072,826.029,
55000000000,726.016,803.948,
56000000000,704.844,799.136,
57000000000,746.932,801.92,
58000000000,720.936,781.918,
59000000000,688.08,782.074,
60000000000,712.92,797.08,
61000000000,695.032,751.995,
62000000000,665.064,740.948,
63000000000,666.94,709.04,
64000000000,666.96,705.062,
65000000000,648.94,702.953,
66000000000,636,735.008,
67000000000,620.06,701.055,
68000000000,622.428,702.98,
69000000000,647.98,697.05,
70000000000,649.03,686.032,
71000000000,627.94,689.984,
72000000000,606.02,684.991,
73000000000,663.944,699.977,
74000000000,625.909,697.974,
75000000000,635.4,688.952,
76000000000,611,665.994,
77000000000,617.994,685.988,
78000000000,612.988,670.07,
79000000000,623.482,643.048,
80000000000,601.068,631.012,
81000000000,606.04,643.06,
82000000000,584.992,653.999,
83000000000,559.03,657.06,
84000000000,574.012,657.036,
85000000000,573.026,654.036,
86000000000,565.064,645.968,
87000000000,558.484,636.984,
88000000000,571.924,652.972,
89000000000,570.51,643.96,
90000000000,573.026,636.016,
91000000000,586.5,626.96,
92000000000,567.008,635.976,
93000000000,575.98,635,
94000000000,574.536,616.036,
