Time [ms],1000000000,1000000001,1000000002,
0,3574.93,1012.78,1113.99,
1000000000,1893.79,822.066,1162.05,
2000000000,2084.6,1060.12,1367.17,
3000000000,2394.86,1432.18,1698.04,
4000000000,2638.67,1783,2068.94,
5000000000,2484.18,1822.79,2216.72,
6000000000,2522.95,1843.7,2162.96,
7000000000,2485.59,1813.74,2012.94,
8000000000,2311.28,1882.2,1840.94,
9000000000,2144.87,1719.04,1589,
10000000000,1942.91,1431.11,1539,
11000000000,1674.78,1294.99,1389.96,
12000000000,1561.78,1257.02,1302.98,
13000000000,1478.98,1221.94,1233.9,
14000000000,1365.74,1236.98,1131.95,
15000000000,1295.02,1190.86,1126.01,
16000000000,1270.12,1181.98,1150.91,
17000000000,1211.46,1239.99,1233.06,
18000000000,1180.14,1302.17,1321.12,
19000000000,1207.12,1309.22,1519.87,
20000000000,1268.8,1499.94,1540.08,
21000000000,1202.81,1578.93,1548.92,
22000000000,1168.65,1673.13,1575.23,
23000000000,1223.51,1576.82,1443.22,
24000000000,1242.17,1544.02,1388.16,
25000000000,1293.2,1540.18,1275.92,
26000000000,1195.22,1390.04,1235.01,
27000000000,1177.2,1317.04,1090.99,
28000000000,1118.97,1267.52,1117.12,
29000000000,1090.86,1210.06,1062.9,
30000000000,1045.84,1170.05,974.976,
31000000000,1006.97,1104.55,985.92,
32000000000,943,1133.99,958.068,
33000000000,906.104,1222.52,1062.51,
34000000000,909.904,1293,1036.9,
35000000000,899,1327.45,1007.44,
36000000000,892.052,1317,994.138,
37000000000,944,1355.07,980.12,
38000000000,938.148,1365.57,1063,
39000000000,932.872,1247.08,987.008,
40000000000,985.912,1185.89,964.955,
41000000000,1013.24,1041,909.918,
42000000000,986.04,1033.46,867.02,
43000000000,940.076,968.02,870.944,
44000000000,914.424,933.578,814,
45000000000,878.016,914.02,800.948,
46000000000,843.064,907.532,772.96,
47000000000,831.959,883.022,754.06,
48000000000,760.984,939.996,764.98,
49000000000,766.91,1004.91,762.033,
50000000000,762.144,1055.1,771.92,
51000000000,753.82,1007.99,740.99,
52000000000,776.088,938.908,743.055,
53000000000,779.978,1052.96,773.032,
54000000000,805.072,986.04,761.948,
55000000000,796.024,945.976,738.925,
56000000000,813.912,886.08,743.01,
57000000000,803.952,839.016,738.035,
58000000000,815.096,825.952,700.08,
59000000000,779.954,782.98,681.984,
60000000000,774.11,779.024,690.03,
61000000000,735.096,752.03,691.976,
62000000000,691.052,771.99,668.972,
63000000000,733.938,812.996,678.054,
64000000000,697,826.024,658.926,
65000000000,718.938,878.538,686.9,
66000000000,647.064,814.04,670.06,
67000000000,683.084,813.088,628.02,
68000000000,691.95,783.886,691.948,
69000000000,689.936,857.997,675.04,
70000000000,721,801.976,665.928,
71000000000,733.508,803,668.016,
72000000000,732.972,788.88,662.05,
73000000000,697.072,747.016,660,
74000000000,686.025,746,636.496,
75000000000,672.052,721.976,644.03,
76000000000,704.572,697.016,630.52,
77000000000,641.984,701.002,626.032,
78000000000,646.032,706.089,604.02,
79000000000,628.488,745,635.044,
80000000000,609.024,754.954,642.124,
81000000000,602.012,781.104,613.472,
82000000000,627.499,755.49,625.016,
83000000000,620.008,756.496,618.988,
84000000000,609.983,735.5,623.956,
85000000000,611.976,771.007,653.04,
86000000000,616.514,727.936,610,
87000000000,644.48,713.9,606.996,
88000000000,652.5,706,626.98,
89000000000,629.02,682.932,579.97,
90000000000,613.976,659.979,607.04,
91000000000,638.957,652.002,616,
92000000000,609.1,633.958,592.996,
93000000000,605.991,650.005,592.495,
94000000000,585.02,641.992,572.96,
95000000000,601,650.914,590.56,
