Frame number,1000000000,
0.000000,455.038,
1.000000,475.036,
2.000000,468.935,
3.000000,487.016,
4.000000,480.99,
5.000000,475.01,
6.000000,464,
7.000000,466.014,
8.000000,440.992,
9.000000,442.01,
10.000000,444.032,
11.000000,437.984,
12.000000,440.985,
13.000000,435.036,
14.000000,440.004,
15.000000,427.016,
16.000000,432.031,
17.000000,426.006,
18.000000,434.006,
19.000000,451.984,
20.000000,451.024,
21.000000,446.045,
22.000000,448.024,
23.000000,449.989,
24.000000,454.98,
25.000000,444.968,
26.000000,434.02,
27.000000,441.981,
28.000000,445.976,
29.000000,442.034,
30.000000,434.003,
31.000000,442.034,
32.000000,437,
33.000000,431.986,
34.000000,442,
35.000000,429.98,
36.000000,444.96,
37.000000,434.024,
38.000000,440.02,
39.000000,444.986,
40.000000,444.004,
41.000000,438.992,
42.000000,429.989,
43.000000,440.492,
44.000000,433.026,
45.000000,439.002,
46.000000,429,
47.000000,422.98,
48.000000,427.035,
49.000000,426.998,
50.000000,436.992,
51.000000,442.016,
52.000000,437.975,
53.000000,446.992,
54.000000,440.504,
55.000000,447.027,
56.000000,435.019,
57.000000,433.007,
58.000000,434.018,
59.000000,435.993,
60.000000,439.042,
61.000000,439,
62.000000,432.04,
63.000000,435.026,
64.000000,432.013,
65.000000,431.016,
66.000000,427.968,
67.000000,432.016,
68.000000,430.964,
69.000000,428.976,
70.000000,445.044,
71.000000,442.994,
72.000000,436.04,
73.000000,441.968,
74.000000,426.971,
75.000000,430.044,
76.000000,431.988,
77.000000,432.012,
78.000000,433.96,
79.000000,438,
80.000000,436.016,
81.000000,425.02,
82.000000,428.056,
83.000000,425.96,
84.000000,440.999,
85.000000,441.496,
86.000000,425.506,
87.000000,435.488,
88.000000,446.984,
89.000000,435.496,
90.000000,441.496,
91.000000,427,
92.000000,443.032,
93.000000,436.984,
94.000000,423.488,
