Frame number,1000000000,1000000001,1000000002,1000000003,
0.000000,989.872,2198.7,1539.13,871.951,
1.000000,1214.88,1711.95,1573.27,934.96,
2.000000,1459.45,1518.01,1579.23,1113.29,
3.000000,1902.46,1416.14,1735.75,1383.12,
4.000000,1981.65,1525.11,1743.01,1598.93,
5.000000,2127.64,1489.78,1717.01,1580.23,
6.000000,2027.67,1372.52,1649.45,1560.15,
7.000000,1897.29,1347.92,1621.67,1457.31,
8.000000,1617.67,1303.71,1603.75,1371.41,
9.000000,1578.08,1154.16,1485.84,1315.19,
10.000000,1568.75,1125.16,1403.46,1220.04,
11.000000,1472.26,1099.9,1396.12,1157.8,
12.000000,1432.51,1099,1360.57,1167.12,
13.000000,1320.39,1064.04,1326.34,1089,
14.000000,1358.76,1068.12,1295.33,1153.19,
15.000000,1309.88,1092.1,1262.92,1122.77,
16.000000,1282.21,1072.16,1280.64,1108.82,
17.000000,1311.61,1062.96,1343.16,1130.88,
18.000000,1327.98,1066,1416.92,1162.07,
19.000000,1384.28,1051.74,1429.17,1161.78,
20.000000,1389.02,1078.98,1438.99,1176.74,
21.000000,1474.22,1090.19,1418.68,1211.12,
22.000000,1476.09,1109.83,1354.12,1209.8,
23.000000,1470.88,1121,1336.09,1241.86,
24.000000,1429.16,1100.89,1316.98,1124,
25.000000,1337.23,1075.72,1306.94,1178.86,
26.000000,1296.2,1013.13,1286.15,1065.13,
27.000000,1242.86,1006.96,1296.06,1043.85,
28.000000,1151,959,1187.4,1030.96,
29.000000,1130.09,921.256,1199.76,1027.18,
30.000000,1113.3,897.48,1099.46,1043.14,
31.000000,1094.24,860.408,1021.09,1025.91,
32.000000,1028.9,871.512,1040.86,986.976,
33.000000,969.2,903.104,1036.1,1001.66,
34.000000,1032.82,888.896,1061.84,953.196,
35.000000,1009.89,870.212,1003.22,989,
36.000000,989.22,891.912,1016.97,1000.5,
37.000000,1048.15,883.132,1060.04,975.5,
38.000000,1058.99,879.112,1039.02,957.956,
39.000000,1051.89,870.976,1040.43,1069.86,
40.000000,1105.58,893.612,1041,1006.83,
41.000000,1061.16,884.06,1025.79,1020.94,
42.000000,1052.27,866.134,1028.55,965.14,
43.000000,993,828.072,994.08,972.092,
44.000000,976.096,840,1001.82,947.944,
45.000000,917.966,801.028,927.938,931.944,
46.000000,913.008,810.268,893.12,905.928,
47.000000,843.972,758.948,916,852,
48.000000,842,763,864.908,869.904,
49.000000,824,731.036,883.792,866.04,
50.000000,806.084,722.96,842.1,853.096,
51.000000,806.104,703.96,829.984,826.088,
52.000000,822.989,670,849.568,805.112,
53.000000,806,723.056,848.984,804.928,
54.000000,833.94,667.08,877.984,841.928,
55.000000,855.36,722.048,867.02,866.164,
56.000000,874.1,700.036,869.268,876.86,
57.000000,903.076,722.94,863.946,894.02,
58.000000,886.16,699,878.94,824.1,
59.000000,864.04,708.92,879.888,857.98,
60.000000,842.032,714.915,824.972,840.144,
61.000000,795.02,699.064,851.12,820.08,
62.000000,786.092,701.848,769,808.16,
63.000000,772.968,672.948,768.072,774.936,
64.000000,773.056,683.05,755.974,792.066,
65.000000,751.972,645.016,747.94,756.48,
66.000000,749.42,654,743.096,727.536,
67.000000,742.948,648.988,738.04,716.048,
68.000000,739.064,638,765.04,744.024,
69.000000,743.936,632.972,732.024,711.1,
70.000000,710.096,599.928,752.904,731.964,
71.000000,731.952,595,757.016,733,
72.000000,741.084,618.048,788.928,737.04,
73.000000,758.162,610.976,764,738.044,
74.000000,787.176,596.932,778.916,751.944,
75.000000,743,624.064,751.528,797.984,
76.000000,759.093,639.043,765.984,758.036,
77.000000,760.954,655,731.504,772,
78.000000,793.092,635.876,723.984,735.016,
79.000000,753.86,624.08,710.004,736.008,
80.000000,754.12,604.04,682.052,705.096,
81.000000,771.128,613.9,680.025,701.212,
82.000000,686,605.036,693.938,702.872,
83.000000,684.946,583.048,676.048,670.068,
84.000000,658.524,588.05,678.944,681.959,
85.000000,694.504,599.99,685.024,697.196,
86.000000,656.5,585.036,696,681.989,
87.000000,682.092,605.008,703.026,690.101,
88.000000,695.128,620.124,686.08,709.1,
89.000000,694.086,631.144,694.064,683.9,
90.000000,696.064,593.064,672.148,671.032,
91.000000,676.557,609.85,677.978,680,
92.000000,686.016,613.072,650.004,703.032,
93.000000,718.024,610.08,664.96,687.604,
94.000000,670.928,619.977,665,694.91,
95.000000,709.921,583.984,647.088,695.008,
