Time [ms],1000000000,1000000001,1000000002,1000000003,
0,776.092,700.936,615.512,761.072,
1000000000,869.872,809,738.994,908.125,
2000000000,1000.87,1068.81,887.766,1163.76,
3000000000,1252.5,1399.02,1010.96,1355.32,
4000000000,1391.86,1276,1260.4,1404.86,
5000000000,1394.96,1162.7,1158.8,1275,
6000000000,1387.92,1136.94,978.154,1217,
7000000000,1222.06,1018.08,972.964,978.165,
8000000000,1131.76,945.848,849.08,980.86,
9000000000,1000.86,861.482,792.172,809.1,
10000000000,935.84,788.824,714.124,721.963,
11000000000,877.02,703.134,654.936,698.987,
12000000000,777.912,707.984,639.064,651.546,
13000000000,702.008,657.098,594.924,639.032,
14000000000,681.02,591.94,579.092,589.047,
15000000000,634.876,577.076,569.952,597,
16000000000,612,577.968,545.003,566.052,
17000000000,614.024,583.986,543.09,592,
18000000000,626.96,580.979,556.015,591.992,
19000000000,622.938,598.978,553.46,612,
20000000000,669.912,648.024,559,659,
21000000000,718.86,727.904,614,681.912,
22000000000,840.123,858.038,712.04,787.395,
23000000000,911.088,904.104,805.084,890.51,
24000000000,893.68,935.822,774.112,846.184,
25000000000,919.048,819.975,738.75,831.24,
26000000000,833.026,818.032,718.912,756.92,
27000000000,791.578,702.948,657.152,710.688,
28000000000,736.12,700.026,635.06,665.6,
29000000000,725.172,651.036,645.93,626.024,
30000000000,672.916,616.492,594.92,592,
31000000000,668.036,603.936,559.084,577.032,
32000000000,633.08,585.54,526.05,551.052,
33000000000,608.024,564.98,558.032,548.976,
34000000000,584.034,538.47,550.063,550.94,
35000000000,576.076,564.928,522.976,520.044,
36000000000,561,549.048,496.008,540.966,
37000000000,568.964,544.544,513.06,533.92,
38000000000,564.088,607.16,529.048,536.06,
39000000000,631.004,613.008,555.992,536.06,
40000000000,642.928,628.974,552.93,559.053,
41000000000,642.992,659.952,568,554,
42000000000,693.07,667.112,626.9,629.921,
43000000000,668.988,643.04,639.068,653.922,
44000000000,657,628.068,587,677.12,
45000000000,618.068,600.06,581.507,619,
46000000000,602.98,589.064,579.992,635.953,
47000000000,607,579.978,564.04,577,
48000000000,601.938,589.048,572.514,579.092,
49000000000,584.948,560.991,525,598.985,
50000000000,556.008,552.908,553.072,565.086,
51000000000,554.95,528.044,518.04,545.01,
52000000000,539.02,535.998,500.981,532.034,
53000000000,552.02,530.008,522.994,553.02,
54000000000,541.992,507.04,492.02,549.97,
55000000000,560.05,525.029,504,505.968,
56000000000,551.46,555.1,524.992,540.035,
57000000000,562.42,573.036,533.968,529.956,
58000000000,595.032,545.044,561.96,556.042,
59000000000,602,554.94,523.946,538.027,
60000000000,560.026,558.052,550.947,552.068,
61000000000,592,553.912,530.484,537,
62000000000,588.98,587,551.904,552.985,
63000000000,561.02,570.992,533.944,526.976,
64000000000,558.52,558.532,536.996,541.072,
65000000000,551.992,538.965,541,546.932,
66000000000,554.988,545.944,534.017,514.005,
67000000000,570,523.96,514.992,516.014,
68000000000,529.988,508.96,517.016,532.039,
69000000000,542.024,512.011,497.009,517.04,
70000000000,518.014,515.024,503.058,520.894,
71000000000,529.95,517.026,508.022,519,
72000000000,515.992,510.949,505.041,528.043,
73000000000,517.05,521.989,501.99,509.015,
74000000000,527.008,541.946,526.043,507.04,
75000000000,528.028,506.997,518.988,504.476,
76000000000,527.076,511.02,496.038,509.052,
77000000000,545,529.496,515.944,525,
78000000000,529.992,513,518,519.456,
79000000000,547.522,538.02,493.96,505.973,
80000000000,570.984,536.024,517.938,504.964,
81000000000,551.048,515.032,493.078,511.959,
82000000000,533.056,546.08,509.048,508.991,
83000000000,522.02,516.02,482.024,482.5,
84000000000,544.958,514.024,512.008,514.024,
85000000000,518.012,514.978,510.01,509.972,
86000000000,511.026,500.06,497,511.522,
87000000000,534.994,513.952,499.04,487.52,
88000000000,531.984,504,503.12,512.006,
89000000000,516.94,513.98,477.02,494.472,
90000000000,531.993,496.05,489.924,495.518,
91000000000,513.004,522.051,487.048,494.034,
92000000000,519.944,501.992,494.01,491.96,
93000000000,499.984,504.008,489,503.012,
94000000000,518.964,518.006,495.972,491.047,
