Time [ms],1000000000,1000000001,1000000002,1000000003,
0,806.124,707.04,630.784,668.984,
1000000000,968.952,985.614,889.47,826.208,
2000000000,1787.13,940.376,1104.64,1404,
3000000000,1961.43,1395.7,1037.92,1618.32,
4000000000,2025.35,2068.07,1179.75,2330.62,
5000000000,2214.34,1950.68,1285.96,2075.28,
6000000000,2318.28,1935.39,1347.23,1901.52,
7000000000,1682.08,1466.25,1302.95,1398.23,
8000000000,1272.49,1137.53,1222.15,1532.1,
9000000000,1266.21,1058.24,1243.37,1165.27,
10000000000,1181.18,992.618,1085.45,979.044,
11000000000,1095.01,951.272,895.106,1059.87,
12000000000,1102.01,863.359,899.888,921.008,
13000000000,986.647,819.872,784.074,830.08,
14000000000,878.795,872.114,786.9,800.952,
15000000000,844.049,781,723.85,754.11,
16000000000,789.099,808.04,719.956,742.98,
17000000000,779.788,789.926,670.016,763.912,
18000000000,783.024,791.46,698.98,727.904,
19000000000,890.016,696,724.04,736.984,
20000000000,991.808,810.016,798.92,770.936,
21000000000,1087.78,846.624,935.616,738.902,
22000000000,1227.13,962.1,1013.9,896.2,
23000000000,1288.99,1089.63,970,932.062,
24000000000,1289.2,1087.37,1045.03,850.99,
25000000000,1247.93,1062.73,1058.95,907.68,
26000000000,1188.15,1044.82,971.024,836.704,
27000000000,1164.27,1015.54,974.946,854.404,
28000000000,1043.93,1028.4,860.92,782.964,
29000000000,951.84,861.166,773.064,741.056,
30000000000,919.888,834.476,715.934,654.116,
31000000000,925.504,856.168,685.05,664.8,
32000000000,883.608,775.527,674.792,663.932,
33000000000,821.96,749.992,671.008,619.024,
34000000000,759,722.5,637.914,584.072,
35000000000,782.984,711.054,681.05,622.95,
36000000000,738.856,692.951,676.878,613.058,
37000000000,791.91,710.916,649.135,621.992,
38000000000,869.168,875,719.896,595.072,
39000000000,906.031,868.484,758.144,673.56,
40000000000,975.9,884.182,823.104,675.037,
41000000000,816.901,996.996,826.944,654.062,
42000000000,828.832,983,866.098,621.06,
43000000000,792.5,945.198,906.876,599.831,
44000000000,745.912,857,781.788,628.51,
45000000000,741.897,801.902,709.951,629.448,
46000000000,670.9,770.162,747.947,589.488,
47000000000,719.004,711.984,654.976,572.531,
48000000000,711.86,722.456,659.048,579.99,
49000000000,673.044,697.88,606.95,560.95,
50000000000,627.128,684.488,602.044,580.094,
51000000000,656.036,666.92,611.024,559.96,
52000000000,619.972,657.536,577.946,540.012,
53000000000,643.14,670.572,616.008,561.054,
54000000000,643.04,632.048,570.014,536.02,
55000000000,646.048,670.929,566.012,552.028,
56000000000,686.864,745.878,622,539.112,
57000000000,758.904,746.128,591.992,595.52,
58000000000,708.12,798.802,613.548,586.988,
59000000000,771.1,741.88,642.856,575,
60000000000,717.712,696.957,596.972,572.008,
61000000000,674.004,663.012,584.98,568.925,
62000000000,653.972,642.924,556.994,563.94,
63000000000,648.048,647.006,522.5,544.032,
64000000000,628.92,619.108,523.96,550,
65000000000,614.04,641.03,547.032,541.962,
66000000000,627.944,632.958,545.512,542.04,
67000000000,621,593.01,533,504.984,
68000000000,567.988,582.083,503.928,490,
69000000000,596.976,594.992,527.004,515.054,
70000000000,584.044,533.911,510.02,547.024,
71000000000,583.488,570.984,513.064,537.036,
72000000000,596.964,553.056,530.011,520.032,
73000000000,601.95,587.04,529.032,515.56,
74000000000,652,551.076,541.064,543.993,
75000000000,601.068,602.916,535.032,522.52,
76000000000,650,599.098,569.896,520.009,
77000000000,628.992,567.05,539.07,506.06,
78000000000,581.556,571.966,567.96,534.424,
79000000000,584.04,589.041,519.95,537.985,
80000000000,562.034,559.046,526.992,499.964,
81000000000,553.02,556.474,521.988,470.047,
82000000000,561.024,554.467,508.09,509.994,
83000000000,527.96,530.469,509.957,481.958,
84000000000,537.922,516.944,496.992,499.015,
85000000000,528.08,521.024,508.055,481.953,
86000000000,526,514.012,491.047,502.004,
87000000000,510.958,521.979,492.962,490.036,
88000000000,527.04,498.962,501.028,499.984,
89000000000,517.054,501.512,499.954,478.952,
90000000000,516.982,496.008,522.992,497.05,
91000000000,546.928,487.974,504.968,483.024,
92000000000,566.058,519.045,503.995,494,
93000000000,535.076,512.051,524.99,519.036,
94000000000,533.05,511.008,504.024,501.956,
