Time [ms],1000000000,
0,464.016,
1000000000,444,
2000000000,448,
3000000000,450.016,
4000000000,462.005,
5000000000,463.96,
6000000000,457.492,
7000000000,465.004,
8000000000,450.017,
9000000000,447.984,
10000000000,437.997,
11000000000,430.977,
12000000000,438.991,
13000000000,428.04,
14000000000,430.969,
15000000000,433.012,
16000000000,429.008,
17000000000,426.994,
18000000000,427.048,
19000000000,444.984,
20000000000,432.025,
21000000000,441.021,
22000000000,433.024,
23000000000,443.98,
24000000000,433.032,
25000000000,425.536,
26000000000,436.512,
27000000000,439.506,
28000000000,438.5,
29000000000,433.503,
30000000000,428.992,
31000000000,428.016,
32000000000,421.496,
33000000000,418.52,
34000000000,427.01,
35000000000,439.024,
36000000000,428.51,
37000000000,423.5,
38000000000,427.999,
39000000000,427,
40000000000,429.475,
41000000000,431.992,
42000000000,431.496,
43000000000,432,
44000000000,429.992,
45000000000,434.52,
46000000000,434.482,
47000000000,426.012,
48000000000,425.518,
49000000000,422.484,
50000000000,422.036,
51000000000,423,
52000000000,416.02,
53000000000,446.04,
54000000000,441.024,
55000000000,442.98,
56000000000,438.988,
57000000000,432.98,
58000000000,439.972,
59000000000,448.505,
60000000000,445.5,
61000000000,436.02,
62000000000,426.992,
63000000000,436,
64000000000,433.498,
65000000000,432.52,
66000000000,435.508,
67000000000,437.488,
68000000000,428.991,
69000000000,446.022,
70000000000,431.016,
71000000000,425.02,
72000000000,439.006,
73000000000,436.005,
74000000000,432.997,
75000000000,436.968,
76000000000,433.995,
77000000000,426.48,
78000000000,432.994,
79000000000,435.011,
80000000000,444.51,
81000000000,440.495,
82000000000,433.002,
83000000000,442.982,
84000000000,425,
85000000000,428,
86000000000,439.996,
87000000000,430.464,
88000000000,430.48,
89000000000,437,
90000000000,437,
91000000000,434.48,
92000000000,435.516,
93000000000,429.496,
94000000000,425.016,
95000000000,429.98,
