Time [ms],1000000000,1000000001,1000000002,
0,1133.97,1307.2,935.177,
1000000000,716.094,791.888,641.024,
2000000000,652.073,710,567.14,
3000000000,682.942,704.122,586.992,
4000000000,675,744.008,615.931,
5000000000,714.648,714.449,596.896,
6000000000,680.256,624.08,559.01,
7000000000,677.524,614.912,596.928,
8000000000,666.59,618.088,575.07,
9000000000,641.904,629.136,559.576,
10000000000,632.144,626.935,539.982,
11000000000,584.955,590.84,520.056,
12000000000,565.946,595.096,516.056,
13000000000,568.058,532.955,537.056,
14000000000,554.912,564.504,512,
15000000000,536.02,540.55,507.476,
16000000000,545.058,575.985,520.056,
17000000000,560.945,545.023,495.993,
18000000000,588.08,567.982,512.984,
19000000000,585.056,596.066,489.544,
20000000000,597.989,608.912,552,
21000000000,606.896,627.946,568.96,
22000000000,635.089,634.064,571.943,
23000000000,643.865,611.888,582.002,
24000000000,642.894,628.856,559.936,
25000000000,617.026,628.499,586.08,
26000000000,592.024,680.888,588.04,
27000000000,589.096,627.036,535.943,
28000000000,604.12,612.981,538.072,
29000000000,580.066,603.072,544.048,
30000000000,532.969,574.484,529.976,
31000000000,536.967,569.002,510.988,
32000000000,525.935,534.042,487.054,
33000000000,505.952,548.051,503.54,
34000000000,525.936,536.936,476.056,
35000000000,497.9,521.988,500.468,
36000000000,521.008,533.976,499.041,
37000000000,527,545.071,509.006,
38000000000,558.508,565.916,519.06,
39000000000,563.024,567.9,512.082,
40000000000,547.028,580.12,498.97,
41000000000,567.068,559.906,517.07,
42000000000,555.116,601.888,517.055,
43000000000,558.979,568.98,534.932,
44000000000,584.95,574,530.958,
45000000000,556,571.012,530.097,
46000000000,552.876,565.094,552.96,
47000000000,548.107,564.096,518.92,
48000000000,546.932,559.112,527.05,
49000000000,532.079,527.912,517.924,
50000000000,518.945,524.96,487.029,
51000000000,519.995,511.432,499.968,
52000000000,515.014,495.972,484,
53000000000,517.012,520.03,486.992,
54000000000,498.056,500.06,464.997,
55000000000,503.04,488.072,473.97,
56000000000,502.015,477.016,462.956,
57000000000,535.54,489.964,466,
58000000000,531.952,487.976,463.056,
59000000000,529.48,508.488,474.981,
60000000000,524.48,503.008,472.08,
61000000000,510.461,502,469.965,
62000000000,528.98,492.504,469,
63000000000,518.064,500.517,467.068,
64000000000,519.956,483.55,469.958,
65000000000,498.088,510.054,479.999,
66000000000,515.08,498.088,479.937,
67000000000,510.03,508.54,495.03,
68000000000,505.034,510.94,470.078,
69000000000,506.944,495.026,492.026,
70000000000,499.02,496.47,477.049,
71000000000,510.96,495.012,478,
72000000000,489,483.48,476.913,
73000000000,482.54,486.504,477.989,
74000000000,476.496,474.515,478.937,
75000000000,491.05,486.916,451.98,
76000000000,498.02,479,493.959,
77000000000,491.013,481.941,477.988,
78000000000,495.944,497.48,499.058,
79000000000,496.015,489.024,501.1,
80000000000,518.53,481.498,460.038,
81000000000,492.96,497.488,480.033,
82000000000,510.55,489.984,466.975,
83000000000,495.478,489.51,482.959,
84000000000,509.476,488.5,492.967,
85000000000,485.97,486.966,476.934,
86000000000,487.024,474.554,475.032,
87000000000,487.056,477.458,474.04,
88000000000,486.496,465.054,447.064,
89000000000,494.504,482.514,477.04,
90000000000,488.036,489.948,474,
91000000000,477.05,470.46,469.071,
92000000000,492.988,486.494,488.036,
93000000000,507.491,479.544,464.045,
94000000000,489.038,490.48,475.96,
95000000000,503.496,466.986,482.996,
