Frame number,1000000000,1000000001,1000000002,1000000003,
0.000000,6819.64,19914.8,24966.1,13899,
1.000000,5383.06,15053.8,25108.9,13224.2,
2.000000,5395.15,16266.4,38578.5,26495.9,
3.000000,4887.27,19259.5,34485.1,33604.8,
4.000000,5513.02,16711.6,29721.1,24999.5,
5.000000,5456.82,12276.4,21475.1,12796.5,
6.000000,4376.26,8859.72,16268.6,8663.46,
7.000000,3786.08,7119.28,12303.5,7365,
8.000000,3566.76,5798.76,8478.64,7259.97,
9.000000,3228.58,4628.79,6300.82,5232.73,
10.000000,2602.28,3961.81,4393.2,4070.86,
11.000000,2003.44,3469.28,3260,3162.94,
12.000000,1899.06,3092.8,3106.1,2822.71,
13.000000,1799.52,3451.04,2460.94,2474.46,
14.000000,1773.5,3547.62,3289.36,2857.22,
15.000000,1863.18,3962.12,5957.5,4683,
16.000000,2405.8,5009.67,9142.04,6846.64,
17.000000,3040.9,6743.87,14541.2,13745.7,
18.000000,4323.61,8550.73,18590.9,13406.9,
19.000000,4985.26,9520.41,19189,11531.2,
20.000000,4464.99,7962.98,15964.9,9239.06,
21.000000,4141.51,6874.04,11565.3,7108.73,
22.000000,3892.23,6479.82,9223.56,5973.96,
23.000000,3767.09,6704.9,7218.72,5270.57,
24.000000,3425.71,5722.28,5550.13,4339.44,
25.000000,2758.78,4501.28,4113,3296.51,
26.000000,2377.02,3670.32,3324.02,2702.56,
27.000000,2138.33,3023.72,2901.8,2284.8,
28.000000,2083.08,2609.54,2631.98,2067.81,
29.000000,2286.2,2666.38,3074.99,2296.18,
30.000000,2380.51,2839.46,4573.46,3178.56,
31.000000,3002.87,3751.61,7525.68,4599.96,
32.000000,3748.78,4867.35,11000,6986.45,
33.000000,4317.71,6309.95,14478.3,8239.92,
34.000000,4534.2,6289.24,14456.8,6743.32,
35.000000,4050.87,5292.85,10856.1,5303.53,
36.000000,4111.4,4656.06,7693.58,4451.88,
37.000000,3706.14,4391.57,6084.34,4249.36,
38.000000,3282.69,4044.74,4911.38,3607.05,
39.000000,2764.2,3499.29,3940.59,3031.12,
40.000000,2354.49,2922.23,2994.2,2268,
41.000000,2109.44,2284.01,2376.38,1911.38,
42.000000,1973.57,2012.56,2030.04,1747.6,
43.000000,2139,1842.46,1922.39,1642.82,
44.000000,2352.93,1785.56,2222.82,1933.11,
45.000000,2628.08,2273.45,3293.38,2449.28,
46.000000,3544.09,3065.6,4707.61,3529.18,
47.000000,4107.49,4330.39,6970.08,5065.84,
48.000000,4633.2,5239.9,7660.7,5941.9,
49.000000,4170.45,5182.25,7479.65,5216.21,
50.000000,4024.56,4377.47,6287.51,4215.34,
51.000000,3769.63,3722.89,5147.37,3722.06,
52.000000,3614.63,3320.88,4758.95,3441.7,
53.000000,2959.06,2888.22,4075.01,2923.58,
54.000000,2604.1,2395.55,3927.08,2404.04,
55.000000,2307.64,2017.07,3617.53,2013.36,
56.000000,2040.91,1702.02,3200.44,1734.76,
57.000000,1938.62,1460.77,2927.65,1576.65,
58.000000,2093.5,1386.04,2759.51,1590.15,
59.000000,2353,1492.38,2755.82,1776.07,
60.000000,3048.61,1763.25,3149.38,2465.29,
61.000000,3569.52,2549.4,4390.16,3348.32,
62.000000,4575.16,3272.88,5508.86,4240.21,
63.000000,4472.62,3940.1,5806.27,4662.76,
64.000000,4474.46,3943.35,5663.74,4249.43,
65.000000,3908.49,3533.39,4955.51,3802.87,
66.000000,3954.27,3124.7,4289.28,3460.08,
67.000000,3323.01,2831.44,3534.5,3166.68,
68.000000,3008.84,2579.36,3111.76,2470.68,
69.000000,2568.16,2205.03,2857.97,2232.54,
70.000000,2289.46,1908.07,2474.44,2069.28,
71.000000,2154.93,1659.13,2566.34,1843.39,
72.000000,2098.17,1618.97,2437.98,1679.69,
73.000000,2200.22,1588,2643.08,1806.1,
74.000000,2698.25,1758.11,2691.77,2057.98,
75.000000,3380.72,2262.52,2676.21,2841.96,
76.000000,4278.53,2977.77,2784.55,3675.55,
77.000000,5016.56,3732.8,3430.54,4313.41,
78.000000,5046.53,3860.52,4077.93,4362.72,
79.000000,4375.65,3536.74,4768.54,4057.97,
80.000000,4067.9,3101.26,4595.66,3736.29,
81.000000,3778.3,2838.65,3853.68,3521.75,
82.000000,3267.33,2562.04,3016.22,3166.25,
83.000000,2950.19,2210.7,2588.76,2728.91,
84.000000,2481.09,1833.22,2263.47,2341.1,
85.000000,2346.84,1563.89,2067.54,2135.01,
86.000000,2176.95,1357.03,2035.01,2035.85,
87.000000,2205.88,1318,1898.64,1952.88,
88.000000,2501.23,1419.71,1836.94,2208.81,
89.000000,3285.6,1785.76,1777.07,2689.9,
90.000000,4082.65,2391.93,1720.08,3837.25,
91.000000,5290.25,3296.85,1700,4743.62,
92.000000,5446.01,3882.04,1675.34,4711.97,
93.000000,4803.21,3662.97,1711.03,4187.14,
94.000000,4371.55,3059.71,1688.96,3555.26,
95.000000,3997.76,2465.08,1716.05,3150.13,
