Frame number,1000000000,1000000001,1000000002,1000000003,
0.000000,1541.99,749.952,745.06,1231.02,
1.000000,1300.87,963.962,960.16,2710.23,
2.000000,1446.9,1360.09,1355.98,4993,
3.000000,1473.94,1499.18,1450.06,6131.69,
4.000000,1334.13,1534.67,1412.05,4949.7,
5.000000,1346.14,1616.75,1474.06,5026.67,
6.000000,1280.06,1626.34,1398.96,4779.62,
7.000000,1221.91,1653.29,1342.01,4155.08,
8.000000,1074.12,1528.82,1291.91,3759.16,
9.000000,1025.98,1443.39,1193.95,3275.1,
10.000000,985.91,1313.34,1091.91,2644.22,
11.000000,913.958,1323.3,1139.14,2274.95,
12.000000,886.96,1275.72,1070.1,2096.18,
13.000000,855.1,1198.73,1072,2000.08,
14.000000,854.985,1204.04,1086.1,2102.05,
15.000000,850.88,1216.66,1149.02,2117.48,
16.000000,895.44,1172.14,1156.03,2333.88,
17.000000,952.48,1310.53,1233.49,2782.5,
18.000000,1023.48,1284.95,1232.48,3333.3,
19.000000,994.952,1351.87,1232.53,3180.69,
20.000000,1068.98,1353.09,1279.03,3043.1,
21.000000,1073.95,1385.95,1299.97,3205.8,
22.000000,977.994,1403.68,1320.05,2822.66,
23.000000,962.932,1342.26,1259.99,2606.8,
24.000000,927.07,1252.18,1221.97,2308.12,
25.000000,943.982,1220.97,1206.9,2152.02,
26.000000,875.89,1195.2,1149,1888.01,
27.000000,871.512,1184.07,1109.98,1735.82,
28.000000,860.488,1199.8,1090.97,1640.11,
29.000000,863.015,1148.17,1033.01,1560.86,
30.000000,859.917,1155.22,1007.99,1512.84,
31.000000,857.977,1098.14,1010.95,1492.06,
32.000000,848.028,1166.96,1020.99,1651.09,
33.000000,872.004,1092.76,1050,1812.68,
34.000000,882.081,1092.13,1036.92,2018.43,
35.000000,870.003,1062.02,1030.06,2019.71,
36.000000,909.894,1125.15,1041.98,2017.38,
37.000000,916.065,1127.24,1058.97,2041.94,
38.000000,915.016,1119.79,1031.03,1992.43,
39.000000,872.94,1143.88,1041.91,1837.95,
40.000000,846.966,1144.8,997.968,1731.32,
41.000000,781,1088,979.011,1604.26,
42.000000,794.981,1071.32,942.974,1463.98,
43.000000,760.93,1065.88,933.952,1396.8,
44.000000,748.96,1022.97,936.06,1296.18,
45.000000,737.05,996.8,897.944,1219,
46.000000,733.935,1008.23,867.024,1163.9,
47.000000,718.982,982.16,875.568,1158.05,
48.000000,726.968,951.96,908.025,1269.16,
49.000000,730.025,932.164,896.997,1418.1,
50.000000,740.967,920.112,885.996,1500.12,
51.000000,742.002,923.988,925.868,1476.89,
52.000000,738.008,946.072,916.994,1483.02,
53.000000,735.977,964.128,929.038,1520.03,
54.000000,725.98,977.16,894.064,1488.87,
55.000000,691.472,968.968,893.015,1421.94,
56.000000,673.983,973.096,876.952,1394.01,
57.000000,661.042,946.724,879.888,1293.23,
58.000000,687.98,937.996,847.032,1196.64,
59.000000,670.972,910.952,816,1147.49,
60.000000,658.032,904.164,782.072,1080.92,
61.000000,661.08,873.84,800.976,1020.04,
62.000000,656.12,842.952,787.028,1007.86,
63.000000,658.984,812.11,780.928,983.054,
64.000000,635.944,813.928,796.108,1067.09,
65.000000,635.013,816.168,797,1153.02,
66.000000,651.012,812.04,778,1152.24,
67.000000,653.036,809.88,860.078,1172.83,
68.000000,645.046,819.564,836.025,1236.17,
69.000000,687.048,833.126,812,1318.87,
70.000000,677.972,823.048,814.035,1254.88,
71.000000,657.952,854.902,807.063,1274.42,
72.000000,659.015,888.134,770.53,1205.01,
73.000000,643.105,837.504,762.464,1160.95,
74.000000,647.015,829.976,745.02,1180.91,
75.000000,609.008,804,737.472,1129.06,
76.000000,638.066,761.052,720.514,1053.07,
77.000000,629.002,758.992,736.952,999.926,
78.000000,621,723.064,707.888,935.958,
79.000000,630.08,733.1,718.936,962.014,
80.000000,626.008,670.956,727.04,1016.15,
81.000000,611.052,710.12,727.073,1122.97,
82.000000,629.976,723.052,728.048,1186.99,
83.000000,607.98,709.486,743.938,1189.15,
84.000000,607.016,707.872,744.048,1202.97,
85.000000,611.993,721.448,737.096,1136.02,
86.000000,599,728,732,1165.1,
87.000000,616,729.974,718.028,1102.93,
88.000000,609.936,715.888,717.096,1097.1,
89.000000,590.031,731.972,695.116,1072.02,
90.000000,584,728,709,1067.08,
91.000000,598.528,727.872,674.955,1041.1,
92.000000,597.544,731.01,669.96,993.056,
93.000000,573.02,721.96,641.928,993.962,
