Frame number,1000000000,1000000001,1000000002,1000000003,1000000004,
0.000000,511.026,611.928,607.972,596.96,646.928,
1.000000,503.032,590.948,568.503,558.045,620,
2.000000,551.1,632.94,627.536,628.049,626.948,
3.000000,542.484,676.859,654,634.06,663.93,
4.000000,539.476,687.052,635.472,641.476,649.948,
5.000000,537.985,663.977,603.424,636.972,654.01,
6.000000,514.044,635.824,589.492,570.132,598.984,
7.000000,477.03,576,552.496,531.05,570.944,
8.000000,489.036,551.08,512.026,515.024,538.074,
9.000000,472.965,533.072,506.04,499.024,512.96,
10.000000,463.48,507.996,491.972,470.52,496.982,
11.000000,464.98,482.034,461.959,480.972,495.964,
12.000000,448.016,474.996,470.912,464.016,484.056,
13.000000,451.994,479.052,460.973,462.508,476.976,
14.000000,442.023,492.956,462.048,455.024,475.98,
15.000000,451.008,482.016,462.026,460.036,476.984,
16.000000,450.036,491.947,494.02,482.03,490.967,
17.000000,478.984,494.036,496.983,497,500,
18.000000,472,514.024,531.932,520,521.017,
19.000000,484.96,537.988,530.938,538,549.968,
20.000000,484.008,541.528,553.024,529.965,574.014,
21.000000,490.02,534.032,562.996,516.035,554.08,
22.000000,470.966,533.464,536,506.97,547.06,
23.000000,464.004,502.528,502.037,497.022,530.964,
24.000000,461,500.488,494.027,485,504.027,
25.000000,447.995,482.492,483.018,450.96,493.947,
26.000000,442.021,465.519,474.016,460.021,476.052,
27.000000,446.976,458.504,469.97,444.025,470.007,
28.000000,447,448.016,473.02,454.98,476.98,
29.000000,444,452.024,475.018,466.042,475.963,
30.000000,448.031,466.024,473.5,466.98,472.044,
31.000000,452.968,467.992,477.047,471.04,485.97,
32.000000,458.999,481.018,494.018,476.05,497.978,
33.000000,465.042,501.018,519.024,503.024,501.004,
34.000000,452.012,509.496,511.984,500.52,502.96,
35.000000,469,491.992,493.008,478,503.013,
36.000000,460.988,494,494.04,473.982,502.017,
37.000000,456.04,479.98,491.944,470.986,505.992,
38.000000,467.042,481.968,483.044,462.008,491.93,
39.000000,458.995,479.482,482.508,464.026,488.034,
40.000000,441.969,456,451.994,470.056,485.958,
41.000000,444.994,465.98,453.974,473.02,483.02,
42.000000,441.05,464.025,460.05,449.99,469,
43.000000,442.98,449.484,462.984,460.048,464.998,
44.000000,443.029,458.942,466.504,468.984,473.98,
45.000000,462.976,481.016,484.02,465.003,480.976,
46.000000,465.958,493.928,487.952,469.948,483.045,
47.000000,453.008,470.991,515.034,477.048,499.992,
48.000000,455.984,477.05,490.977,468.975,493,
49.000000,451.98,472.488,484.05,464.983,486.984,
50.000000,443.037,471.011,484.008,462.016,472.045,
51.000000,433.98,473,469.972,462.98,468.016,
52.000000,433.007,464.988,464.026,457.04,464.976,
53.000000,445.952,449.997,457.007,449.016,467.97,
54.000000,442.036,456.016,464.512,465,461.952,
55.000000,448.026,446.03,451.06,444.04,462.024,
56.000000,440.016,460,463.048,461.034,471.025,
57.000000,442.975,468.952,467.02,468.026,468.007,
58.000000,440.936,469.03,485.02,471.971,469.96,
59.000000,466,492.046,503.832,483.02,493.932,
60.000000,450.005,491.073,486.05,491.043,495.988,
61.000000,456.981,482.021,494.488,479.024,487.01,
62.000000,449.046,480.02,477.026,482.028,485.04,
63.000000,447.983,472.98,466.992,459.99,471.012,
64.000000,432.972,449.983,461.5,450.991,455.97,
65.000000,440.988,462.015,461.5,464.986,449.964,
66.000000,444.02,442.006,458.008,444.981,461.984,
67.000000,425.968,449.952,447.021,444.999,441.014,
68.000000,435.006,448.995,446.024,439.976,446.49,
69.000000,436.98,455.04,448.528,447.97,455.504,
70.000000,431.043,455.98,460.952,453.988,464.016,
71.000000,447,458.01,463.972,458.04,454.496,
72.000000,452.992,467.998,484.98,447.004,456.966,
73.000000,451.048,490.04,480.03,473.985,480,
74.000000,444.038,485.016,479.042,483.044,495.05,
75.000000,442.991,474,475.966,487,493.98,
76.000000,443.984,474.984,466.04,465.019,470.98,
77.000000,435.98,465,446.993,465.026,474.98,
78.000000,442.04,442.02,457.982,450.04,472.06,
79.000000,437.984,443.98,447.982,456.001,454.999,
80.000000,429.008,444,451.992,456.044,461.972,
81.000000,425.984,440.974,441.01,440.014,460.995,
82.000000,431.984,439.025,448.025,435.956,459.965,
83.000000,434.992,437.021,449.056,439.974,463.032,
84.000000,437.996,444,447,450.964,455.96,
85.000000,430.032,442.99,460,452.512,461.04,
86.000000,436.055,463.992,453.02,462.016,474.025,
87.000000,444.021,459.056,467.489,467.052,472.04,
88.000000,441.989,468.005,472.976,468.987,467.032,
89.000000,426.05,456.981,470.512,473.007,481.972,
90.000000,432,454.976,458.992,452.016,474.979,
91.000000,446.011,448.04,456.968,456.48,458.968,
92.000000,434.032,443.028,461.496,445.974,457.983,
93.000000,427.992,448.988,448.488,449,450.024,
94.000000,439.04,453.004,454.512,450.003,446.984,
95.000000,433.992,439.996,456,452,451.028,
