Time [ms],1000000000,
0,444.025,
1000000000,444.023,
2000000000,434.98,
3000000000,439.98,
4000000000,435,
5000000000,438.99,
6000000000,425.048,
7000000000,435.012,
8000000000,432.014,
9000000000,429.992,
10000000000,415.5,
11000000000,426.993,
12000000000,425.512,
13000000000,426.014,
14000000000,423.987,
15000000000,415.035,
16000000000,422.02,
17000000000,427.99,
18000000000,429,
19000000000,430.999,
20000000000,435.95,
21000000000,429.024,
22000000000,437,
23000000000,433.008,
24000000000,425.98,
25000000000,425.982,
26000000000,421.982,
27000000000,423.987,
28000000000,421.98,
29000000000,422.988,
30000000000,414.992,
31000000000,423.994,
32000000000,418.982,
33000000000,418.018,
34000000000,420.029,
35000000000,422.02,
36000000000,422.003,
37000000000,420.016,
38000000000,424.016,
39000000000,422.985,
40000000000,419,
41000000000,428.013,
42000000000,411.033,
43000000000,424,
44000000000,421.01,
45000000000,426.008,
46000000000,415.972,
47000000000,410.025,
48000000000,418.024,
49000000000,418.008,
50000000000,420,
51000000000,418,
52000000000,418.016,
53000000000,419,
54000000000,420.034,
55000000000,420.992,
56000000000,416.997,
57000000000,417.006,
58000000000,423,
59000000000,415.992,
60000000000,423.008,
61000000000,423.024,
62000000000,414.976,
63000000000,420.02,
64000000000,417.016,
65000000000,416.02,
66000000000,419.016,
67000000000,410.975,
68000000000,416,
69000000000,416.996,
70000000000,410.016,
71000000000,422.01,
72000000000,414.987,
73000000000,406.984,
74000000000,419.018,
75000000000,414.04,
76000000000,420.98,
77000000000,411.018,
78000000000,411,
79000000000,419.002,
80000000000,413.976,
81000000000,411.964,
82000000000,406.976,
83000000000,407.988,
84000000000,420.003,
85000000000,403.998,
86000000000,416.99,
87000000000,408.006,
88000000000,414.006,
89000000000,408.016,
90000000000,412.03,
91000000000,409.001,
92000000000,414.98,
93000000000,406.004,
94000000000,414.998,
