
Intensity Median
 ==================== 
Time [s],1000000000,1000000001,1000000002,1000000003,1000000004,1000000005,1000000006,
0.000000,698.88,3266.24,1224.03,705.1,830.002,625.02,720.506,
1.000000,658.128,1814.61,1053,673,742.046,624.016,715.98,
2.000000,614,1395,1010.97,738,724.084,633.008,709.94,
3.000000,733.992,1472.82,1296.04,769.867,941.12,871.964,1046.95,
4.000000,1092.92,1998.8,2320.09,1255.75,2057.72,1548,2329.96,
5.000000,1890.54,3304.7,3675.3,2027.96,3330.08,2359.76,3848.29,
6.000000,2592.71,4521.28,4597.74,2860.48,4267.32,3004.06,3865.79,
7.000000,2827.2,5065.14,5173,3167.63,4451.4,3116.18,4413.51,
8.000000,2952.44,5314.9,5780.16,3399.23,4591.1,2971.21,4454.97,
9.000000,2675.94,5157.5,5923.86,3535.91,4514.37,2931.76,3925.01,
10.000000,2567.2,4974.47,5479.62,3413.32,4011.08,2691.78,3419.31,
11.000000,2441.46,4724,4922.16,3267.3,3751.9,2524.97,3237.31,
12.000000,2296.29,4552.61,4434.49,2955.24,3811.13,2355.9,3396.34,
13.000000,2075.87,4209.81,4153.97,2843.6,3616.86,2280.57,3073.5,
14.000000,2009.04,3755.72,3859.92,2633.77,3258.76,2187.1,3008.32,
15.000000,1960.03,3433.67,3547.14,2455.09,2788.12,2044.83,2872.23,
16.000000,1939.87,2993.13,3239.76,2126.73,2516.88,1987.17,2748.02,
17.000000,1952.19,2635.85,2951.82,1874.16,2311.62,1963.93,2567.18,
18.000000,1789.08,2481.01,2804.71,1715.71,2679.23,1904,2560.65,
19.000000,1778.03,2500.99,2871.24,1706.81,2602.63,1959.53,2509.19,
20.000000,1968.98,2659.44,3174.08,1872.96,3187.19,2240.08,2572.4,
21.000000,2132.88,3104.81,3452.69,2114.4,3336.67,2359.29,2837.18,
22.000000,2277.1,3636.6,3749.56,2165.84,3659.59,2610.11,2890.43,
23.000000,2433.65,3894,4072.52,2437.67,3767.59,2759.95,3218.96,
24.000000,2453.43,3856,4155.41,2740.06,3806.97,2824.52,3309.57,
25.000000,2330.11,3756.54,4181.21,2876.05,3714.85,2721.21,3431.58,
26.000000,2243.83,3607.48,3785.56,2716.52,3390.4,2560.39,3167.36,
27.000000,2007.99,3450.75,3498.39,2474.12,3286.71,2267.51,2944.6,
28.000000,1855.46,3175.39,3262.23,2294.89,3157.16,2192.95,2740.75,
29.000000,1716.92,2743.02,2950.37,2103.17,2883.51,2073.63,2496.15,
30.000000,1606.98,2483.48,2722.24,1912.86,2588.74,1872.92,2331.62,
31.000000,1532.97,2135.25,2364.55,1762.02,2427,1713.03,2182.87,
32.000000,1390.02,2127.83,2265.13,1537.19,2268.88,1597.13,2039.07,
33.000000,1404.96,1827.88,2163.96,1406.13,2081.08,1523.09,1776.02,
34.000000,1322.88,1774.84,2076,1311,2150.61,1419.86,1814.43,
35.000000,1458.09,1883.71,2307.04,1388.06,2380.33,1534.17,1809.03,
36.000000,1650.01,2070.54,2443.6,1699.18,2610.44,1593.07,1621.1,
37.000000,1744.1,2363.85,2592.08,1789.96,2874,1756.01,1977.53,
38.000000,1849.07,2759.65,2826.98,1969.75,3061.34,1907.15,2079.21,
39.000000,1953.05,2805.48,3112.91,2135.89,3083.03,1961.14,2126.18,
40.000000,1822.08,2661.41,2996.9,2339.98,3103.18,1946.83,2380.06,
41.000000,1661.05,2505.42,2934.82,2303,3010.91,1853,2281.8,
42.000000,1586.05,2547.81,2678.19,2210.04,2939.16,1748.12,2184.76,
43.000000,1495.08,2291.18,2529.14,2049.99,2583.3,1695.06,2067,
44.000000,1442.92,2336.26,2394.06,1991.88,2607.11,1655.1,1988.05,
45.000000,1415.06,1925.28,2326.54,1811.78,2423.2,1558.09,1869.65,
46.000000,1280.02,1887.15,2133.93,1706.99,2162.26,1455.9,1818.15,
47.000000,1203.99,1616.77,1947.03,1550.94,2050.21,1325.12,1633.01,
48.000000,1104.97,1539.14,1799.08,1361.97,1859,1286.07,1506.99,
49.000000,1112.03,1451.16,1706.93,1233.88,1888.18,1229.96,1435.54,
50.000000,1165.13,1465.88,1745,1160.93,1846.22,1193.01,1448.96,
51.000000,1236.91,1683.36,1840.89,1254.93,1985.92,1285.99,1483.91,
52.000000,1339.05,1766.94,1957.82,1394.92,2113.91,1374.08,1577.89,
53.000000,1429.08,1825.22,2093.79,1667.83,2264.69,1424.91,1655.92,
54.000000,1446.96,1846.13,2159.74,1802.04,2280.63,1470.12,1751.93,
55.000000,1367.98,2225,2141.48,2063.95,2361.15,1495.03,1807.03,
56.000000,1329.09,2367.69,2057.31,2134.05,2310.1,1423.96,1795.12,
57.000000,1280.12,2215,2037.12,2154.08,2169.04,1366.07,1705.89,
58.000000,1239.93,1943.35,1941.96,1973.78,2204.31,1334.08,1655.46,
59.000000,1216.05,1641.64,1867.08,1998.16,2059.92,1321.83,1658.03,
60.000000,1159.96,1525.82,1843,1814.99,1991,1298.92,1588.95,
61.000000,1147.08,1364.96,1724.1,1754.92,1870.86,1205.98,1592.94,
62.000000,1095.95,1353.94,1633.01,1628.9,1736.04,1191.98,1460.05,
63.000000,1005.02,1193.05,1489.06,1499.1,1710.78,1127.05,1419.99,
64.000000,967.992,1171.48,1435.76,1397,1607.03,1046,1333.92,
65.000000,987.098,1140.16,1341.98,1293.07,1534.87,996.116,1283.01,
66.000000,1033.02,1119.92,1403.94,1196.07,1574.98,1053.15,1343.99,
67.000000,1116.97,1284.19,1484.96,1186.04,1729.5,1044.03,1377,
68.000000,1179.99,1255.91,1601,1352.9,1769.45,1092.92,1371.95,
69.000000,1209.13,1307.98,1650.15,1507.85,1882.96,1194.03,1380.01,
70.000000,1218,1352.74,1638.78,1712.34,1900.02,1207.08,1564.99,
71.000000,1202.01,1353.17,1642.88,1949.94,1991.92,1241.05,1615.97,
72.000000,1161.55,1343.15,1595.86,2000.94,1944.58,1171,1525.01,
73.000000,1174.9,1311.16,1621.22,2055.9,1875.22,1171,1486.98,
74.000000,1076.97,1220.93,1551.86,2084.81,1868.83,1185.11,1471.05,
75.000000,1082.98,1160.22,1533.98,1934.15,1791.94,1159.09,1423.89,
76.000000,1059,1149.09,1460.79,1812.02,1702.82,1121.06,1441.96,
77.000000,1008.94,1050.13,1430.08,1735.15,1615.96,1095.06,1391.9,
78.000000,945.03,955.88,1362,1731.96,1545.21,1033.95,1369.01,
79.000000,887,916.042,1272.08,1626,1488.06,961.947,1287.96,
80.000000,916.07,871.244,1161.06,1522.12,1391.87,977.124,1220.09,
81.000000,914.1,923.996,1200.88,1418.17,1384,937.054,1140.46,
82.000000,956.985,925.944,1198.67,1326.85,1429.1,961.984,1191.05,
83.000000,928.97,1030.95,1194.22,1305.18,1465.98,953.02,1200.01,
84.000000,1006.99,1062.84,1313.12,1375.86,1568.49,1038.14,1194.95,
85.000000,1029.92,1043.88,1334,1483,1599.06,1044.15,1210.97,
86.000000,1022.1,1086.78,1439.95,1583.1,1613.01,1084.04,1290.08,
87.000000,1008.13,1090.13,1394.74,1624.98,1607.02,1075.94,1343.02,
88.000000,1015.94,1064.92,1325.15,1759.15,1559.04,1041.86,1318.6,
89.000000,999.96,1013.2,1337.07,1844.09,1546.6,1041.05,1327.36,
90.000000,989.5,981.12,1291.14,1789.22,1514.52,994.844,1300.11,
91.000000,952.032,901.05,1321.08,1805.13,1467.67,1010.93,1262.42,
92.000000,953.059,887.12,1273.05,1731.13,1422.45,998.062,1296.98,
93.000000,896.022,845.044,1265,1638.84,1356.58,933.032,1259.94,
94.000000,843.024,783.087,1182.04,1651.24,1299.14,937.92,1242.06,
95.000000,826.53,764.99,1098.08,1597.26,1214.38,879.93,1203,
