Time [ms],1000000000,
0,523.492,
1000000000,568.532,
2000000000,550.072,
3000000000,563.053,
4000000000,561.05,
5000000000,539.98,
6000000000,537.961,
7000000000,526.004,
8000000000,518,
9000000000,525.034,
10000000000,508.95,
11000000000,503.944,
12000000000,493.974,
13000000000,479.016,
14000000000,486.954,
15000000000,475.02,
16000000000,479.008,
17000000000,490.016,
18000000000,506.068,
19000000000,496.974,
20000000000,498.95,
21000000000,513.94,
22000000000,497.02,
23000000000,498.975,
24000000000,482.016,
25000000000,482.02,
26000000000,483.048,
27000000000,465,
28000000000,469.984,
29000000000,465.029,
30000000000,472.033,
31000000000,479.016,
32000000000,475.032,
33000000000,480.932,
34000000000,481.012,
35000000000,483.036,
36000000000,473.05,
37000000000,480.056,
38000000000,471.04,
39000000000,462.996,
40000000000,471.012,
41000000000,466.039,
42000000000,443.012,
43000000000,459.024,
44000000000,457.998,
45000000000,467.007,
46000000000,470.986,
47000000000,466.964,
48000000000,462.98,
49000000000,476.024,
50000000000,466.983,
51000000000,459.985,
52000000000,468,
53000000000,462.974,
54000000000,445.048,
55000000000,454.02,
56000000000,450.02,
57000000000,439.005,
58000000000,443.04,
59000000000,457.006,
60000000000,463,
61000000000,446.982,
62000000000,455.04,
63000000000,460.048,
64000000000,458.952,
65000000000,453.042,
66000000000,467.03,
67000000000,454.038,
68000000000,466.008,
69000000000,453.02,
70000000000,447.05,
71000000000,449.024,
72000000000,452.012,
73000000000,463.021,
74000000000,455.021,
75000000000,450.92,
76000000000,464.054,
77000000000,444.96,
78000000000,443.954,
79000000000,447.996,
80000000000,459.962,
81000000000,447.012,
82000000000,454.034,
83000000000,452.04,
84000000000,447.012,
85000000000,448.984,
86000000000,464.01,
87000000000,441.049,
88000000000,447.04,
89000000000,459.036,
90000000000,456.026,
91000000000,450.988,
92000000000,456.995,
93000000000,447.976,
94000000000,452.98,
95000000000,453.028,
