Frame number,1000000000,1000000001,
0.000000,6704.85,2712.76,
1.000000,12768.9,4635.44,
2.000000,19181.6,6709.88,
3.000000,12471.5,9958.58,
4.000000,9005.33,11118.4,
5.000000,6778.76,10762.8,
6.000000,4367,9191.29,
7.000000,3662.7,7838.47,
8.000000,2780.56,6449.97,
9.000000,2192.64,8948.74,
10.000000,1789.22,8407.01,
11.000000,1611.94,6400.22,
12.000000,1582.97,4977.93,
13.000000,1483.3,4103.79,
14.000000,1577.64,3711.54,
15.000000,1854.04,3828.28,
16.000000,2847.68,3961.42,
17.000000,4954.84,5021.03,
18.000000,8251.61,6863.48,
19.000000,7671.77,8224.58,
20.000000,6250.28,8043.7,
21.000000,5220,6994.9,
22.000000,3732.59,5930.58,
23.000000,2716.47,4591.43,
24.000000,2012.24,3738.57,
25.000000,1568.2,3009.21,
26.000000,1305.99,2546.26,
27.000000,1149.09,2359.44,
28.000000,1138.04,2205.62,
29.000000,1134.98,2036.03,
30.000000,1192.5,2080.56,
31.000000,1485.02,2277.93,
32.000000,2324.96,2828.22,
33.000000,3933.2,3848.34,
34.000000,5769.71,5124.54,
35.000000,6130.21,6170.01,
36.000000,5029.43,5812.36,
37.000000,4260.75,5129.36,
38.000000,3700.62,4507,
39.000000,2946.74,4087.02,
40.000000,2240.38,3445.12,
41.000000,1775.78,2881.66,
42.000000,1438.05,2499.97,
43.000000,1258.16,2414.31,
44.000000,1166.08,2219.42,
45.000000,1116.09,1980,
46.000000,1155.97,2016.9,
47.000000,1355.99,2153.62,
48.000000,1830.9,2539.11,
49.000000,2740.78,3717.8,
50.000000,3899.55,4923.45,
51.000000,4669.26,5320.8,
52.000000,4185.99,4919.26,
53.000000,3504,4471.08,
54.000000,3030.9,4022.51,
55.000000,2458,3411.19,
56.000000,2057.4,3084.86,
57.000000,1665.97,2727.66,
58.000000,1470.96,2472.54,
59.000000,1317.95,2084.32,
60.000000,1185.96,1798.72,
61.000000,1138.01,1644.94,
62.000000,1102,1586,
63.000000,1190.02,1681.89,
64.000000,1429.93,1907.98,
65.000000,2018,2451.62,
66.000000,2735.15,3325.43,
67.000000,3380.11,4152.44,
68.000000,3472.17,4283.8,
69.000000,3102.1,3817.82,
70.000000,2680,3442.88,
71.000000,2383.13,2936.67,
72.000000,2136.04,2709.04,
73.000000,1908.04,2550.18,
74.000000,1684.97,2242.92,
75.000000,1494.01,2057.6,
76.000000,1385.1,1923.49,
77.000000,1261.02,1816.92,
78.000000,1253.01,1714.09,
79.000000,1246.97,1808.1,
80.000000,1421.93,2052.34,
81.000000,1776.93,2661.89,
82.000000,2447.86,3438.68,
83.000000,3109.82,4024,
84.000000,3279,3988.09,
85.000000,3080.11,3662.74,
86.000000,2789.19,3339.1,
87.000000,2545,3050.2,
88.000000,2398.05,2649.88,
89.000000,2231.04,2265.19,
90.000000,2143.06,2161.14,
91.000000,1996.96,1858.47,
92.000000,1893.12,1700.01,
93.000000,1722.94,1566.97,
