Time [ms],1000000000,
0,434.016,
1000000000,437.952,
2000000000,438.017,
3000000000,444.028,
4000000000,449.015,
5000000000,444.98,
6000000000,444.999,
7000000000,437.99,
8000000000,431,
9000000000,435,
10000000000,432.015,
11000000000,438.994,
12000000000,431.01,
13000000000,422.02,
14000000000,419.028,
15000000000,424.5,
16000000000,427.492,
17000000000,424.973,
18000000000,438.02,
19000000000,422.98,
20000000000,428.02,
21000000000,430.025,
22000000000,425.006,
23000000000,429.024,
24000000000,441.988,
25000000000,427.988,
26000000000,434.984,
27000000000,413.028,
28000000000,435.98,
29000000000,429.019,
30000000000,417.976,
31000000000,428.02,
32000000000,418.983,
33000000000,431.972,
34000000000,429.997,
35000000000,422,
36000000000,434.992,
37000000000,425.02,
38000000000,424.032,
39000000000,422.006,
40000000000,435.007,
41000000000,434.04,
42000000000,426.013,
43000000000,429.016,
44000000000,428.034,
45000000000,421.035,
46000000000,421.984,
47000000000,424.02,
48000000000,417.993,
49000000000,427.994,
50000000000,427.008,
51000000000,427.008,
52000000000,424.962,
53000000000,422.04,
54000000000,422.038,
55000000000,413.004,
56000000000,431.994,
57000000000,432.978,
58000000000,424.992,
59000000000,421.981,
60000000000,423.019,
61000000000,415.965,
62000000000,430.004,
63000000000,423.994,
64000000000,423.017,
65000000000,426.956,
66000000000,414.004,
67000000000,420.001,
68000000000,423.99,
69000000000,416.036,
70000000000,427.976,
71000000000,423.975,
72000000000,430,
73000000000,431.984,
74000000000,424.994,
75000000000,423.98,
76000000000,422.034,
77000000000,426.02,
78000000000,414.999,
79000000000,414.016,
80000000000,410.982,
81000000000,418.02,
82000000000,420.03,
83000000000,425.04,
84000000000,409.014,
85000000000,419.994,
86000000000,421,
87000000000,422.994,
88000000000,420.998,
89000000000,424.02,
90000000000,423,
91000000000,421.962,
92000000000,419.038,
93000000000,427.024,
94000000000,431,
95000000000,425.978,
