Frame number,1000000000,
0.000000,423,
1.000000,441.984,
2.000000,446.985,
3.000000,466.02,
4.000000,475.48,
5.000000,485.02,
6.000000,488.02,
7.000000,473.496,
8.000000,475.974,
9.000000,471.514,
10.000000,477.984,
11.000000,463.99,
12.000000,464.508,
13.000000,457.008,
14.000000,449.978,
15.000000,438.952,
16.000000,455,
17.000000,446.968,
18.000000,444.996,
19.000000,466.992,
20.000000,466,
21.000000,461.012,
22.000000,462.008,
23.000000,467.041,
24.000000,465.017,
25.000000,456.975,
26.000000,460.959,
27.000000,446.984,
28.000000,453.005,
29.000000,440.985,
30.000000,439.032,
31.000000,451.032,
32.000000,447.952,
33.000000,443.032,
34.000000,462.035,
35.000000,451.986,
36.000000,459.032,
37.000000,457.025,
38.000000,464.988,
39.000000,455.01,
40.000000,454.032,
41.000000,441.99,
42.000000,442.002,
43.000000,442.978,
44.000000,447.04,
45.000000,440,
46.000000,442.028,
47.000000,436.032,
48.000000,444.044,
49.000000,440.025,
50.000000,452.021,
51.000000,441.008,
52.000000,448.984,
53.000000,453.002,
54.000000,448,
55.000000,453.968,
56.000000,443.018,
57.000000,440.984,
58.000000,438.99,
59.000000,436.99,
60.000000,435.016,
61.000000,431.996,
62.000000,435.496,
63.000000,429.008,
64.000000,437.976,
65.000000,435.996,
66.000000,435,
67.000000,448.01,
68.000000,436.518,
69.000000,435.998,
70.000000,443.98,
71.000000,450.52,
72.000000,432,
73.000000,436.006,
74.000000,434.013,
75.000000,432,
76.000000,436,
77.000000,439.988,
78.000000,429.01,
79.000000,431.492,
80.000000,428.5,
81.000000,437.504,
82.000000,439.039,
83.000000,445.003,
84.000000,444.998,
85.000000,451.492,
86.000000,439.52,
87.000000,441.008,
88.000000,435.52,
89.000000,437.472,
90.000000,430.514,
91.000000,432.472,
92.000000,436.008,
93.000000,432.03,
94.000000,434.012,
95.000000,433.008,
