Frame number,1000000000,1000000001,1000000002,
0.000000,725.512,733.932,795.008,
1.000000,780.148,731.077,753.04,
2.000000,756.909,865.12,759.232,
3.000000,984.99,1115.1,916.1,
4.000000,1112.29,1273.1,949.843,
5.000000,1225.33,1362.1,1047.46,
6.000000,1153.94,1268.76,1013.81,
7.000000,1188.26,1255.21,982.59,
8.000000,1001.03,1231.2,867.86,
9.000000,934.06,999.134,764.13,
10.000000,796.012,637.017,693.501,
11.000000,729.992,575.854,636.984,
12.000000,671.1,542.96,588.066,
13.000000,644.067,526.959,560.009,
14.000000,576.063,522.952,564.022,
15.000000,586.06,513.077,530.968,
16.000000,557.06,527.937,550.062,
17.000000,562.061,505.065,555.045,
18.000000,579.075,530.948,541.5,
19.000000,546.96,522.91,605.911,
20.000000,636.963,547.077,631.935,
21.000000,633.9,596.011,651.58,
22.000000,731.044,610.905,686.982,
23.000000,686.861,675.799,721.525,
24.000000,790.211,774.16,717.922,
25.000000,810.165,778.05,734.986,
26.000000,833.475,762.464,696.532,
27.000000,740.5,754.944,709.923,
28.000000,769.878,718.165,656.512,
29.000000,668.939,648.56,595.976,
30.000000,613.97,622.6,571.977,
31.000000,580.974,596.125,559.05,
32.000000,590.01,561.503,554.043,
33.000000,550.055,544.536,524.072,
34.000000,511.97,517.45,524.974,
35.000000,523.008,534.028,511.992,
36.000000,531.002,529.966,496.032,
37.000000,542.025,524.997,509.048,
38.000000,520.999,517.996,515.05,
39.000000,526.961,520.03,517.078,
40.000000,548.979,540.05,555.1,
41.000000,572.026,580.5,577.019,
42.000000,613.924,665.025,612.064,
43.000000,667.875,699.505,654.951,
44.000000,714.934,730.469,665.916,
45.000000,689,735.496,675.965,
46.000000,684.5,746.001,685.946,
47.000000,678.052,717.996,656.009,
48.000000,645.96,692.96,620.947,
49.000000,627.444,670.05,588.176,
50.000000,615.384,630.44,549.507,
51.000000,581.52,602.998,540.036,
52.000000,574.056,577.06,513,
53.000000,551.001,576.036,506.035,
54.000000,571.984,530.02,497.96,
55.000000,521.981,527.499,478.506,
56.000000,510.472,509.008,493.008,
57.000000,509.01,510.996,498.057,
58.000000,494.002,504.952,506.946,
59.000000,514.026,494.976,521.926,
60.000000,540.503,538.52,510.51,
61.000000,540.564,570.028,523.536,
62.000000,602.954,586.08,580.56,
63.000000,631.992,604.544,563.512,
64.000000,658.011,639.944,592.1,
65.000000,641.44,643.48,582.465,
66.000000,720.15,652.968,567.536,
67.000000,626.954,652.14,577.04,
68.000000,658.945,621.512,571.96,
69.000000,649.035,610.956,557.024,
70.000000,611.945,583.096,534.016,
71.000000,610.02,554.519,529.01,
72.000000,579.982,548.948,526.96,
73.000000,597.975,548.936,513.488,
74.000000,576.02,526.56,496.036,
75.000000,550.028,525.072,507.04,
76.000000,531.102,522.478,498.512,
77.000000,525.041,515.996,500.016,
78.000000,511.966,502.488,485.034,
79.000000,535.972,495.479,522.504,
80.000000,530.032,514.99,513.479,
81.000000,556.9,540.528,547.011,
82.000000,596.002,549.979,556.493,
83.000000,602.936,617.048,576.044,
84.000000,639.958,603.513,571.971,
85.000000,647.075,608.55,587.964,
86.000000,633.987,600.049,567.955,
87.000000,627.09,610.502,563.008,
88.000000,624.024,583.071,562.975,
89.000000,588.042,561.424,534.976,
90.000000,603.94,570.476,532.54,
91.000000,576.928,552.473,516.03,
92.000000,576.04,536.557,506.028,
93.000000,561.04,540.041,499.515,
94.000000,551.045,504.025,484.518,
95.000000,519.999,516.535,483.981,
