Frame number,1000000000,1000000001,1000000002,1000000003,
0.000000,762.025,827.192,985.803,1829.14,
1.000000,926.256,849.784,1173.88,1515.86,
2.000000,1007.87,947.512,1087.73,1397.03,
3.000000,1106.34,977.755,1310.03,1350.17,
4.000000,1159.08,1007.6,1423.4,1432.35,
5.000000,1172.02,1043.22,1427.57,1366.65,
6.000000,1096.63,990.19,1357.23,1328.46,
7.000000,1043.96,984.977,1210.79,1268.91,
8.000000,984.592,882.002,1192.14,1238.8,
9.000000,959.344,843.786,1150.58,1078.98,
10.000000,872.792,820,1063.59,1067.89,
11.000000,800.058,764.089,1003.89,1045.46,
12.000000,795.236,770.931,923.58,993.799,
13.000000,712.792,785.88,837.912,910.864,
14.000000,739.008,746.955,796.06,909.4,
15.000000,711.176,738.125,861.188,862.233,
16.000000,687.04,744.186,763.04,813.74,
17.000000,679.976,765.14,723.008,816.97,
18.000000,645.082,715.888,740.672,798.135,
19.000000,659.025,730.116,722.9,767.974,
20.000000,671.055,713.048,695.784,781.535,
21.000000,653,688.038,702.96,750.048,
22.000000,629.136,653.85,754.804,773.516,
23.000000,695.81,707.088,785.996,720.394,
24.000000,686.872,642.997,729.61,728.506,
25.000000,738.078,663.572,815.926,740.59,
26.000000,713.939,668,784.79,730.917,
27.000000,697.889,657.444,815.928,731.072,
28.000000,704.086,653.18,796.928,731.06,
29.000000,710.196,683.136,779.97,705.858,
30.000000,682.04,673.98,830.889,685.88,
31.000000,653.11,663.048,799.125,689.112,
32.000000,625.192,654.16,748.242,669.928,
33.000000,608,683.93,744.919,672.53,
34.000000,622.91,672.95,720.037,651.112,
35.000000,599.048,652.128,673.044,626.95,
36.000000,588.985,633.048,691.91,658.024,
37.000000,580.128,658.166,690.95,627.91,
38.000000,579.874,646.88,668.03,637.625,
39.000000,573.012,608.06,669.944,618.59,
40.000000,586.96,623.02,716.011,600.544,
41.000000,552.03,639.06,653.065,620.526,
42.000000,585.15,666.134,711.016,623.625,
43.000000,569.848,626.032,685.901,618.51,
44.000000,597,659.138,699.92,624.47,
45.000000,590.892,595.126,687.923,627.12,
46.000000,600.094,643.172,697.808,600.54,
47.000000,619.46,657.134,709.054,619.493,
48.000000,598.1,631.884,672.147,612.144,
49.000000,593.898,603.972,684.878,608.012,
50.000000,568.008,642.01,665.21,604.08,
51.000000,567,584.057,651.043,600,
52.000000,561.056,616.9,642.01,579.095,
53.000000,529.001,600.08,612.998,598.464,
54.000000,547.98,597.088,613.034,585.884,
55.000000,536.06,616.05,602.04,590.568,
56.000000,544.982,631.937,620.104,561.036,
57.000000,534.044,635.081,572.892,572.048,
58.000000,543.02,628.006,618.866,579.51,
59.000000,535.874,612.96,571.055,565.965,
60.000000,536.074,617,586.984,565.928,
61.000000,532.035,611.064,602.6,582.96,
62.000000,555.95,606.904,600.894,593.492,
63.000000,572.96,619.894,621.08,608.552,
64.000000,573.954,623.9,592.93,587.48,
65.000000,546.936,588.95,619.95,585.513,
66.000000,532.008,629.09,622.11,611.449,
67.000000,541.074,637.904,617.025,607.548,
68.000000,549.964,622.032,617.068,594.548,
69.000000,565.116,614.884,611.9,615.512,
70.000000,541,603.006,616.52,599.952,
71.000000,530.962,610.024,605.032,597.02,
72.000000,515.11,657.989,598.896,604.424,
73.000000,516.965,608.923,603.432,593.536,
74.000000,531.505,622,582.04,592.573,
75.000000,537.992,612.138,568.98,583.078,
76.000000,534.005,582.056,584.476,567.003,
77.000000,533,588.976,582.584,578.919,
78.000000,530.997,604.996,571.58,591.488,
79.000000,526.996,636.12,574.47,571.46,
80.000000,525.964,617.968,613.495,585.458,
81.000000,527.06,600.102,592.444,562.55,
82.000000,532.058,599.874,594.44,569.525,
83.000000,525.002,614.392,589.98,570.474,
84.000000,531.979,589.976,615.49,580.504,
85.000000,538.068,601.946,580.48,571.432,
86.000000,544.005,583.092,613.034,581.012,
87.000000,526.98,624.964,601.944,577.56,
88.000000,549.03,610.096,595.06,574.616,
89.000000,544,608.034,617.004,601.993,
90.000000,537.02,588.906,588.549,573.056,
91.000000,543.902,615.04,604.081,573.05,
92.000000,546.013,611.08,603.92,589.011,
93.000000,542.896,620.016,601.998,575.956,
94.000000,536.03,580.028,602.932,573.902,
