Time [ms],1000000000,
0,456.984,
1000000000,437,
2000000000,437,
3000000000,432.983,
4000000000,446.008,
5000000000,453.952,
6000000000,463.024,
7000000000,470.032,
8000000000,462.992,
9000000000,461.496,
10000000000,436.472,
11000000000,433.022,
12000000000,443.979,
13000000000,442.04,
14000000000,448.008,
15000000000,429.024,
16000000000,430.025,
17000000000,434.999,
18000000000,430.98,
19000000000,436.98,
20000000000,442.971,
21000000000,443.02,
22000000000,459.004,
23000000000,451.003,
24000000000,447.948,
25000000000,446.024,
26000000000,432.98,
27000000000,443.048,
28000000000,438.992,
29000000000,438.975,
30000000000,438.022,
31000000000,431.992,
32000000000,429.033,
33000000000,433.988,
34000000000,436,
35000000000,424.995,
36000000000,435.976,
37000000000,420.013,
38000000000,432.015,
39000000000,438.026,
40000000000,438.99,
41000000000,439.025,
42000000000,428.972,
43000000000,433.048,
44000000000,426.99,
45000000000,436.037,
46000000000,427.998,
47000000000,429.996,
48000000000,433,
49000000000,425.99,
50000000000,425.044,
51000000000,421.02,
52000000000,432.02,
53000000000,422.02,
54000000000,429.008,
55000000000,430.032,
56000000000,427.968,
57000000000,420.976,
58000000000,434.004,
59000000000,432.982,
60000000000,425.995,
61000000000,430.976,
62000000000,425.97,
63000000000,423,
64000000000,430.975,
65000000000,431.96,
66000000000,425.976,
67000000000,425.002,
68000000000,436.028,
69000000000,426.98,
70000000000,425.016,
71000000000,424.024,
72000000000,422,
73000000000,434.025,
74000000000,417.032,
75000000000,421.996,
76000000000,416.002,
77000000000,423.991,
78000000000,421,
79000000000,423.021,
80000000000,426.016,
81000000000,418.992,
82000000000,417.966,
83000000000,423.028,
84000000000,425.956,
85000000000,427.984,
86000000000,422.978,
87000000000,425.02,
88000000000,420.99,
89000000000,425.03,
90000000000,426,
91000000000,420.027,
92000000000,423.985,
93000000000,433.988,
94000000000,430.01,
95000000000,430.02,
