Frame number,1000000000,1000000001,
0.000000,2868.57,2643.34,
1.000000,2946.86,2803.88,
2.000000,2805.18,3094.65,
3.000000,2819.91,2877.2,
4.000000,2303.18,2611.91,
5.000000,2261.12,2279.83,
6.000000,1987.17,1943.08,
7.000000,1783.47,1725.8,
8.000000,1597.84,1561.15,
9.000000,1499.64,1395.71,
10.000000,1393.94,1315.13,
11.000000,1262.94,1250.04,
12.000000,1253.18,1197.14,
13.000000,1237.24,1098.02,
14.000000,1248.14,1061.09,
15.000000,1269.81,1047.14,
16.000000,1310.05,1109.51,
17.000000,1472.85,1344.46,
18.000000,1618.94,1522.92,
19.000000,1815.88,1724.36,
20.000000,1807.9,1689.96,
21.000000,1797.75,1595.69,
22.000000,1705.9,1527.62,
23.000000,1588.25,1435.15,
24.000000,1547.08,1349.25,
25.000000,1469.98,1285.12,
26.000000,1350.37,1153,
27.000000,1249.07,1050.03,
28.000000,1142.94,993.092,
29.000000,1132.95,910.056,
30.000000,1058.94,927,
31.000000,1055.95,948.092,
32.000000,1073.05,967.122,
33.000000,1152.07,1013.02,
34.000000,1289.88,1090.84,
35.000000,1445.14,1203.91,
36.000000,1422.88,1331.86,
37.000000,1467.93,1351.86,
38.000000,1365.9,1340.28,
39.000000,1341.18,1285.9,
40.000000,1319,1187.95,
41.000000,1201.85,1159.85,
42.000000,1078.92,1034,
43.000000,1010.07,997.044,
44.000000,927.098,922.072,
45.000000,901.188,892,
46.000000,852.077,852.05,
47.000000,831.052,800.022,
48.000000,873.928,843.874,
49.000000,941,879.994,
50.000000,986.932,912.017,
51.000000,1064.1,953.938,
52.000000,1137.91,1047.49,
53.000000,1169.13,1127.2,
54.000000,1139.94,1152.12,
55.000000,1159.97,1156.07,
56.000000,1056.11,1070.52,
57.000000,1053.99,1031.01,
58.000000,961.874,964.908,
59.000000,892.08,917,
60.000000,837.988,841.468,
61.000000,791.99,827.08,
62.000000,765.04,792.068,
63.000000,764.935,763,
64.000000,790.528,771.182,
65.000000,841.544,784.002,
66.000000,888.516,828.846,
67.000000,927.92,838.2,
68.000000,1003.52,940.96,
69.000000,1007.92,1015.99,
70.000000,1021.59,1034.24,
71.000000,1048.1,991.16,
72.000000,1016.02,1012.1,
73.000000,983.072,946,
74.000000,921.56,883.996,
75.000000,857,862,
76.000000,803.544,802.912,
77.000000,769.532,751.97,
78.000000,763.512,750.104,
79.000000,764.008,782.984,
80.000000,789.52,788.04,
81.000000,796.518,758.62,
82.000000,841.998,820.492,
83.000000,885.568,894.612,
84.000000,921.948,919.928,
85.000000,970.006,938.852,
86.000000,991.04,974.564,
87.000000,1023.6,1040.92,
88.000000,978.972,992.248,
89.000000,938.047,994.156,
90.000000,927.576,958.976,
91.000000,856.064,900.5,
92.000000,810.03,825.6,
93.000000,788.54,784.492,
