Frame number,1000000000,
0.000000,421.512,
1.000000,440,
2.000000,443.976,
3.000000,441.972,
4.000000,441.044,
5.000000,442.019,
6.000000,433.5,
7.000000,422.012,
8.000000,432.504,
9.000000,423.52,
10.000000,429,
11.000000,427.48,
12.000000,427.97,
13.000000,420.986,
14.000000,425,
15.000000,423.99,
16.000000,419.512,
17.000000,430,
18.000000,424.496,
19.000000,432.034,
20.000000,421.492,
21.000000,428.016,
22.000000,421.04,
23.000000,425.96,
24.000000,421,
25.000000,422,
26.000000,428.52,
27.000000,421.012,
28.000000,425.008,
29.000000,421.012,
30.000000,421.025,
31.000000,421.496,
32.000000,415.98,
33.000000,431.007,
34.000000,434.995,
35.000000,429.979,
36.000000,430.012,
37.000000,422.5,
38.000000,420.972,
39.000000,414,
40.000000,424.025,
41.000000,412.008,
42.000000,418.496,
43.000000,423.516,
44.000000,420.985,
45.000000,420.484,
46.000000,417.504,
47.000000,424,
48.000000,412.484,
49.000000,415.52,
50.000000,422.013,
51.000000,428.025,
52.000000,420.99,
53.000000,421.992,
54.000000,420,
55.000000,413.488,
56.000000,414.987,
57.000000,419.007,
58.000000,412.997,
59.000000,422.004,
60.000000,419.525,
61.000000,425.496,
62.000000,426.518,
63.000000,424.52,
64.000000,411.52,
65.000000,424.028,
66.000000,419.974,
67.000000,426.004,
68.000000,419.013,
69.000000,422.983,
70.000000,426.45,
71.000000,422.979,
72.000000,418.508,
73.000000,417.006,
74.000000,420.5,
75.000000,412.99,
76.000000,413.975,
77.000000,416.011,
78.000000,411.495,
79.000000,419.008,
80.000000,420.024,
81.000000,422.002,
82.000000,418.01,
83.000000,426.488,
84.000000,429.504,
85.000000,428.492,
86.000000,417.992,
87.000000,425.984,
88.000000,425.002,
89.000000,421.494,
90.000000,409,
91.000000,422.008,
92.000000,419.484,
93.000000,416.496,
94.000000,424.976,
