Frame number,1000000000,1000000001,1000000002,1000000003,1000000004,1000000005,1000000006,
0.000000,703.885,760.1,813.928,748,745.928,696.93,790.222,
1.000000,654.936,655.57,722.06,778.155,753.108,678.903,736.427,
2.000000,633.87,694.565,709.14,764.254,701.122,724.875,751.897,
3.000000,636.862,694.02,742.072,884.25,747.968,668,788.934,
4.000000,644.07,749.166,820.936,820.25,747.112,646.164,814.013,
5.000000,678.919,772.566,786.146,802.842,718,671.1,791.856,
6.000000,625.08,713.492,776.904,781,734.844,677.929,787.807,
7.000000,603.525,686.18,697.139,751.058,688.05,606.129,676.079,
8.000000,610.508,653.944,646.08,718.028,679.99,626.894,646.976,
9.000000,591.088,665.688,651.95,745.124,626.124,603.108,627.988,
10.000000,569.072,657.024,603.902,711.96,599.074,570.986,608.108,
11.000000,579.888,633.496,640.952,650.923,591.96,562.959,562.065,
12.000000,547.08,606.083,586.094,649.089,567.832,570.941,561.047,
13.000000,550.016,590.579,593.08,595.054,530.024,518.924,533.01,
14.000000,543.972,620.477,570.942,571.955,545.92,530.012,551.98,
15.000000,533.926,596.644,575.961,589.046,521.13,545.032,575.138,
16.000000,539.04,664.54,570.833,593.908,552.968,564.932,585.965,
17.000000,545.074,675.556,599.552,641.945,562.876,573.938,631.924,
18.000000,555.944,654.14,642.928,651,569.912,571.947,663.85,
19.000000,566.904,687.08,702.104,687.916,581.132,599.089,692.804,
20.000000,562.136,654.848,741,685,591.953,613.967,725.043,
21.000000,583.092,666.803,725.88,742.048,589.874,590.068,728.841,
22.000000,572.883,699.888,710.9,728,606.08,594.883,667.886,
23.000000,572.12,644.933,694.392,698.776,655,548.046,630.108,
24.000000,535.94,628.832,673.016,661,627.407,577.01,613.16,
25.000000,545.096,591.14,672.116,608.964,581.055,544.96,578.176,
26.000000,503.928,548.967,621.125,593.957,562.903,518.056,551.976,
27.000000,506.072,539.04,638.926,584.129,536.052,549.007,507.968,
28.000000,491.038,550.056,593.156,556.112,534.098,514.063,533,
29.000000,502.044,509.972,572.896,527.094,534.082,490.1,494.917,
30.000000,483.988,499.992,531.907,510.087,517.003,497.044,492.045,
31.000000,463.002,524.98,538.871,500.967,532.032,474.985,494.061,
32.000000,484.972,530.065,524.096,533.114,551.12,510.93,491.094,
33.000000,493.472,519.062,519.027,537.132,585.072,514.018,481.986,
34.000000,492.06,564.968,529.114,580.917,564.2,545.071,518.95,
35.000000,516.024,580.091,585.204,573.934,541.983,520.872,534.2,
36.000000,526.04,625.86,589.889,605.856,612.883,555.925,546.954,
37.000000,531.106,605.116,655.832,651.122,623.784,555.92,609.878,
38.000000,541.004,591.14,661.056,636.036,618.076,577,612.12,
39.000000,565.071,630.8,699.172,630.072,628.059,557.008,601.043,
40.000000,565.02,601.072,684.915,617.976,643.76,533.018,610.136,
41.000000,530.984,578.88,685.816,643.001,610.06,535.976,615.02,
42.000000,503.941,569.084,687.84,620.008,615.889,512.943,559.926,
43.000000,518.951,546.12,658.167,579.04,565.976,533.93,542.93,
44.000000,503.028,526.041,628.072,542.005,541.102,512.977,509.888,
45.000000,489.022,518.868,576,524.991,517.16,507.059,497.132,
46.000000,482.939,501.96,555.192,510.86,534.924,470.005,476.92,
47.000000,472.99,495.053,551.022,515.047,500.992,470.012,478.02,
48.000000,473.035,487.112,519.01,496.045,496.992,488.942,461.016,
49.000000,463.983,485.048,504,490.928,514.054,466.04,474.976,
50.000000,466.03,493.035,495.96,482.915,484.058,465.078,466.931,
51.000000,482.025,500.052,491.032,501.12,500.96,501.026,460.96,
52.000000,483.912,489.984,503.468,523,535.056,487.043,471.926,
53.000000,482.99,506.96,508.982,538.087,551.01,494.037,491.949,
54.000000,509.972,528.06,525.972,542.01,583,516.048,477.952,
55.000000,511.037,535.928,571.524,560.108,559.168,501.95,506.056,
56.000000,507.046,561.974,613.5,543.035,560.12,527.975,510.014,
57.000000,521.05,538.988,607.124,565.031,577.84,523.963,544.096,
58.000000,528.056,570.004,614.056,540.023,575.168,542.098,544.99,
59.000000,539.976,547.072,618,556.023,566,529.13,524.95,
60.000000,510.92,564.013,643.566,552.987,575.064,525.021,530.08,
61.000000,475.948,541.56,629.9,535.956,539.96,518.005,526.98,
62.000000,490.96,546.984,590.544,547.108,564.912,502.065,508,
63.000000,483,537.988,593.984,511.938,542.008,495.004,487.04,
64.000000,473.032,511.556,590.64,488.003,497.99,465.074,477.016,
65.000000,473,482.57,551.952,478.92,479.94,477,460.93,
66.000000,449.96,490.47,514,481.072,513.992,468.984,470.95,
67.000000,459.038,484.465,505.968,493.024,500.014,466.032,461.984,
68.000000,453.014,493.98,506.072,469.04,483.952,462.06,469.084,
69.000000,452.02,483,495.96,473,501.082,466,464.068,
70.000000,467,482.547,490.416,486.99,509.099,461.08,457.99,
71.000000,471.062,478.009,476.96,487.98,508.96,474.06,458,
72.000000,474.03,483.524,487.04,497.108,487.904,480.056,444.948,
73.000000,476.967,486.52,489.092,513.978,504.04,485.994,458.06,
74.000000,504.992,474.989,520.608,526.955,499.9,496.99,459.92,
75.000000,477.568,500.528,526.96,523.002,518.968,489.02,483.956,
76.000000,477.48,529.048,531.024,524.078,527,523.04,472.984,
77.000000,488.032,524.52,570.6,514.958,527.09,514.941,477.998,
78.000000,498.032,520.032,572.972,520.102,514.076,508.086,485.969,
79.000000,481.008,513.48,575.52,530.966,541.92,497.028,491.114,
80.000000,477.964,531.46,582.51,523.102,510.964,488.998,496.942,
81.000000,475.008,517.6,571.472,514.97,516.04,486.048,488.02,
82.000000,473.926,511.49,554.512,512.021,504.988,485.004,482.12,
83.000000,460.008,490.004,535.536,494.06,497.956,485.01,469.948,
84.000000,460.984,501.543,541.56,488.89,482.03,467.008,478.106,
85.000000,456,494.95,524.926,502.044,511.976,464.006,465.944,
86.000000,454.004,493.034,517.012,477.94,472.035,453.028,460.932,
87.000000,459.984,487.02,504.536,470.93,483,446.954,452.916,
88.000000,451.06,484.53,482.9,470.08,477.094,463.016,452.025,
89.000000,454.064,489.44,488.512,460.052,481.002,466.01,455.972,
90.000000,453.979,483.458,490.078,464,489.12,467.066,454.924,
91.000000,460.984,486.519,474.504,467.05,513.992,454.04,441.984,
92.000000,462.992,471.52,477.444,464.985,491.969,471.026,454.968,
93.000000,468.94,481.466,476.995,497.06,477.12,479.978,448.95,
94.000000,486,483.6,484.984,492.08,481.048,464.96,451.032,
