Frame number,1000000000,1000000001,1000000002,1000000003,
0.000000,6797.08,2619.63,5316.96,5963.38,
1.000000,2874.13,1644.97,4492.42,5879.32,
2.000000,2992.59,2380.41,6748.67,7547.5,
3.000000,3513.92,2392.51,4767.52,7821.95,
4.000000,4146.12,2289.29,7998.38,4505.3,
5.000000,3786.07,2585.11,5408.66,5499.48,
6.000000,3862.03,2455.08,6066.03,3523.75,
7.000000,3546.74,1804.68,5745.9,1976.54,
8.000000,2378.4,1501.16,5548.01,3593.08,
9.000000,2448.91,1574.73,6060.61,5850.25,
10.000000,2072.2,1595.6,5910.47,4406.48,
11.000000,1590.63,1723.06,6005.61,5035.9,
12.000000,1454.84,1647.46,3416,4695.01,
13.000000,1483.48,1229.75,5972.24,5637.86,
14.000000,1322.82,1124.23,6610.26,6417.68,
15.000000,1471.73,1136.01,6492.15,6445.43,
16.000000,1439.84,1321.32,5583.51,6694.77,
17.000000,1524.45,1233.1,3895.84,6768.86,
18.000000,1341.75,1424.88,5756.22,4911.44,
19.000000,1446.74,1502.99,5008.52,3774.13,
20.000000,1448.44,1529.03,3066.88,4651.19,
21.000000,1472.1,1706.7,4702.28,2998.23,
22.000000,1592.23,1714.01,4790.44,3709.9,
23.000000,1699.5,1664.76,4717.45,3163.2,
24.000000,1669.88,1719.84,5151.22,2589.5,
25.000000,1598.16,1682.96,5684.97,3924.29,
26.000000,1559.56,1622.02,5779.88,4222.93,
27.000000,1615.55,1648.89,4161.53,3725.46,
28.000000,1548.05,1534.53,4722.88,3298.38,
29.000000,1468.9,1580.7,6067.96,1811.61,
30.000000,1610.72,1449.89,6152.61,2435.91,
31.000000,1593.91,1420.04,3838.55,3019.82,
32.000000,1636.61,1508.37,3173.7,3159.71,
33.000000,1589.82,1387.86,3049.97,2789.67,
34.000000,1607.48,1439.27,3713.76,3230.92,
35.000000,1516.44,1413.92,3442.12,3133.53,
36.000000,1455.84,1601.22,4066.89,1813.84,
37.000000,1292.18,1664.57,3090.35,2368.6,
38.000000,1273.4,1649.98,4238.42,2479.47,
39.000000,1264,1640.47,3406.55,2824.81,
40.000000,1391.17,1786.92,4231.57,2641.57,
41.000000,1208.18,1700.94,3954.46,2612.19,
42.000000,1187.48,1398.91,5293,2863.94,
43.000000,1242.04,1532.04,2902.49,2916.65,
44.000000,1466.55,1381.82,2181.4,2390.21,
45.000000,1370.83,1496.54,1877.4,2333.5,
46.000000,1410.63,1423.32,2503.05,2577.14,
47.000000,1440.73,1437.41,2682.25,2529.32,
48.000000,1467.89,1470.47,3217.19,2797.42,
49.000000,1510.08,1481.22,2676.46,2553.36,
50.000000,1389.31,1598.36,2725.93,2024.08,
51.000000,1367.18,1625,2247.41,2302.71,
52.000000,1506.93,1686.89,2931.38,2469.76,
53.000000,1469.43,1758,3046.11,2788.05,
54.000000,1404.73,1787.23,4435.79,2675.7,
55.000000,1394.75,1707.72,3004.02,2245.89,
56.000000,1340.7,1534.54,2842.8,1919.5,
57.000000,1292.32,1510.2,2592.07,1827.84,
58.000000,1235.51,1593.14,2825.81,1952.24,
59.000000,1167.65,1520.59,3127.86,2090.61,
60.000000,1230.36,1519.64,3396.9,2045.56,
61.000000,1270.83,1564.02,2554.54,2038.46,
62.000000,1274.99,1557.84,2682.54,2398.98,
63.000000,1325.68,1619.11,2034.95,2277.41,
64.000000,1323.08,1797.02,2198.65,2358.07,
65.000000,1312.72,1826.98,1966.76,2539.48,
66.000000,1207.64,1788.39,1988.54,2912.02,
67.000000,1268.95,1744.38,2002.54,2902.64,
68.000000,1433.69,1779.83,2126.28,2922.27,
69.000000,1255.95,1880.13,2275.26,2741.16,
70.000000,1209.05,1823.27,2261.94,2551.24,
71.000000,1233.32,1804.23,2302.54,2295.74,
72.000000,1138.72,1721.24,2234.5,2465.07,
73.000000,1144.91,1756.06,1774.64,2360.37,
74.000000,1141.64,1788.62,1985.1,2268.13,
75.000000,1127.51,1668.47,1986.32,2200.99,
76.000000,1073.08,1590.73,2076.76,2094.96,
77.000000,1161.02,1726.3,1825.41,2068.02,
78.000000,1043.07,1774.87,1809.14,2081.44,
79.000000,1254.02,1643.25,1581.19,2169.8,
80.000000,1291.93,1789.64,1680.98,1874.5,
81.000000,1192,1829.47,1607.11,1954.32,
82.000000,1266.44,1946.72,1621.95,2166.2,
83.000000,1308.78,1549.8,1538,2092.17,
84.000000,1410.54,1655.73,1460.74,1835.52,
85.000000,1255,1619.2,1555.13,1870.61,
86.000000,1191.74,1596.4,1530.8,1873.63,
87.000000,1214.51,1616.35,1568.2,2048.02,
88.000000,1140.54,1538.05,1656,1805.87,
89.000000,1149.71,1388.07,1516.17,2033.22,
90.000000,1172.49,1376.55,1420.82,2185.7,
91.000000,1209.7,1341.04,1514.68,1922.45,
92.000000,1240.76,1338.54,1443.38,1990.58,
93.000000,1211.17,1299.43,1489.55,2023.06,
94.000000,1293.1,1267.56,1406.43,1861,
