Frame number,1000000000,
0.000000,414.015,
1.000000,405.988,
2.000000,402.004,
3.000000,408,
4.000000,402.004,
5.000000,413.504,
6.000000,408.004,
7.000000,398.993,
8.000000,400.999,
9.000000,407.012,
10.000000,404.496,
11.000000,400.007,
12.000000,397.992,
13.000000,399.504,
14.000000,408,
15.000000,406.988,
16.000000,407.01,
17.000000,410.503,
18.000000,407.986,
19.000000,409.504,
20.000000,401.008,
21.000000,408.003,
22.000000,407.496,
23.000000,411.005,
24.000000,404.022,
25.000000,412,
26.000000,406.005,
27.000000,412.004,
28.000000,400,
29.000000,403,
30.000000,405,
31.000000,405.5,
32.000000,405.514,
33.000000,409.008,
34.000000,413.008,
35.000000,412.005,
36.000000,401.008,
37.000000,407.992,
38.000000,406.003,
39.000000,411,
40.000000,398.996,
41.000000,403.001,
42.000000,399.504,
43.000000,410.009,
44.000000,407.008,
45.000000,410.003,
46.000000,402,
47.000000,400.002,
48.000000,401,
49.000000,406.504,
50.000000,401.004,
51.000000,404.006,
52.000000,405,
53.000000,409.504,
54.000000,398,
55.000000,399.006,
56.000000,402.01,
57.000000,404.007,
58.000000,412.5,
59.000000,407,
60.000000,395.505,
61.000000,395.008,
62.000000,404.005,
63.000000,404.992,
64.000000,399.004,
65.000000,405.992,
66.000000,400.004,
67.000000,401.51,
68.000000,403.996,
69.000000,398.5,
70.000000,393,
71.000000,402.51,
72.000000,398.996,
73.000000,398.5,
74.000000,398,
75.000000,406,
76.000000,411.004,
77.000000,397.01,
78.000000,404.01,
79.000000,398.49,
80.000000,394.996,
81.000000,402,
82.000000,405.008,
83.000000,401.992,
84.000000,393.004,
85.000000,402.508,
86.000000,403,
87.000000,401.496,
88.000000,402.504,
89.000000,409.01,
90.000000,400.997,
91.000000,405.983,
92.000000,403.508,
93.000000,404.504,
94.000000,404,
