Frame number,1000000000,1000000001,1000000002,1000000003,1000000004,
0.000000,833.983,1655.75,1894.43,1630.87,2327.3,
1.000000,713.926,1031.99,1117.94,1083.16,996.06,
2.000000,768.25,1032.1,1176.77,954.775,904.887,
3.000000,943.707,1032.42,1367.49,887.17,936.571,
4.000000,977.898,1383.63,1534.98,1533.01,1152.34,
5.000000,1135.65,1340.61,1802.49,1821.65,1447,
6.000000,1308.49,1444.31,2131.24,2070.8,1822,
7.000000,1197.02,1717.67,2096,2047.7,1990.08,
8.000000,1171.94,1795.9,1855.68,2081,1823,
9.000000,1115.86,1392.19,1557.86,1864.53,1815,
10.000000,1019.23,1097.67,1488.75,1570.38,1572.71,
11.000000,903.844,973.117,1270.24,1357.41,1401,
12.000000,855.072,887.495,1131.15,1122.11,1155.78,
13.000000,767.756,813.404,1075.17,944.896,1066.59,
14.000000,809.104,801.674,1053.17,861.81,978,
15.000000,696.916,830.272,913.133,697.003,860.248,
16.000000,746.512,831,878.231,784.027,792.876,
17.000000,717.02,831.132,888.866,748.896,755.9,
18.000000,798.46,909.637,911.139,739.082,710.856,
19.000000,780.976,866.98,1001.7,797.9,772.984,
20.000000,872.08,989.636,1071.19,848.81,838.13,
21.000000,957.992,1026.84,1225.54,932.08,911.2,
22.000000,1054.72,1241.43,1461,1119.92,1050.9,
23.000000,1075.15,1382.69,1627,1288.76,1145.81,
24.000000,1121.46,1359.08,1548.61,1359.79,1285.87,
25.000000,1181.68,1242.9,1596.5,1302.96,1247.83,
26.000000,1175.18,1305.15,1569.46,1349.8,1299.91,
27.000000,1191.51,1183.82,1365.15,1241.3,1256.98,
28.000000,1141.02,1105.05,1331.7,1160.32,1188.71,
29.000000,1047.01,1060.11,1207.9,1091.47,1034.82,
30.000000,998.262,981.155,1073.05,1014.22,999.139,
31.000000,883.978,884.95,1018.75,857.174,991.073,
32.000000,841.838,833.984,938.64,821.01,903.983,
33.000000,799.12,752.146,913.52,793.176,833.894,
34.000000,783.091,779.112,878.08,761.964,831.828,
35.000000,716.885,701.148,885.824,745.64,796.208,
36.000000,741.084,704.088,798.148,710.992,804.02,
37.000000,769.998,688.08,827.18,712.504,781,
38.000000,774.896,744.552,850.048,714.96,804.134,
39.000000,714,811.472,892.12,760.98,822,
40.000000,783.133,920.589,961,846.288,829.091,
41.000000,821.218,1026.2,1042.86,895.4,900.997,
42.000000,820.88,999.025,1127.88,916.656,923.522,
43.000000,941.991,1037.08,1137.19,933.055,985.966,
44.000000,930.211,1074.15,1191.22,911.096,1100.97,
45.000000,910.772,1019.79,1223.42,1006.16,1036.21,
46.000000,928.02,1003.48,1222.66,943.72,1012.82,
47.000000,946.128,978.504,1142.05,939.504,982.84,
48.000000,930.849,900.53,1052.96,957.01,972.836,
49.000000,891.936,880.849,1097.18,904.398,948.518,
50.000000,909.076,842.55,1049.24,869.919,906.803,
51.000000,890.216,807.908,997.88,850.935,869.636,
52.000000,837.905,701.997,1019.1,794.088,856.631,
53.000000,818.242,716.085,929.02,776.158,806.921,
54.000000,846.076,660.867,868.804,725,755.215,
55.000000,732,631.962,857.135,700.97,715.52,
56.000000,761.038,635.946,840.968,737.96,716.512,
57.000000,744.04,678.008,881.168,739.1,729.973,
58.000000,764.174,649.02,958.312,712.121,768.232,
59.000000,762.886,669,936.76,805.952,744.878,
60.000000,783,695.868,1015.19,862.832,783.752,
61.000000,802.044,731.984,1023.87,873.184,833.29,
62.000000,803.139,748.883,1072.84,899.118,836.104,
63.000000,834.08,766.008,1148.67,905.288,866.841,
64.000000,854.144,791.046,1085.08,914.022,836.71,
65.000000,895.976,794.541,1088.22,894.062,863.292,
66.000000,804.936,832.596,1058,907.8,786.291,
67.000000,853.864,757.052,1017.26,839.84,775.765,
68.000000,772.89,738.017,953.5,851.862,766,
69.000000,782.86,712,925.124,782,750.243,
70.000000,775.91,691.422,882.492,808.995,739.978,
71.000000,784.972,660.038,845.4,781.053,706.209,
72.000000,719.131,618.08,803.512,766.856,706.054,
73.000000,723.12,603.952,844,745.896,755.651,
74.000000,684.912,604.951,848.512,726.125,762.568,
75.000000,708.938,606.473,871.08,699.12,764.992,
76.000000,721.168,621.99,902.5,710.022,740.136,
77.000000,703.936,623.999,912.196,737.944,827.004,
78.000000,722.05,674.017,926.632,703.136,792.709,
79.000000,741.124,723.94,922.016,764.069,826.404,
80.000000,717.836,756.56,1044,813.226,838.006,
81.000000,795.026,805.938,1022.5,871.967,863.766,
82.000000,841.076,812.08,1038,892.89,823.473,
83.000000,803.3,868.013,1058,868.25,847.558,
84.000000,787.18,851.911,1012.05,910.169,773.59,
85.000000,752.113,803.238,951,925.921,784.625,
86.000000,784.056,801.998,937.2,821.073,730.942,
87.000000,788.568,811.218,900.64,877.87,706.532,
88.000000,715.436,740.565,867.48,853.065,674.565,
89.000000,739.492,747.536,817,786.1,665.944,
90.000000,701.988,708.042,784.471,779.003,622.52,
91.000000,672.088,670.502,730.54,732.98,661.085,
92.000000,671.95,672.1,756.5,695.918,638.037,
93.000000,710.06,670.148,729.074,688.136,647.009,
94.000000,677.924,680.953,727.592,677.059,660.952,
95.000000,685,606.196,721.034,643.04,626.993,
