Frame number,1000000000,
0.000000,454.504,
1.000000,420.512,
2.000000,427.011,
3.000000,427.032,
4.000000,437.496,
5.000000,435.006,
6.000000,439.01,
7.000000,427.018,
8.000000,421,
9.000000,425.003,
10.000000,410.496,
11.000000,415.504,
12.000000,422,
13.000000,419.003,
14.000000,417.49,
15.000000,410.998,
16.000000,431.998,
17.000000,417.496,
18.000000,419.992,
19.000000,419.006,
20.000000,429,
21.000000,431.504,
22.000000,431.02,
23.000000,435,
24.000000,429.001,
25.000000,422.986,
26.000000,427.008,
27.000000,423.003,
28.000000,419.996,
29.000000,416,
30.000000,423.5,
31.000000,414.012,
32.000000,415.004,
33.000000,416,
34.000000,410.504,
35.000000,418.5,
36.000000,416.016,
37.000000,419.5,
38.000000,421.994,
39.000000,419.001,
40.000000,423.5,
41.000000,422,
42.000000,426,
43.000000,427,
44.000000,419.016,
45.000000,409.996,
46.000000,412.004,
47.000000,423.008,
48.000000,419.5,
49.000000,414.988,
50.000000,419,
51.000000,412.004,
52.000000,416.996,
53.000000,416.993,
54.000000,416.008,
55.000000,419.012,
56.000000,413.988,
57.000000,414.994,
58.000000,408.992,
59.000000,423.012,
60.000000,418,
61.000000,415.504,
62.000000,414.005,
63.000000,412.998,
64.000000,412.998,
65.000000,416,
66.000000,411.498,
67.000000,408.008,
68.000000,408.998,
69.000000,411.49,
70.000000,416.007,
71.000000,417.01,
72.000000,412.996,
73.000000,414.002,
74.000000,414.99,
75.000000,419.012,
76.000000,418.012,
77.000000,417,
78.000000,414.008,
79.000000,417.007,
80.000000,410.998,
81.000000,416.008,
82.000000,410.012,
83.000000,406.992,
84.000000,412.5,
85.000000,419.996,
86.000000,415.504,
87.000000,413.008,
88.000000,416.011,
89.000000,416.991,
90.000000,411.012,
91.000000,407.008,
92.000000,410,
93.000000,415.504,
94.000000,410.504,
95.000000,419.004,
