Frame number,1000000000,1000000001,1000000002,1000000003,1000000004,1000000005,1000000006,1000000007,1000000008,
0.000000,427.502,613.974,718.532,717.297,613.08,685.099,697.582,590.536,835.182,
1.000000,406.48,613.84,737.468,786.412,711.015,646.049,725.608,602.264,748.036,
2.000000,413,641.732,787,928.784,847.333,724.752,911.58,751.248,818.2,
3.000000,403.001,713.136,812.464,972.491,860.466,799.898,822.082,827.988,869.792,
4.000000,403.968,715.504,609.708,934.643,828.636,785.104,796.37,836.754,840.807,
5.000000,410.984,622.808,536.948,824.051,749.73,727.852,712.301,742.966,737.724,
6.000000,412,588.805,565.556,692.313,655.252,642.925,649.25,663.92,692.72,
7.000000,408.016,579.887,520.036,590.783,624.237,609.941,600.226,640.08,638.736,
8.000000,406.018,541.1,498.08,555.85,572.07,546.089,555.136,569.416,594.704,
9.000000,411.984,492.025,520.576,528.129,568.965,518.079,525.114,560.944,518.3,
10.000000,409.962,475.488,511.5,494.03,547.945,514.008,515.176,534.872,495.909,
11.000000,402.98,470.05,507.971,496.886,532.099,507.075,508.031,512.72,485.102,
12.000000,404,487.065,482.968,497.925,502.25,484.042,480.855,504.896,485.255,
13.000000,404.98,491,488.164,506.92,511.925,481.133,492.041,514.272,511.239,
14.000000,400.032,545.874,560.988,571,534.02,485.99,500.168,509.848,506.293,
15.000000,399.007,575.16,667.979,639.128,559.032,511.011,561,517.4,574.165,
16.000000,409.008,630.082,738.872,679.27,600.098,550.06,581.932,549.36,730.774,
17.000000,400.05,704.765,825.24,896,688.245,611.036,637.238,604,919.106,
18.000000,410.979,707.34,824.664,942.372,751.375,670.905,730.994,651.656,998.922,
19.000000,413.484,747.808,804.372,1046.26,682.137,708.999,807.314,740.24,920.846,
20.000000,412.008,689.411,734,980.164,723.203,730.095,786.68,742.75,883.232,
21.000000,412,693.05,715.384,950.158,674.25,698.905,775.298,688.81,813.249,
22.000000,423.02,663.088,602.871,868.858,634.072,692.91,794.2,716.54,772.063,
23.000000,414.028,636.898,525.968,577.858,587.25,670.012,694.048,715.61,635.612,
24.000000,403.988,590.41,534.828,537.904,622.721,648.838,684.184,638.89,606.041,
25.000000,410.008,551.475,521.9,518.842,555.93,609.77,639.173,598,565.387,
26.000000,416.046,527.629,506.937,596.147,614.889,637.864,632.005,560,597.345,
27.000000,403.99,526.588,474.978,585.096,494.995,585.828,555.98,586.48,571.279,
28.000000,405.013,508.969,505.04,567.032,530.824,573.02,547.918,542.666,580.393,
29.000000,409.981,491.37,498.059,609.04,495.988,532.836,602.94,515.904,526.31,
30.000000,409.962,511.94,500.012,591.094,536.963,527.044,526.015,538,585.774,
31.000000,404.025,549.61,494.965,668.464,537.15,517.995,576.114,522.672,579.087,
32.000000,402.01,571.612,552.067,637.938,523.957,539.167,572.196,517.064,620.82,
33.000000,412.022,598.138,573.18,592.32,533.04,538.866,529.163,513.38,722.617,
34.000000,406.992,642.204,663.054,537.078,597.858,569.195,643.915,522.152,774.53,
35.000000,418.024,691.315,674.684,616.2,635.062,593.979,640.01,540.9,816.404,
36.000000,407.05,639.144,720.029,583.832,733.097,623.88,665.925,560,767.34,
37.000000,415.993,613.217,676.819,590.979,757.625,620.092,687.885,591.2,720.73,
38.000000,398,618.306,668.178,825.738,698.65,632.028,680.781,626.504,650.952,
39.000000,401.012,551.99,601,842.1,644.019,619.741,725.208,651.68,610.78,
40.000000,416,560.036,580.688,736.105,601.046,593.116,652.726,605.288,568.847,
41.000000,408.011,516.094,577.096,700.946,595.083,570.881,657.135,582.552,546.67,
42.000000,403.992,525.924,556.093,635.07,546.513,556,616.2,574.488,513.6,
43.000000,403.024,530.147,535.94,598.06,514.016,532.905,592.015,536.488,498.016,
44.000000,410.982,493.988,512.9,548.116,546.088,548.038,538.086,527.456,496.624,
45.000000,406.984,492.54,500.029,545.972,554.422,526.068,533.168,512.64,488.522,
46.000000,397.978,482.372,488.125,536.081,497.968,504.05,543.151,488,542.152,
47.000000,398.012,475.92,486.14,488.035,501.44,484.975,532.076,491.312,521.024,
48.000000,410.964,483.035,500.984,499.117,482.04,497.008,503.92,494.744,525.064,
49.000000,414.005,528.536,514.016,507.997,488.534,474.995,518.058,484.3,526.104,
50.000000,407.019,542.56,521.02,493.041,495.508,501.951,502.939,496.228,570.608,
51.000000,405.998,529.532,539.855,532.9,503.03,491.955,521.976,487.324,577.714,
52.000000,410.504,538.88,560.009,546.02,498.559,516.081,533.076,503.496,610.43,
53.000000,410.024,591.816,641.103,567.167,520.472,555.92,515.194,525.192,593.556,
54.000000,410,554.552,601.057,634.387,552.052,562.116,546.139,559.2,605.641,
55.000000,408.986,521.582,583.943,672.068,546.872,564.235,544.863,534.648,567.553,
56.000000,398.019,557.593,621.314,645.739,558.97,590.127,581.588,538.826,610.03,
57.000000,405.024,557.6,597.078,586.693,604.555,552.035,537.808,557.456,592.146,
58.000000,406.008,521.525,551.042,597.608,624.968,535.958,558.115,546.704,539.515,
59.000000,414.986,515.004,525.024,599.464,568.535,519.25,492,567.28,538.131,
60.000000,408.985,510.064,516.958,580.334,538.513,523.884,515.064,532.6,526.51,
61.000000,407.968,482.012,518.906,563.146,532.56,508.045,540.072,548.392,517.558,
62.000000,410.012,482.065,510.988,536.564,501.504,496.037,540.08,513.466,487.545,
63.000000,407.012,491.91,490.075,482.183,514.988,476.054,503.96,492.248,505.984,
64.000000,395.032,457.916,451.042,506.487,507.056,482.95,461.096,511.3,484.532,
65.000000,412.015,466.053,469.022,465.9,519.536,494.955,481.96,476.964,476.942,
66.000000,405.962,457.967,468.995,473.501,474.016,480.978,496.978,478.056,475.104,
67.000000,404.006,465.912,466.046,475.532,478.52,481.001,497.021,492.192,488.001,
68.000000,408,470.09,479.008,469.505,453.942,488.01,517.95,481.348,480.973,
69.000000,409.98,497.056,506.996,475.496,464.03,490.028,509,473.76,500.58,
70.000000,405.015,481.078,531.01,487.488,470.05,462.928,533.118,471.456,511.084,
71.000000,402.97,487,525.099,500.084,464.081,518.054,535.965,468.644,494.66,
72.000000,419.016,507.686,550.045,495.072,498.91,515.019,523.984,502.012,508.93,
73.000000,408.032,554.528,540.922,491.112,489.922,490.881,541,483.12,506.982,
74.000000,405.012,549.064,550.172,533.875,547.057,497.97,583.948,511.132,515.568,
75.000000,409.992,520.421,534.115,522.171,577.124,480.05,585.036,505.292,539.112,
76.000000,405,506.008,521.933,496.858,526.911,494.03,546.968,494.66,530.16,
77.000000,415.995,524.053,529.021,508.06,561.077,479.128,558.918,505.412,513.524,
78.000000,406.018,513.048,484.068,507.048,524.055,472.07,555.056,503.576,484.527,
79.000000,407.004,501.11,498.127,508.004,534.091,478.913,520.872,491.3,491.01,
80.000000,396.042,474.01,473.954,522.104,535.076,472.941,503.976,501.464,482.891,
81.000000,404.02,466.496,495.106,503.888,515.008,463.019,495.088,489.4,511.104,
82.000000,403.954,459.528,472.985,465.012,476.9,463.05,504.144,493.552,457.973,
83.000000,402,464.474,475.041,501.92,476.902,451.914,484.076,491.236,465.13,
84.000000,409.02,472.505,486.092,451.024,480.941,458.004,479.019,467.268,477.068,
85.000000,409.041,463.015,487.037,469.056,465.923,452.946,502.082,463.72,479.92,
86.000000,416.492,473.04,475.962,463.928,478.944,463.998,490.95,463.236,466.952,
87.000000,405.988,489.004,499.07,475.01,446.13,478.05,491.944,443.508,472.008,
88.000000,409.022,465.954,514.096,484.074,469.05,490.967,505.992,441.472,487.072,
89.000000,414.003,508.035,514.106,462.979,477.045,489.112,542.032,447.184,462.01,
90.000000,411.975,500.99,524.077,481.889,483.533,483.064,543.08,471.804,485.101,
91.000000,410.013,478.009,532.114,488.976,483.99,463.967,523.92,473.52,507.069,
92.000000,403.972,502.112,526.991,491.94,530.56,486.048,536.88,475.688,474.078,
93.000000,407.972,507.954,517.1,499,498.546,469.904,502.552,471.692,499.05,
