Frame number,1000000000,
0.000000,411.992,
1.000000,412.996,
2.000000,419.998,
3.000000,414.008,
4.000000,409.998,
5.000000,407.995,
6.000000,412.496,
7.000000,414,
8.000000,398.49,
9.000000,404.988,
10.000000,408,
11.000000,403,
12.000000,403.008,
13.000000,401.984,
14.000000,403.994,
15.000000,401.01,
16.000000,399.992,
17.000000,407,
18.000000,411,
19.000000,415,
20.000000,405.998,
21.000000,415.005,
22.000000,407.003,
23.000000,408.002,
24.000000,407,
25.000000,409,
26.000000,410.988,
27.000000,411.004,
28.000000,409.008,
29.000000,411.008,
30.000000,407.984,
31.000000,406.504,
32.000000,397.004,
33.000000,407.004,
34.000000,406.995,
35.000000,407.98,
36.000000,408.002,
37.000000,410,
38.000000,408.004,
39.000000,414,
40.000000,414.992,
41.000000,413.004,
42.000000,408.007,
43.000000,411.006,
44.000000,406.01,
45.000000,406.004,
46.000000,407.992,
47.000000,401.992,
48.000000,409.01,
49.000000,407.992,
50.000000,407.496,
51.000000,411.002,
52.000000,412.004,
53.000000,409.99,
54.000000,413.996,
55.000000,405.004,
56.000000,407,
57.000000,411.006,
58.000000,404.007,
59.000000,403.005,
60.000000,403.997,
61.000000,403.004,
62.000000,401,
63.000000,404.009,
64.000000,415.998,
65.000000,405.996,
66.000000,405.01,
67.000000,406.002,
68.000000,401.995,
69.000000,410.997,
70.000000,407.988,
71.000000,407.999,
72.000000,402.99,
73.000000,408.012,
74.000000,408,
75.000000,412.004,
76.000000,402.01,
77.000000,408.005,
78.000000,408.995,
79.000000,405,
80.000000,410.006,
81.000000,405.007,
82.000000,401.994,
83.000000,398.006,
84.000000,406.002,
85.000000,407.984,
86.000000,409.007,
87.000000,408.992,
88.000000,405.004,
89.000000,406,
90.000000,412,
91.000000,412.01,
92.000000,400.01,
93.000000,410.993,
94.000000,409.994,
