Frame number,1000000000,1000000001,
0.000000,34498.2,65535,
1.000000,48350.7,65535,
2.000000,65535,65535,
3.000000,65535,47341.9,
4.000000,65530,33384.4,
5.000000,58211.5,23191.3,
6.000000,43140.1,15998.8,
7.000000,34045.4,11949.8,
8.000000,27985.9,9335.76,
9.000000,25476.7,7543.78,
10.000000,19066.8,6417.65,
11.000000,16672.1,5796.8,
12.000000,14182.1,6138.31,
13.000000,12830.4,8107.45,
14.000000,13715.8,13849.6,
15.000000,15879.9,26928.6,
16.000000,20844.4,49832.5,
17.000000,26041.5,65535,
18.000000,30313.9,54679.4,
19.000000,30358.5,39885.5,
20.000000,29752,28015.1,
21.000000,28221.1,17485.6,
22.000000,22348.6,11570.5,
23.000000,18322.9,8007.17,
24.000000,14913.1,5997.17,
25.000000,12823.9,4796.02,
26.000000,10984.8,4194.72,
27.000000,9869.03,3910.16,
28.000000,9538.95,4546.3,
29.000000,10708,6711,
30.000000,12469.5,12311.2,
31.000000,16136,24301.8,
32.000000,20617.6,41863.9,
33.000000,23401.1,53686.8,
34.000000,24500.3,43883.8,
35.000000,25190.8,32350.2,
36.000000,23903.9,22890.7,
37.000000,20312.1,15890.8,
38.000000,17318.8,10614.3,
39.000000,14597.1,7617.87,
40.000000,12655.7,5677.83,
41.000000,10430.9,4589.85,
42.000000,9422.85,3974.02,
43.000000,8758.74,3850.81,
44.000000,9089.68,4261.1,
45.000000,9813.06,5890,
46.000000,12162,9557.95,
47.000000,14522.4,17839.1,
48.000000,16615.7,30317.3,
49.000000,17702.6,38999.8,
50.000000,18013.9,35701.2,
51.000000,16361.6,27977.6,
52.000000,15123,21727.7,
53.000000,13472.3,16184.1,
54.000000,11980.2,11289.9,
55.000000,10412.8,7966.99,
56.000000,9307.94,6185.06,
57.000000,8102.48,4944.76,
58.000000,7510.13,4276.02,
59.000000,6927.29,4026.8,
60.000000,7124.62,4179.9,
61.000000,7873.49,5276.44,
62.000000,9323.98,7957.2,
63.000000,11291.3,13854,
64.000000,13915.6,23579.5,
65.000000,14496.2,32395.6,
66.000000,13393.1,32680.4,
67.000000,12338.2,27790.3,
68.000000,11223.6,22729.7,
69.000000,10044.7,17183.7,
70.000000,9039.7,13055.6,
71.000000,7934.78,9591.33,
72.000000,7300,7168.39,
73.000000,6499.16,5826.28,
74.000000,5911.87,5016.49,
75.000000,5625.03,4633.82,
76.000000,5801.11,4567.98,
77.000000,6530.34,5051.04,
78.000000,7670.37,6817.79,
79.000000,9138.15,10482.8,
80.000000,10368.6,17661.4,
81.000000,10606,26487.2,
82.000000,9487.61,30902.9,
83.000000,8898.5,27513.9,
84.000000,7995.54,22719.6,
85.000000,7106.15,18540.1,
86.000000,6540.97,14739.2,
87.000000,6284,11128.7,
88.000000,5415.07,8826.67,
89.000000,4861.42,7037.15,
90.000000,4438.94,5751.84,
91.000000,4108.15,4896.54,
92.000000,4634.43,4549.54,
