Frame number,1000000000,1000000001,1000000002,1000000003,1000000004,1000000005,1000000006,1000000007,
0.000000,592.024,584.012,596.931,559.928,553.962,605.045,574.044,591.744,
1.000000,633.104,634.883,656.892,616.04,645.544,644.034,549.933,597.212,
2.000000,585.08,733.105,675.087,626.116,599.508,600.536,554.026,590.194,
3.000000,647.93,793.922,723.044,652.08,658.984,656.096,594.03,580.372,
4.000000,636.99,749.04,670.922,641.02,655.6,622.516,605,680,
5.000000,524.042,721.12,619.007,606.048,665.036,598.086,596.049,659.858,
6.000000,510.057,640.801,578.512,549.1,647.572,591,538.452,590.196,
7.000000,538.518,598.926,558.495,518.54,571.904,529.055,548.066,559.698,
8.000000,495.995,624.125,519.491,545.083,562.948,514,522.548,562.01,
9.000000,486.966,559.054,503.009,505.026,559.532,498.034,527.044,533.004,
10.000000,477.037,530.985,490.048,499.059,526.056,480.98,504.051,518.569,
11.000000,485,502.028,513.968,494.993,532.047,489.494,501.02,504.047,
12.000000,487.497,519.017,497.041,492.49,506.46,505.512,504.965,498.976,
13.000000,478.48,497.95,491.945,517.984,520.505,496,492.988,504.5,
14.000000,523.488,538.925,551.965,499.476,556.996,565.047,505.953,524.552,
15.000000,574.58,562.968,580.06,537.042,556.952,595.992,569.033,568.51,
16.000000,637.99,663.528,644.931,597.606,633.464,631.094,569.987,652.592,
17.000000,676.1,744.015,695.96,609.5,719.476,641.991,597.93,726.107,
18.000000,751.069,836.537,753.899,664.115,731.4,684.825,631.984,754.325,
19.000000,741.955,833.466,740.022,651.12,721.576,704.95,627.95,759.908,
20.000000,725.996,817.364,776.152,620.076,703.396,600.91,607.104,606.998,
21.000000,658.083,782.8,715.876,602.678,672.112,580,607.888,641.111,
22.000000,671.071,721.448,694.174,551.572,670.96,582.928,548.056,607.041,
23.000000,588.48,702.505,645.958,530.06,604.073,541.886,578.856,590.909,
24.000000,569.009,636.132,590.904,535.536,600.96,536.48,542.014,553,
25.000000,525.992,590.598,535.978,505.443,519.051,528.992,504.059,556.5,
26.000000,506.01,538.46,548.955,496.472,504.978,528.956,488.012,576,
27.000000,477.015,520.572,530.048,498.537,515.965,505.988,479.974,522.01,
28.000000,490.952,521.543,508.028,461.98,515.042,484,495,515.985,
29.000000,464.05,506.992,489.06,459.92,489.02,487.96,485.028,524.03,
30.000000,470.984,509.978,508,478.472,512.524,480.955,496.04,499.924,
31.000000,506.96,518.524,519.994,465.5,534.016,509.063,547.868,530.008,
32.000000,513.06,506.973,559.918,516.505,548.54,525.048,582.128,541.06,
33.000000,616.052,533.17,614.025,519.52,608.03,544.616,664.13,598.013,
34.000000,666.12,607.91,688.891,534.85,645.52,641.054,814,730.917,
35.000000,700.856,720.847,706.82,575.974,710.928,662.003,867,767.112,
36.000000,707.008,783.62,678.149,573.48,755.05,687.907,835.15,851.891,
37.000000,693.124,767.23,673.06,606.608,705.06,671.114,757.1,881.866,
38.000000,592.026,684.998,640.123,561.494,671.02,637.267,684.114,816.025,
39.000000,595.955,681.955,610.955,567.448,561.548,629.061,641.956,780.928,
40.000000,565,624.011,550.004,553.392,552.012,635.01,613.95,717.005,
41.000000,525.036,665.029,554.092,517.552,539.12,617.863,591.06,694.087,
42.000000,494.945,690.904,551.96,537.47,537.05,603.995,570.936,661.026,
43.000000,509.06,618.072,511.015,506.544,513.53,549.06,525.997,598.046,
44.000000,488.998,574.02,531.112,493.52,503.568,513.59,527.988,599.995,
45.000000,492.512,575.015,509.965,467.975,486.505,511,484.1,599.958,
46.000000,468,528.025,505,473.08,489.552,503.988,505.051,553.995,
47.000000,474.02,530.983,480.987,486.98,483,479.06,475.025,537.946,
48.000000,457.034,534.97,466.05,475.048,482.032,483.024,466.026,499.961,
49.000000,482.994,539.984,498.012,488.025,507.524,525.967,527.033,542.04,
50.000000,536.97,546.886,548.96,498.05,536.492,524.952,521.509,559.007,
51.000000,556,594.072,573.053,523.936,566.99,565.004,514.001,617.966,
52.000000,606.933,577.036,562.048,542.06,577.934,557.016,539.496,677.999,
53.000000,631.068,633.914,604.888,537.006,600.13,577.112,617.007,689.932,
54.000000,597.004,659.952,607.206,541.142,669.16,596.98,625.017,677.053,
55.000000,612.027,635,585.061,564,588.026,657.05,570.085,651.044,
56.000000,549.062,576.834,601.936,514.927,548.064,598.984,562.128,573.02,
57.000000,541.984,529.954,581.032,519.008,558.124,610.084,557.932,515.006,
58.000000,512.032,548.016,531.989,523.976,530.074,559.964,558.947,488.002,
59.000000,499.02,492.98,479.949,526.008,500.952,542.964,525,483.022,
60.000000,488.02,466.964,493.99,501.04,502.036,516.98,524.078,460.995,
61.000000,479.98,467.006,496.012,471.029,476.07,520.024,524.984,452.013,
62.000000,488.008,464,491.994,478.989,503.04,509.054,506.002,450.03,
63.000000,468.021,455.01,466.99,466.016,472,511.025,464.981,453.988,
64.000000,457.988,465.984,469.524,441.956,471.004,474.945,475.034,445.01,
65.000000,461.992,466.05,462.492,466.02,468,490,462.992,455,
66.000000,465.026,470.984,473,455.992,478.979,474.99,460.972,455.987,
67.000000,468.984,473.996,469.996,468.025,483.052,472.023,469.99,471.01,
68.000000,487.031,484.024,468.993,487.004,507.993,468.992,481.989,454.008,
69.000000,477.04,494,501.52,485.48,502.964,498.994,476.473,535.036,
70.000000,500.051,501.076,505.024,504.512,515.06,508.1,483.91,539.975,
71.000000,510.05,544.04,506.958,490.058,531.012,526.024,507.07,626.049,
72.000000,513.004,597.04,530.522,500.892,552.576,579.065,505.968,602.949,
73.000000,508.968,554.168,518.97,534.952,540.496,514.075,530.96,603.067,
74.000000,540.044,598.974,531.479,498.04,528.024,530.094,542.01,540.015,
75.000000,517.036,573.024,524.509,507,501.514,521.06,522.04,512.962,
76.000000,484.959,572.88,493.985,489.952,497.012,530.025,494.968,469.975,
77.000000,498.024,527.978,497.524,499.944,491.48,535.97,535.003,451.985,
78.000000,488,518.088,486.475,492.02,483.48,501.56,500.96,430.006,
79.000000,464.042,513.002,495.99,478.044,467.968,517.476,511.995,420.976,
80.000000,469.98,495,462.5,465.976,457.991,524.946,511.018,434.976,
81.000000,461.03,485.97,450.022,465.987,470.016,495.966,474.032,425.98,
82.000000,472.96,475.05,448.502,464.975,453.986,495.981,476.032,424.008,
83.000000,452.992,484.056,446.006,462.016,455.972,478.04,473.028,429.984,
84.000000,449.036,465.995,435.008,456.05,449.033,467.995,457.978,436.02,
85.000000,439.016,473.022,446.52,466.02,448.984,463.978,459,436.978,
86.000000,445.04,463.025,446.508,462.98,466.024,482.009,454.012,444.992,
87.000000,470,457.52,461.525,462.5,463.05,472.05,440.988,467,
88.000000,464.98,450.024,460.498,496.014,467.04,477.92,468.974,478.03,
89.000000,455.012,465.99,486.992,473.021,482.04,467.954,458.996,531.947,
90.000000,490.972,496.976,493.976,481.993,462.02,474.988,463.968,498.976,
91.000000,499,496.036,492.054,489.006,478.988,504.929,473.5,536.042,
92.000000,485.005,504.992,487.039,535.016,506.96,517.054,503.04,496.992,
93.000000,484.994,490.992,492.556,487.043,499.01,508.941,489.516,485.04,
94.000000,488.996,507.028,491.029,509.969,503.995,501.964,496.968,468.015,
