Frame number,1000000000,1000000001,1000000002,1000000003,
0.000000,1111.9,1530.35,1243.92,889.54,
1.000000,1143.02,1215.98,1092.02,750.1,
2.000000,1187.99,1409.94,1406.88,852.938,
3.000000,1245.45,1524.52,1900.44,877.96,
4.000000,1327.02,1637.53,2346.12,896.096,
5.000000,1354.97,1669.02,2472.15,886.016,
6.000000,1317.06,1597.09,2477.1,857.971,
7.000000,1270,1561.08,2255.88,824.512,
8.000000,1260,1489.03,2098.9,816.86,
9.000000,1172.09,1434.22,1903.94,752.04,
10.000000,1149.97,1323.13,1718.08,737.944,
11.000000,1134.96,1284.98,1564.93,719.142,
12.000000,1140.95,1196.14,1474.17,688.904,
13.000000,1084.06,1193.93,1382,708.904,
14.000000,1145.97,1140.01,1330.97,691.008,
15.000000,1120.1,1164.93,1247,678.004,
16.000000,1149.16,1074.03,1245.53,670.025,
17.000000,1091.89,1139.15,1227.44,689.004,
18.000000,1056.04,1101.95,1165.12,684,
19.000000,1130.19,1122.03,1287.02,683.114,
20.000000,1071.96,1160.96,1364.99,683.952,
21.000000,992.88,1156.89,1460.92,691.993,
22.000000,1067.9,1124.94,1436.12,697.964,
23.000000,1087.11,1146.98,1402.98,694,
24.000000,1051.53,1131.15,1365.02,690.096,
25.000000,1040.34,1133.03,1271.09,686.064,
26.000000,961.16,1075.01,1297.89,694.96,
27.000000,916.952,1028.92,1153.91,654.972,
28.000000,939.91,1018,1175.02,640.032,
29.000000,920.04,998.008,1070.13,619.028,
30.000000,881.451,984.56,1038,630.93,
31.000000,841,961.15,983.024,628.968,
32.000000,836.148,960.94,935.068,615.022,
33.000000,773.52,940.002,935.996,626.969,
34.000000,792.5,903.129,880.98,612.936,
35.000000,830.512,871.975,824.048,610.03,
36.000000,872.004,888.822,847.935,614.016,
37.000000,848.408,896.098,876.053,603.02,
38.000000,859.432,904.08,903.915,618.062,
39.000000,844.032,874.498,895.914,616.956,
40.000000,813.1,878.12,915.958,639.968,
41.000000,835.14,887.048,894.04,638.98,
42.000000,797.52,864.005,899.952,634.96,
43.000000,752.926,873.151,869,629,
44.000000,751.006,910.054,839.104,619.05,
45.000000,752,849.364,790.484,610.052,
46.000000,698.066,837.608,790.972,589.05,
47.000000,694.024,810.026,757.056,592.08,
48.000000,660,782.482,732.021,575.996,
49.000000,673.008,775.038,740.032,595.996,
50.000000,650.04,797.028,741.982,588.016,
51.000000,666.46,754.486,730.939,581.991,
52.000000,673.01,718.508,713.998,568.832,
53.000000,654.972,725.055,698,551.976,
54.000000,676.5,713.094,733.946,572.004,
55.000000,679.924,721.995,737.092,578.984,
56.000000,675.94,718.872,775.949,572,
57.000000,641.008,692.14,782.043,572.947,
58.000000,668.52,741.035,763.964,577.09,
59.000000,663.514,736.995,785.01,587.006,
60.000000,660.46,720.062,773.984,580.054,
61.000000,642.468,747.928,753.976,565.953,
62.000000,642.473,753.916,759.124,559.988,
63.000000,601.953,701,710.92,553.96,
64.000000,620.98,697.063,684.02,536,
65.000000,627.027,672.002,674.058,544.969,
66.000000,612.972,683.024,678.977,536.038,
67.000000,621.977,672.01,673.03,542.01,
68.000000,599.025,667.04,675.956,544.98,
69.000000,603.978,655.988,661.104,527.922,
70.000000,572.948,623.144,675.98,547.058,
71.000000,608.979,653.044,673.04,535.04,
72.000000,619.015,615.89,668.009,539.994,
73.000000,609.08,602.06,679.983,533.96,
74.000000,614.996,631.032,676.972,534.05,
75.000000,630.98,641,672.038,531.024,
76.000000,587.978,651.037,681.976,536.052,
77.000000,563.952,661.995,688.971,533.969,
78.000000,583.018,636.96,685.977,530.05,
79.000000,589.93,622.975,742.909,538.016,
80.000000,578.086,581.964,737.98,525.018,
81.000000,551,613.956,729.92,520.988,
82.000000,566.01,596.96,706.002,530.02,
83.000000,565.995,583.981,679.968,515.02,
84.000000,562.016,607.032,682.06,517.008,
85.000000,564.036,596.04,697.93,515.008,
86.000000,558.984,583.06,675.92,515.98,
87.000000,556.95,573.01,673,526.953,
88.000000,582.956,553.972,658.004,516.97,
89.000000,576.93,568.991,687.1,518.05,
90.000000,549.536,588.038,666.928,535.976,
91.000000,568,579.071,688,515.025,
92.000000,564.48,600.964,671.024,521.04,
93.000000,553.512,571.496,688.978,525.984,
94.000000,544.534,565.55,702.532,528.964,
95.000000,541.516,566.024,697.504,514.984,
