Frame number,1000000000,1000000001,1000000002,1000000003,
0.000000,65530.9,52940.5,65534.2,44897.7,
1.000000,49689.8,30829,48386.4,35496.7,
2.000000,20033.5,11605.2,20611.9,18934.3,
3.000000,8400.2,4978.75,10142.6,10346.9,
4.000000,4472,2532.18,6114.12,7036.37,
5.000000,3091.22,1837.01,4459.52,5519.3,
6.000000,2448.1,1453.84,3453.6,4148.58,
7.000000,1953.82,1265,2762.13,3396.18,
8.000000,1722,1138.02,2365.6,2904.76,
9.000000,1520.18,1070.88,2220.22,2632.34,
10.000000,1518.87,1070.97,2033.85,2493.04,
11.000000,1480.92,1036.06,1858.78,2342.83,
12.000000,1443.05,1047.96,1908.87,2229.76,
13.000000,1534.98,1145.95,2083.81,2449.31,
14.000000,1880.06,1364.99,2482.94,3174.22,
15.000000,2437.16,1974.97,3552.06,4711.81,
16.000000,3918.33,3175.68,5662.16,5756.08,
17.000000,5119.68,4168.06,6218.37,5443.34,
18.000000,5149.5,4172.34,5690.82,4826.88,
19.000000,4703.57,3732.81,5195.44,4126.12,
20.000000,4121.92,3247.98,4362.4,3511.45,
21.000000,3395.49,2640.13,3795.8,2806.16,
22.000000,2793.23,2059.85,2906.25,2254.68,
23.000000,2348.15,1737.84,2440.2,2051.62,
24.000000,1941.69,1489.02,2017.97,1856.67,
25.000000,1674.12,1320.87,1698.75,1646.57,
26.000000,1659.8,1149.5,1572.94,1666.96,
27.000000,1286.95,954.072,1336.6,1545.02,
28.000000,1246.96,978.488,1332.97,1619.2,
29.000000,1269.16,998.038,1307.07,1849.98,
30.000000,1429.04,1222.02,1544.03,2721.54,
31.000000,1737.16,1727,1973.11,3994.54,
32.000000,2449.2,2601.8,2840.45,4719.3,
33.000000,3273.74,3395.2,3505.73,4214.11,
34.000000,3668.84,3290.83,3469.21,3711.95,
35.000000,3230.24,2828.82,3311.11,3053.89,
36.000000,2933.87,2364.89,3097.27,2536.81,
37.000000,2596.87,1882.88,2840.03,2185.94,
38.000000,2143.72,1567.91,2475.34,1854.05,
39.000000,1870.08,1265.9,2260.33,1600.03,
40.000000,1598.04,1082.92,1927.83,1486.41,
41.000000,1443.95,1012.96,1698.05,1393.93,
42.000000,1303.99,896.02,1529.07,1326.5,
43.000000,1230.52,827.02,1469.81,1254.03,
44.000000,1197.52,832.516,1326.96,1344.02,
45.000000,1202,871.932,1301.02,1708.01,
46.000000,1362.18,1023.49,1344.35,2510.37,
47.000000,1747.32,1369.92,1623.7,3606.32,
48.000000,2227.11,1976.97,2063.2,4011.9,
49.000000,2667.19,2579.36,2539.59,3686.26,
50.000000,2566.97,2652.6,2696.8,3308.2,
51.000000,2478.56,2372.44,2763.38,2915.19,
52.000000,2257.01,2072.5,2645.27,2545.08,
53.000000,2174.06,1761.97,2487.21,2225.38,
54.000000,2008.07,1531,2327.62,1918.7,
55.000000,1827,1369.03,2155.18,1723,
56.000000,1653.9,1189.04,1917,1595.12,
57.000000,1490.9,1053.96,1718.08,1400.92,
58.000000,1382.98,972.009,1611.04,1303.98,
59.000000,1315.99,900,1498.02,1278.97,
60.000000,1206.05,893,1358.94,1337.02,
61.000000,1239.05,883.974,1343,1698.91,
62.000000,1353.81,1084.99,1293.73,2243.32,
63.000000,1668.3,1482.05,1466.78,3189.55,
64.000000,2131.15,2230.87,1897.92,3633.03,
65.000000,2401.7,2716.74,2239.75,3453.27,
66.000000,2364.99,2654.91,2479.92,3098.64,
67.000000,2252.06,2425.1,2518.09,2711.1,
68.000000,2112.1,2101.07,2364,2436.96,
69.000000,2026.09,1840.81,2249.92,2116.96,
70.000000,1854.96,1601.12,2196.72,1813.04,
71.000000,1694.95,1390.12,2050.95,1628.07,
72.000000,1546.92,1229.02,1829,1461.95,
73.000000,1395.9,1073.41,1665.91,1312.02,
74.000000,1289.04,983.572,1453.04,1234.89,
75.000000,1186,919.504,1349.91,1227.06,
76.000000,1155.98,857.48,1205.96,1250.06,
77.000000,1132,885.456,1181.54,1628.16,
78.000000,1259.14,1073.99,1192.98,2286.61,
79.000000,1501.9,1485.87,1338.23,2968.11,
80.000000,1876.26,2230.88,1681.89,3438.06,
81.000000,2108.78,2734.86,2189.88,3061.82,
82.000000,2049.07,2787.11,2297.98,2785.87,
83.000000,1947.03,2452.92,2319.74,2412.02,
84.000000,1971.96,2116.94,2228.06,2109.46,
85.000000,1882.47,1820.86,2134.86,1868.14,
86.000000,1743.55,1627.21,2016.09,1648.86,
87.000000,1520.42,1451.48,1866.18,1426.04,
88.000000,1431.07,1277.09,1684.93,1278.03,
89.000000,1328.49,1128.13,1552.98,1213.09,
90.000000,1190.98,1015.01,1365.97,1131.1,
91.000000,1157.01,918.916,1267.02,1115.05,
92.000000,1099.98,876.016,1178.97,1214.08,
