Frame number,1000000000,1000000001,
0.000000,19781.9,12123.9,
1.000000,25636.3,10394.6,
2.000000,22307.5,15343.2,
3.000000,21112.6,19208.2,
4.000000,16469.3,19014.1,
5.000000,13326.1,7397.68,
6.000000,9881.82,5853.46,
7.000000,9841,4439.62,
8.000000,7658.9,4214.19,
9.000000,6499.36,3635.64,
10.000000,4686.4,3201.44,
11.000000,3979.85,3011.28,
12.000000,3184.51,2612.69,
13.000000,2453.2,2092.76,
14.000000,2537,1997.65,
15.000000,2532.98,2043,
16.000000,3880.29,2477.19,
17.000000,6338.68,4540.81,
18.000000,8555.25,7104.24,
19.000000,9982.25,9895.26,
20.000000,9389.88,11368.5,
21.000000,8069,10746.9,
22.000000,6125.26,7206.68,
23.000000,5126,7341.48,
24.000000,3782,4825.25,
25.000000,2854.95,3966,
26.000000,2358.89,3296.8,
27.000000,1860.89,2678.38,
28.000000,1632.47,2200.7,
29.000000,1495.62,1933.82,
30.000000,1642.68,1856,
31.000000,1610.6,1796.71,
32.000000,2020.89,1728.55,
33.000000,2798.6,2123,
34.000000,4493.35,3256.67,
35.000000,6856.46,6000.83,
36.000000,8189.25,8703.77,
37.000000,8899.42,6101.69,
38.000000,8544.92,5820.57,
39.000000,7562.42,5511.5,
40.000000,5818.27,4663.07,
41.000000,4545.61,3473.09,
42.000000,3070.22,2789.34,
43.000000,2432.28,2121.48,
44.000000,1972.67,1927.92,
45.000000,1621.29,1610.93,
46.000000,1409.37,1483.28,
47.000000,1316.98,1405.8,
48.000000,1274.38,1414.72,
49.000000,1504,1557.64,
50.000000,1935.8,1690.31,
51.000000,3224,2196.59,
52.000000,5895.98,3974.88,
53.000000,8934.22,5784.04,
54.000000,12779.1,7637.36,
55.000000,15238.8,7500.71,
56.000000,13846,7349.4,
57.000000,11602,5690.84,
58.000000,8038.66,4330.82,
59.000000,5939.29,3252.73,
60.000000,4161.16,2477.16,
61.000000,3162.78,1874.43,
62.000000,2675.4,1566.08,
63.000000,2070,1359.18,
64.000000,1809,1134.19,
65.000000,1747.58,1154.71,
66.000000,1796.7,1165.93,
67.000000,2065.5,1424.37,
68.000000,2592.7,1757.78,
69.000000,4264.04,2879.23,
70.000000,6536.38,4046.2,
71.000000,9528.55,5234.81,
72.000000,12294.1,6516.45,
73.000000,12286.7,6388.96,
74.000000,10748.1,4605.03,
75.000000,7743.99,3607.93,
76.000000,5623,2763.94,
77.000000,4196.76,2040.26,
78.000000,3178.71,1690.2,
79.000000,2664.28,1459.37,
80.000000,2245.65,1299.13,
81.000000,1938.24,1144.05,
82.000000,1948.46,1062.04,
83.000000,1872.32,1087.32,
84.000000,2188.83,1183.53,
85.000000,2666.5,1505.51,
86.000000,4843.02,2362.28,
87.000000,7657,3343.49,
88.000000,11089.4,4104.68,
89.000000,11933.9,4930.51,
90.000000,10022,4820.3,
91.000000,7778.95,3967.79,
92.000000,6157,3586.74,
