Time [ms],1000000000,1000000001,
0,2151.03,2653.43,
1000000000,2400.1,1916.97,
2000000000,1449.08,1256.1,
3000000000,1929.66,1598.17,
4000000000,2443.42,1629.82,
5000000000,2457.94,1548.05,
6000000000,2563.01,1520.66,
7000000000,2369.85,1460.42,
8000000000,2288.24,1413.85,
9000000000,2218.88,1435.05,
10000000000,2132.88,1262.97,
11000000000,2059.55,1211.34,
12000000000,1993.2,1172.93,
13000000000,1873.19,1085.19,
14000000000,1873.94,992.96,
15000000000,1728.79,937.912,
16000000000,1764.11,846.98,
17000000000,1781.92,814.92,
18000000000,1930.97,870.032,
19000000000,2039.02,973.098,
20000000000,2133.71,978.132,
21000000000,2040.07,1020,
22000000000,1983,1078.47,
23000000000,1846.83,938.432,
24000000000,1772.94,850.52,
25000000000,1609.94,837.88,
26000000000,1507.14,774.544,
27000000000,1428.4,726.984,
28000000000,1344.45,731.072,
29000000000,1329.61,704.064,
30000000000,1335.14,703.945,
31000000000,1305.98,695.056,
32000000000,1236.89,682.036,
33000000000,1291.03,683.952,
34000000000,1343.96,675.944,
35000000000,1363.86,698.789,
36000000000,1371.36,723.011,
37000000000,1356.02,740.82,
38000000000,1360.58,704.988,
39000000000,1300.86,693.148,
40000000000,1292.51,697.954,
41000000000,1179.08,666.913,
42000000000,1120.97,644.948,
43000000000,1081.15,649.488,
44000000000,1013.9,614.495,
45000000000,999,639.015,
46000000000,969.09,605.414,
47000000000,980.16,593.04,
48000000000,979.96,618.525,
49000000000,1037.05,600.464,
50000000000,1030.32,609.52,
51000000000,990.476,591.975,
52000000000,980.024,588.472,
53000000000,1076.04,590.028,
54000000000,1035.97,613.976,
55000000000,1018.5,592.036,
56000000000,979.56,621.032,
57000000000,931,584.978,
58000000000,876,567.056,
59000000000,874.036,577.96,
60000000000,849.468,554.9,
61000000000,828.996,577.95,
62000000000,816,561.056,
63000000000,769.95,560.015,
64000000000,786.016,560.012,
65000000000,830.984,558.064,
66000000000,812.962,554.97,
67000000000,786.994,563.992,
68000000000,792.07,560,
69000000000,818.012,555,
70000000000,816.048,563.04,
71000000000,780,552.997,
72000000000,784.058,557,
73000000000,774.007,547.96,
74000000000,733,557.988,
75000000000,730.06,543.029,
76000000000,698.026,540.09,
77000000000,712.98,538.952,
78000000000,694.988,535.02,
79000000000,685.936,536.98,
80000000000,686.004,540.936,
81000000000,705.892,546.985,
82000000000,721.192,530.984,
83000000000,714.05,533.036,
84000000000,705.04,549.024,
85000000000,704.952,540.024,
86000000000,703.966,535.038,
87000000000,699.028,540.98,
88000000000,688.047,524.008,
89000000000,699.024,526.048,
90000000000,672.992,506.018,
91000000000,662,525.05,
92000000000,644.952,523,
93000000000,640.024,505.992,
94000000000,648.947,510.048,
95000000000,642.008,531.022,
