Time [ms],1000000000,1000000001,1000000002,1000000003,
0,601.041,610,709.064,692.356,
1000000000,630.056,641,825,806.9,
2000000000,732.032,768.05,885.924,1014.19,
3000000000,765.14,819.968,936.84,1173.12,
4000000000,801.138,857.856,961.893,1136.82,
5000000000,762.04,799.904,963.088,1055.91,
6000000000,703.876,787.818,920.998,1021.12,
7000000000,720.508,708.056,812.895,915.195,
8000000000,628,678.886,707.04,858.948,
9000000000,650.512,623.5,677.158,810.92,
10000000000,612.518,579.1,607.95,708.84,
11000000000,606.973,580.98,596.056,710.896,
12000000000,572.004,548.04,566.958,633.052,
13000000000,554.08,552.028,546.98,644.08,
14000000000,532.024,528.08,544.994,596.04,
15000000000,534.936,511.06,524.013,622.096,
16000000000,519.95,504.016,536.04,609.016,
17000000000,530.95,498.952,539.971,628.04,
18000000000,522.015,521.028,522.04,576.976,
19000000000,534.044,502.54,524.056,599.084,
20000000000,510.986,550.048,541.96,676.024,
21000000000,562.008,579.538,584.944,757.896,
22000000000,595.96,583.536,567.021,865.016,
23000000000,621.936,605.032,634,910.004,
24000000000,658.016,621.5,648.104,942.872,
25000000000,691.92,626.488,683.964,901.2,
26000000000,638.016,669.082,688,877.128,
27000000000,611.056,626.986,680.112,822.933,
28000000000,627.01,567.062,658.038,761.97,
29000000000,607.962,541.024,614.988,697.029,
30000000000,578.104,554.031,615.072,692.003,
31000000000,574.088,553.968,571.006,656.936,
32000000000,542.588,534.96,561.1,635.495,
33000000000,551.438,520.052,543,631.054,
34000000000,524.995,521.05,527.017,625.969,
35000000000,517.972,522.025,534,589.024,
36000000000,512.982,512.045,505.022,559.018,
37000000000,481.535,487.936,488.52,581.06,
38000000000,500.008,484.02,491.984,574,
39000000000,507,484,508.043,581,
40000000000,509.52,519.968,518.048,654.896,
41000000000,538.06,523.882,528.007,700,
42000000000,563.92,525.013,545.934,756.868,
43000000000,583.93,521,559,748.068,
44000000000,606.462,542.96,555,738.936,
45000000000,589.004,549,585.017,741.028,
46000000000,563.958,547.04,583.07,687.076,
47000000000,548.98,534.924,556.072,690.04,
48000000000,564.512,527,551.981,613.016,
49000000000,534.032,519.072,566.96,621.056,
50000000000,547.956,520.95,556.932,637,
51000000000,532.526,521.464,557.136,606.976,
52000000000,518.04,523.935,537.004,560.904,
53000000000,528.072,515.048,508.484,576.938,
54000000000,514.56,471.5,520.488,543.028,
55000000000,516.055,492.516,512.52,536.072,
56000000000,523.015,494.936,499.974,532.5,
57000000000,496.024,475.04,499.51,535.952,
58000000000,485.968,484.948,491.496,563.032,
59000000000,491.976,472.002,497.019,575.088,
60000000000,519.08,488.044,491.941,596.08,
61000000000,512.491,474.06,508.012,610.908,
62000000000,535.494,486.976,507.016,620,
63000000000,527.956,484.014,547.496,626.88,
64000000000,528.504,488.994,544.928,654.004,
65000000000,559,506.904,533.956,615.068,
66000000000,529.068,490.017,562.02,635.106,
67000000000,523.018,496.05,537.976,618.91,
68000000000,542.02,500.025,535.056,602.052,
69000000000,531.544,472.035,521.974,570,
70000000000,505.008,496.96,510.984,562.96,
71000000000,511.003,479.964,499.504,561.06,
72000000000,487.55,502.955,512.072,538.044,
73000000000,502.056,496.016,516.52,542.94,
74000000000,497,483.045,485.996,549.96,
75000000000,484.982,476.972,483.011,540.07,
76000000000,477.512,461.972,491.01,561.008,
77000000000,490.98,470.96,497.032,538.05,
78000000000,508.045,464.055,507.032,561.97,
79000000000,515.072,464.968,500.032,562.056,
80000000000,499.022,481.02,490.995,561.05,
81000000000,506.975,480.928,503.04,569.988,
82000000000,503.52,476.063,510.944,576.08,
83000000000,506.024,482.984,510.02,553.028,
84000000000,496.068,494.996,492.048,558.952,
85000000000,512.93,511.04,522.94,573.936,
86000000000,489.928,472.008,509.04,551.968,
87000000000,493.992,482.012,496,568.94,
88000000000,499.007,486.008,502,549.026,
89000000000,494.46,485.012,491.02,558.072,
90000000000,494.056,460.028,510.048,542.056,
91000000000,494,474.536,505.016,534.008,
92000000000,491.992,468.02,493.028,536.018,
93000000000,484.976,480.52,488.968,528.992,
94000000000,488.008,485.008,487,546.016,
