Frame number,1000000000,
0.000000,423.008,
1.000000,446.976,
2.000000,457.96,
3.000000,473.012,
4.000000,459.99,
5.000000,458.006,
6.000000,454.982,
7.000000,462.999,
8.000000,443.024,
9.000000,448.012,
10.000000,447.024,
11.000000,451.004,
12.000000,433,
13.000000,441.028,
14.000000,438.019,
15.000000,428.02,
16.000000,441,
17.000000,442.02,
18.000000,435.981,
19.000000,450.948,
20.000000,439.01,
21.000000,434.974,
22.000000,442.988,
23.000000,442.982,
24.000000,430.992,
25.000000,436.028,
26.000000,437.04,
27.000000,438.98,
28.000000,443.005,
29.000000,432.008,
30.000000,434.992,
31.000000,432.992,
32.000000,434.524,
33.000000,434.516,
34.000000,442.02,
35.000000,436.024,
36.000000,438.984,
37.000000,435.508,
38.000000,443.992,
39.000000,435.48,
40.000000,428.488,
41.000000,443.012,
42.000000,431.488,
43.000000,429.008,
44.000000,424.496,
45.000000,436.004,
46.000000,430.512,
47.000000,428.5,
48.000000,423.488,
49.000000,431.98,
50.000000,431.502,
51.000000,437.005,
52.000000,435.052,
53.000000,431,
54.000000,431.988,
55.000000,425.032,
56.000000,433.992,
57.000000,436.99,
58.000000,428.98,
59.000000,418.04,
60.000000,430.995,
61.000000,435.512,
62.000000,430.513,
63.000000,425.975,
64.000000,423.022,
65.000000,433,
66.000000,422.996,
67.000000,423.027,
68.000000,426.02,
69.000000,423.023,
70.000000,422.504,
71.000000,423.485,
72.000000,428.014,
73.000000,434.03,
74.000000,427.52,
75.000000,425.042,
76.000000,425.948,
77.000000,420.98,
78.000000,437,
79.000000,422,
80.000000,424.972,
81.000000,422.976,
82.000000,419,
83.000000,428,
84.000000,420.976,
85.000000,421.976,
86.000000,427.017,
87.000000,423.992,
88.000000,425.02,
89.000000,426,
90.000000,418.016,
91.000000,426.012,
92.000000,427.984,
93.000000,430.028,
94.000000,426.976,
