Time [s],1000000000,1000000001,1000000002,1000000003,1000000004,1000000005,1000000006,1000000007,
0.000000,622.972,712.084,858.453,920.96,782.968,804.208,755.056,718.989,
1.000000,501.496,530.968,582.98,605.008,588.008,586.928,526.504,522.98,
2.000000,459,488.076,516.952,545.028,517.584,518.07,496.984,486.972,
3.000000,449.488,485.972,485.928,489.982,482.5,480,477.992,467.04,
4.000000,439.496,448.01,464.48,489.002,471.064,469.972,468.99,458.48,
5.000000,439.008,454.032,451.008,479.037,460.016,454.097,457.05,449.494,
6.000000,427.028,433.963,446.512,468.014,448.988,462.048,443.032,439.005,
7.000000,425.492,454.03,448.968,466.496,464.932,456.016,445.04,432,
8.000000,444.518,462.012,481.028,495.034,474.96,482.935,485,462.496,
9.000000,452.016,487.966,498.518,526,480.97,507.942,470.05,466.552,
10.000000,458.52,483.944,490.548,561.026,501.08,549.036,493.985,494.936,
11.000000,477.476,534.944,512.496,590.024,512,598.992,544.016,538.056,
12.000000,516.008,573.024,576.46,704.912,605.035,692.435,608.006,592.544,
13.000000,551,590.5,629.896,747.996,672.03,728.816,643.433,640.96,
14.000000,562.6,629.526,599.89,821.984,677.125,750.01,712.616,660.964,
15.000000,557.472,639.492,681.92,849.988,717.978,707.952,708.04,641.52,
16.000000,509.024,559.936,609.053,704.18,628.063,621.906,596.046,549.05,
17.000000,454.014,527.006,505.02,566.08,519.98,535.106,491.522,476.05,
18.000000,447.026,482.944,495.983,518.937,503.054,495.054,483.526,459.974,
19.000000,438.99,473.934,461.06,512.08,479.06,480.017,461.472,445.981,
20.000000,435.03,437.986,447.978,493.48,455.02,476.95,465.524,427.984,
21.000000,440.992,448.996,451.015,485.963,455.046,450.12,447.948,429.98,
22.000000,429.96,449.524,439.012,490.005,451.986,452.057,438.482,434,
23.000000,425.032,436.516,454.946,455.05,445.006,446,439.47,432.512,
24.000000,449.956,466.536,468.04,485.982,475.042,505.052,472.988,456,
25.000000,475.001,483.5,524.049,527.5,489,495.004,470,469.504,
26.000000,453.984,492.016,512.055,542.035,487.988,536.986,500.476,468.004,
27.000000,466.029,534.004,492.034,546.083,514.947,624.076,518.504,480.5,
28.000000,486.98,645.982,582.934,680.047,583.992,676.78,552.996,523.552,
29.000000,535.092,626.983,621.928,738.23,616.584,693.074,630.53,572.04,
30.000000,523.05,641.87,673.978,757.892,644.508,750.964,626.98,582.54,
31.000000,524.003,613.007,648.954,744.035,660.436,698.952,617.962,545.04,
32.000000,489.944,541.064,580.052,623.005,573.513,576.93,553.532,491.504,
33.000000,445.014,495.972,508.984,530.051,512.072,498.952,488.508,455.002,
34.000000,438.99,465.978,482.92,498.014,476,463.512,461.026,435.008,
35.000000,437.976,451.007,461.966,479.472,448.481,455.984,459.013,428.99,
36.000000,417.009,445.504,456.944,470.012,444.496,452.05,439.992,432.96,
37.000000,431.012,452.505,453.988,468.017,445,444.98,436,429.52,
38.000000,426.976,440.506,442.975,463.97,449.5,442.056,432.993,422.016,
39.000000,422.024,424.534,446,455,433.012,435.984,432.502,433.016,
40.000000,441.992,461.009,465.032,479.984,469.99,476.991,469.995,461.52,
41.000000,456,469.522,493.98,496.985,497.014,504.032,487.512,463.964,
42.000000,455.968,488.5,496.009,506.948,481.98,505.96,484.54,478.046,
43.000000,454.05,514.971,501.09,540.056,504.005,540.04,490.976,462.07,
44.000000,477.028,574.494,559.064,590.958,544,603.946,529.448,499,
45.000000,504.024,593.974,603,645.93,581.985,607,550.495,519.046,
46.000000,500.04,595.5,638.975,671.06,590,629.168,566.977,543.996,
47.000000,488.988,570.504,627.075,682.582,564.973,608.887,577.985,533.96,
48.000000,468.952,525.55,523.954,556.984,530.032,539.96,501.062,484.991,
49.000000,435.018,463.026,485.02,506.966,462.043,499.528,465.92,444.004,
50.000000,423.02,457.016,468.014,481.004,453.042,471.504,454,443.972,
51.000000,436.001,441.968,446.069,458.034,449.984,448.512,434.036,433.035,
52.000000,416.978,439.044,449.025,460.004,437.983,443.502,425.972,436.997,
53.000000,419.97,429,440.016,453.03,437.032,445.01,436.978,417.992,
54.000000,409.524,434.035,443.968,445.972,428,434.992,431.016,428.506,
55.000000,411.501,441.021,443.004,436.004,430.032,424.472,424.01,433.992,
56.000000,436.976,467.476,460.98,470,472.027,463.497,461.06,449.5,
57.000000,453.488,475.52,510.042,482.07,490.024,497.05,471.008,461.5,
58.000000,455.004,481.008,496.044,502.016,485.534,501.96,484.008,462,
59.000000,462.508,515.068,516,527.12,499.458,529.58,498.952,464.96,
60.000000,487.025,534.989,561.944,576.872,552.995,559.984,524.988,498.047,
61.000000,494.01,585.939,582.016,591.006,568.12,586.494,575.01,507.024,
62.000000,499.978,558.1,604.02,634.982,549.92,617.508,568.014,517.936,
63.000000,490.05,560.896,564.94,586.16,553.94,592.419,536.12,491.984,
64.000000,462.016,508,521.929,551.044,506.494,537.488,472.528,476.046,
65.000000,430.488,456.036,466.986,495,457.974,475.984,452.486,444.012,
66.000000,421.994,444.05,459.04,452.985,445.936,445.992,444.504,427.98,
67.000000,421.987,438.012,456.964,452.99,434.016,442.942,437.496,431.048,
68.000000,422.008,435.04,435.016,458.026,438.95,447,421.98,422,
69.000000,426.024,429.02,433.972,437.014,432.024,440.971,425.008,428.025,
70.000000,421.976,433.028,454.5,440,431.016,434.532,422.016,427.022,
71.000000,420,425.016,431.944,434.004,420.008,425.52,411.998,412.963,
72.000000,432.014,446.968,457.989,474.082,467,468.508,447.05,454.95,
73.000000,459.985,472.058,490.52,489.02,491.018,484.008,476.503,453.972,
74.000000,440.98,475,477,506.952,483.55,501.46,480.988,461.976,
75.000000,449.968,501.996,496.984,516.08,509.504,514.986,496.036,487.04,
76.000000,470.966,526.042,526.064,545.01,516.164,564.476,509.059,485.99,
77.000000,482.468,563.88,570.987,565.93,541.031,572.448,523.904,482.952,
78.000000,472.006,559.456,567.042,589.07,549.97,579.012,499.02,494.028,
79.000000,481.528,552.512,574.968,573.072,525.08,569.04,528.99,484.964,
80.000000,457.448,482.968,519.96,504.068,486.008,500.928,471.965,449.996,
81.000000,435.008,456.515,464.484,473.036,451.029,464.5,444.044,429.98,
82.000000,428.974,454.49,452.482,450.026,433.034,453.504,431.992,421.994,
83.000000,425.016,439.972,449.048,438.043,435.026,444.54,428.991,418.034,
84.000000,419.975,441.456,436.488,436.021,427.986,441.998,421.011,421.025,
85.000000,411.048,422.508,434.487,434.028,427.022,435.016,433.025,413.03,
86.000000,421,427.484,430.01,428.974,426.972,428.488,425.028,407.064,
87.000000,420.008,425.488,426.014,428.99,429,421.97,431.017,423.011,
