Time [ms],1000000000,1000000001,1000000002,
0,566.996,556.047,685.152,
1000000000,592.4,631.46,710.95,
2000000000,749.042,680.856,786.024,
3000000000,1043.12,748.188,972.72,
4000000000,1100.9,818.018,1023.72,
5000000000,1111.91,853.596,1146.62,
6000000000,985.18,865.216,1127.77,
7000000000,1016.28,855.976,1048.05,
8000000000,1001.22,876.888,1002.42,
9000000000,975.634,856.408,923.164,
10000000000,903.54,826.818,916.548,
11000000000,854.57,785.616,896.58,
12000000000,783.616,718.302,785.13,
13000000000,701.116,718.804,762.02,
14000000000,652,659.85,733.12,
15000000000,633.201,608.88,667.926,
16000000000,608.938,580.456,663.112,
17000000000,620.46,568.916,611.474,
18000000000,564.882,582.889,628.956,
19000000000,624.6,592.94,597.945,
20000000000,613.25,592.855,619.462,
21000000000,611.168,581.913,612.002,
22000000000,641.938,633.146,654.57,
23000000000,715.58,623.575,703,
24000000000,682.52,637.165,691.52,
25000000000,661.091,645.88,752.476,
26000000000,656.552,624.181,697.488,
27000000000,622.016,606.973,674.128,
28000000000,617.082,610.052,651.928,
29000000000,581.96,641.045,604.568,
30000000000,601.58,635.436,588.957,
31000000000,598.038,603.896,555.344,
32000000000,595.04,587.96,579.476,
33000000000,560.054,522.998,570.922,
34000000000,563.005,554.012,568,
35000000000,591.963,548.54,556.072,
36000000000,559.088,543,579.86,
37000000000,545.177,521.063,541.948,
38000000000,571.84,533.91,596.893,
39000000000,571,522.087,574.103,
40000000000,595.1,529.85,595.102,
41000000000,614.02,558.042,586.075,
42000000000,582.944,603.916,612.058,
43000000000,612.091,573.075,584.076,
44000000000,637.09,593.929,596.124,
45000000000,609.944,548.162,578.41,
46000000000,603.008,565.039,569,
47000000000,602.048,559.98,575,
48000000000,591.968,575.946,550.536,
49000000000,565.92,535.86,526.968,
50000000000,556.01,530.96,537.066,
51000000000,538.9,522,517.42,
52000000000,546.96,519.012,526.952,
53000000000,553.056,512.064,515.01,
54000000000,544.003,527.974,541.076,
55000000000,542.072,541.969,528.028,
56000000000,572.525,512.029,515.602,
57000000000,575.504,557.052,523.128,
58000000000,558.897,528.985,529.99,
59000000000,566.534,573.92,541.456,
60000000000,589.58,530.508,535.5,
61000000000,556.007,545.098,530,
62000000000,545.906,565.48,541.016,
63000000000,556.949,539,539.526,
64000000000,537.178,533.531,519.92,
65000000000,564.004,537.08,517.6,
66000000000,569,512.448,511.001,
67000000000,525.973,527.039,529.452,
68000000000,530.583,512.902,503.05,
69000000000,520.914,518.384,503.01,
70000000000,525.019,494.03,520.02,
71000000000,534.008,496.01,507.076,
72000000000,540.974,511.946,500,
73000000000,521.018,509.088,507.924,
74000000000,521.994,496.059,504,
75000000000,552.94,525.968,512.972,
76000000000,541.007,511.041,487.968,
77000000000,537.561,524.05,485.502,
78000000000,522.905,527.472,486.968,
79000000000,527.016,542.936,490.48,
80000000000,537.024,527.888,500.057,
81000000000,546.476,535.075,492.496,
82000000000,540.026,544.068,485.021,
83000000000,506.568,504.02,479.053,
84000000000,481.034,499.931,477.56,
85000000000,526.473,496.02,476.05,
86000000000,513.03,513.548,478.948,
87000000000,502.927,493.999,479.12,
88000000000,515.964,487.429,476.98,
89000000000,495.056,492.552,463.48,
90000000000,525.06,497.438,482,
91000000000,522.972,500.472,479.036,
92000000000,526.951,499.968,486.52,
93000000000,502.08,489.052,477.034,
94000000000,515.04,503,485.516,
95000000000,529.005,502.954,474.964,
