Frame number,1000000000,
0.000000,511.488,
1.000000,464.008,
2.000000,468.014,
3.000000,470.988,
4.000000,481.5,
5.000000,473.52,
6.000000,462.46,
7.000000,452.01,
8.000000,447.988,
9.000000,435,
10.000000,429.493,
11.000000,421.496,
12.000000,423.99,
13.000000,425.49,
14.000000,429.005,
15.000000,410.017,
16.000000,425.5,
17.000000,428.484,
18.000000,438,
19.000000,442.994,
20.000000,444.492,
21.000000,441.024,
22.000000,438.52,
23.000000,437.03,
24.000000,434.484,
25.000000,424.492,
26.000000,436.02,
27.000000,429.982,
28.000000,427.499,
29.000000,427,
30.000000,425.036,
31.000000,421.504,
32.000000,414.98,
33.000000,427.508,
34.000000,424.992,
35.000000,427.032,
36.000000,432.51,
37.000000,432.984,
38.000000,438.504,
39.000000,428,
40.000000,433.005,
41.000000,429.998,
42.000000,425.008,
43.000000,429,
44.000000,421.999,
45.000000,430.495,
46.000000,423,
47.000000,431,
48.000000,418.528,
49.000000,416.017,
50.000000,422.01,
51.000000,421.51,
52.000000,418.02,
53.000000,423.48,
54.000000,415.02,
55.000000,434.514,
56.000000,430.996,
57.000000,415.519,
58.000000,428.512,
59.000000,425.025,
60.000000,425.528,
61.000000,418.995,
62.000000,424.496,
63.000000,424.468,
64.000000,423.99,
65.000000,423.982,
66.000000,425.51,
67.000000,409.498,
68.000000,422,
69.000000,418.478,
70.000000,421,
71.000000,417.5,
72.000000,424.99,
73.000000,421.514,
74.000000,421.998,
75.000000,419.988,
76.000000,426.984,
77.000000,426.972,
78.000000,423.48,
79.000000,417.512,
80.000000,419.512,
81.000000,426.022,
82.000000,420.5,
83.000000,423.024,
84.000000,416.974,
85.000000,422.017,
86.000000,425.976,
87.000000,413.512,
88.000000,420.518,
89.000000,417.988,
90.000000,417.525,
91.000000,419.52,
92.000000,423.998,
93.000000,418.016,
94.000000,416.993,
