Time [ms],1000000000,
0,449.013,
1000000000,451.016,
2000000000,449.012,
3000000000,448.988,
4000000000,476.96,
5000000000,470,
6000000000,468.999,
7000000000,480.008,
8000000000,462.996,
9000000000,462.026,
10000000000,455.006,
11000000000,451.976,
12000000000,446.003,
13000000000,451.964,
14000000000,449.024,
15000000000,449.984,
16000000000,439,
17000000000,454.024,
18000000000,450.022,
19000000000,450.944,
20000000000,439.987,
21000000000,450.968,
22000000000,464.024,
23000000000,452.013,
24000000000,465.046,
25000000000,448.964,
26000000000,448.008,
27000000000,438.971,
28000000000,448.02,
29000000000,433.99,
30000000000,443.996,
31000000000,441.04,
32000000000,439.005,
33000000000,447.968,
34000000000,441.008,
35000000000,444.967,
36000000000,441.009,
37000000000,442.987,
38000000000,438.037,
39000000000,438.002,
40000000000,443.001,
41000000000,440.012,
42000000000,440.024,
43000000000,436.02,
44000000000,436.024,
45000000000,424.984,
46000000000,429.992,
47000000000,438.974,
48000000000,438.977,
49000000000,427.996,
50000000000,430.002,
51000000000,428.016,
52000000000,436.975,
53000000000,426.048,
54000000000,426.976,
55000000000,436.972,
56000000000,429.984,
57000000000,434.962,
58000000000,425.978,
59000000000,431.019,
60000000000,436,
61000000000,428.999,
62000000000,425,
63000000000,435.996,
64000000000,430.984,
65000000000,429.976,
66000000000,439.01,
67000000000,424.041,
68000000000,434.944,
69000000000,420.997,
70000000000,432.019,
71000000000,437.01,
72000000000,421.98,
73000000000,437.969,
74000000000,429.01,
75000000000,413.013,
76000000000,423.002,
77000000000,432.011,
78000000000,430.038,
79000000000,419.988,
80000000000,431.98,
81000000000,428.976,
82000000000,429.982,
83000000000,428.992,
84000000000,426.02,
85000000000,420.95,
86000000000,431.013,
87000000000,430.02,
88000000000,433.98,
89000000000,429.012,
90000000000,422.036,
91000000000,428.004,
92000000000,422.998,
93000000000,426.997,
94000000000,431.01,
95000000000,430.02,
