Frame number,1000000000,1000000001,1000000002,1000000003,
0.000000,2085.74,3261.8,3879.1,4287.74,
1.000000,3506.21,4102.26,8066.46,4657.9,
2.000000,3653.04,4042.04,8651.85,5178.64,
3.000000,3659.98,3939,9643.45,6080.39,
4.000000,3910.16,3931.61,9240.24,7109.64,
5.000000,4026.11,3938.42,8969.09,6754.52,
6.000000,3751.92,3875.22,6672.22,5717.41,
7.000000,3465.38,3513.82,5905.95,4818.25,
8.000000,3224.4,3351.74,5407.49,4121.48,
9.000000,2993.32,3232.29,5005.24,3242.75,
10.000000,2728.73,2897.96,4436.52,2841.72,
11.000000,2561.76,2888.1,3713.95,2651.88,
12.000000,2380.03,2826.02,3376.88,2720,
13.000000,2366.38,2667.02,3389.83,2627.49,
14.000000,2091,2771.85,3196.86,2473.37,
15.000000,2176.6,2565.96,3214.45,2725.8,
16.000000,2158.5,2417.04,3377.7,2730.63,
17.000000,2269.73,2517.79,3568.34,2738.7,
18.000000,2330.43,2647.76,3892.81,2788.6,
19.000000,2495.83,2639.85,4071.13,3005.98,
20.000000,2513.26,2785,4244.62,2898.76,
21.000000,2569.71,3149.89,4180.17,2911.34,
22.000000,2617.22,2988.36,4063.35,2945.14,
23.000000,2585.74,2961,4089.66,3032.06,
24.000000,2713.22,2963.06,4060.3,2718.26,
25.000000,2564.07,2884.52,3763.53,2650.51,
26.000000,2458.76,2828.87,3462.8,2508.66,
27.000000,2409.7,2720.43,3397.16,2609.31,
28.000000,2237.49,2662.31,3308.08,2607.02,
29.000000,2274.56,2520.75,3124.73,2580.06,
30.000000,2245.49,2365.8,2843.33,2624.35,
31.000000,2190.3,2423.91,2483.38,2599.82,
32.000000,2167.97,2426.73,2456.26,2593.55,
33.000000,2183.72,2408.4,2752.44,2541.76,
34.000000,2127.36,2716.98,3075.92,2548.04,
35.000000,2082.28,2801.52,3106.33,2650.96,
36.000000,2125.99,2645.91,3432.52,2569.43,
37.000000,2153.04,2884.36,3479.54,2690.57,
38.000000,2230.46,2884.71,3320.36,2505.95,
39.000000,2162.5,2907.06,3201.47,2472.93,
40.000000,2119.75,2845.18,3137.38,2309.78,
41.000000,2063.9,2908.48,3119.94,2420.65,
42.000000,2044.37,2704.34,3374.44,2482.44,
43.000000,1974.1,2675.95,3062.35,2427.98,
44.000000,1994.76,2802.5,3210.78,2336.66,
45.000000,1886.24,2703.12,2939.6,2425.34,
46.000000,1886.35,2729.5,3203.21,2488.94,
47.000000,1854.41,2789.05,3239.22,2414.95,
48.000000,1791.16,2697.94,3117.72,2457.52,
49.000000,1867.92,2738,3216.33,2263.53,
50.000000,1829.58,2707,3215.68,2328.6,
51.000000,1832.79,2723.78,3291.03,2408.8,
52.000000,1852.18,2893.2,3447.72,2420,
53.000000,1906.52,2840.5,3272.56,2383.82,
54.000000,1866.48,2963.46,3404.39,2450.2,
55.000000,1848.25,3023.52,3274.7,2561.77,
56.000000,1896.31,3008.66,3173.09,2533.07,
57.000000,1926.35,3075.42,3143.36,2428.91,
58.000000,1878,2912.54,3209.25,2341.82,
59.000000,1774.88,3084,3245.68,2424.95,
60.000000,1763.54,3023,3203.32,2242.92,
61.000000,1797.94,2897,3356.21,2323.41,
62.000000,1768.4,2950.02,3095.7,2314.48,
63.000000,1787.71,2939.3,3117.65,2485.16,
64.000000,1789.56,2948,3061.66,2339.85,
65.000000,1815.76,2959.74,3086.82,2469.15,
66.000000,1691.26,3183.2,3189.24,2373.1,
67.000000,1756.71,3045.54,3024.75,2281.89,
68.000000,1725.95,3300.68,3164.2,2308.41,
69.000000,1663.81,3106.35,3215.25,2247.74,
70.000000,1699.49,3221.74,3158.61,2259.21,
71.000000,1707.97,3122.15,3204.92,2206.44,
72.000000,1813.09,3376.57,3127.37,2227.46,
73.000000,1731.55,3390.1,3154.53,2240.86,
74.000000,1804.93,3386.9,3081.96,2269.46,
75.000000,1855.48,3324.7,3271.7,2282.98,
76.000000,1800.78,3459.39,3016.04,2329.56,
77.000000,1802.46,3363.88,3156.06,2238.07,
78.000000,1687.38,3374.6,3153.19,2369.49,
79.000000,1783,3263.66,3276.85,2248.62,
80.000000,1698.51,3429.88,3275.11,2373,
81.000000,1740.55,3302.74,3141.85,2283.29,
82.000000,1718.24,3408.24,3085.09,2277.79,
83.000000,1744.22,3269.58,3135.25,2228.4,
84.000000,1746.58,3501.45,3031.73,2165.89,
85.000000,1824.99,3384,3095.96,2168.7,
86.000000,1816.43,3517.85,3144.77,2276.3,
87.000000,1747.7,3390.54,3104.12,2191.43,
88.000000,1772.63,3359.79,3243.71,2207.42,
89.000000,1788.83,3333.59,3104.05,2296.36,
90.000000,1789.07,3409.52,3205.9,2259.67,
91.000000,1812.36,3437.24,3381.86,2215,
92.000000,1722.51,3502.84,3341.29,2220.58,
93.000000,1686.06,3496.04,3167.98,2198.69,
94.000000,1707.3,3602.32,3354.7,2137.42,
