Frame number,1000000000,1000000001,1000000002,
0.000000,2551.75,2315.03,3288.05,
1.000000,2984.16,3772.66,4329.74,
2.000000,3085.62,3981.59,3636.68,
3.000000,3402.34,4334.42,4289.11,
4.000000,3731,4075.69,3994.04,
5.000000,3186.68,3086.56,2866.15,
6.000000,2583.6,2015.4,1983.5,
7.000000,2086.34,1474.86,1556.83,
8.000000,1581.28,1187.65,1245.92,
9.000000,1315.69,1067.34,1051.79,
10.000000,1189.78,985.19,949.888,
11.000000,1007.63,859.73,881.128,
12.000000,909.076,793.866,811.348,
13.000000,886.505,800.893,748.056,
14.000000,817,768.12,757.64,
15.000000,838.53,779.978,753.504,
16.000000,836.962,744.077,755.94,
17.000000,857.768,841.045,830.92,
18.000000,892.832,1013.3,1044.61,
19.000000,1075.45,1378.01,1303.29,
20.000000,1319.14,1843.14,1618.14,
21.000000,1580.87,2032.58,1744.95,
22.000000,1694.56,1876.89,1531.39,
23.000000,1781.64,1623.83,1316.58,
24.000000,1623.5,1194.39,1199.05,
25.000000,1338.57,1029.33,978.944,
26.000000,1108.98,867.198,940.456,
27.000000,949.612,793.998,745.916,
28.000000,820.144,736.17,709.119,
29.000000,764.096,723.018,728.003,
30.000000,729.712,683.929,637.025,
31.000000,703.01,672.02,660.957,
32.000000,705.536,688.015,664.081,
33.000000,698.992,749.894,691.004,
34.000000,773.32,786.057,737.52,
35.000000,786.476,917.905,840.516,
36.000000,875.01,1033.15,949.166,
37.000000,1008.05,1231.28,1087.86,
38.000000,1153.09,1312.5,1182.46,
39.000000,1199.72,1301.77,1142.83,
40.000000,1180.76,1239.99,1072.52,
41.000000,1117.32,1124.89,929.85,
42.000000,1060.86,944.009,845.906,
43.000000,880.892,812.576,745.065,
44.000000,792.024,698.519,649.932,
45.000000,677.856,667,606.996,
46.000000,657.054,639.996,592,
47.000000,642.966,615.17,584.976,
48.000000,663.032,646.972,619.032,
49.000000,692.168,656.958,639.97,
50.000000,701.015,676.057,664.99,
51.000000,724.91,738.992,737.072,
52.000000,764.978,793.914,808.102,
53.000000,864.942,892.104,872.16,
54.000000,978.792,909.152,987.112,
55.000000,997.652,1120.13,1036.75,
56.000000,1060.13,1118.74,1079.35,
57.000000,1083.24,980.064,890.33,
58.000000,923.016,947.348,798.18,
59.000000,881,823.768,678.871,
60.000000,808,705.92,650.952,
61.000000,742.868,652.006,612.119,
62.000000,668.088,618.972,602.928,
63.000000,636.786,624.968,595.938,
64.000000,667.06,627.128,626.52,
65.000000,685.21,640.975,630.995,
66.000000,654.969,656.996,649.511,
67.000000,709.988,702.832,702.52,
68.000000,751.164,732.125,822.367,
69.000000,718.941,805.848,896.475,
70.000000,827.896,870.098,973.6,
71.000000,936.149,915.036,1075.14,
72.000000,1022.78,975.188,1003.35,
73.000000,1131.78,897.73,949.241,
74.000000,1081.74,845.876,872.378,
75.000000,1030.4,799.248,740.01,
76.000000,945,765.028,670.824,
77.000000,917.16,709.118,676.933,
78.000000,781.216,677.931,637.93,
79.000000,801,675.99,651.075,
80.000000,792.9,680.922,641.088,
81.000000,759.874,668.08,656,
82.000000,745.156,689.032,673,
83.000000,723.828,749.016,726.864,
84.000000,758.144,771.145,813.924,
85.000000,778.192,767.768,867.865,
86.000000,831.172,779.934,887.038,
87.000000,947.744,847.157,980.906,
88.000000,1122.02,817.028,959.79,
89.000000,1140.3,829.69,941.79,
90.000000,1192.94,767.055,920.039,
91.000000,1138.37,799.988,848.8,
92.000000,1119.71,818.886,761.854,
93.000000,1013.76,782.896,712.536,
94.000000,948.976,758.08,704.1,
