Time [ms],1000000000,1000000001,1000000002,
0,1230.49,1158.77,1611.58,
1000000000,943.72,1175.53,1952.64,
2000000000,1079.87,1614.38,1863.57,
3000000000,1338.53,1962.5,2650.12,
4000000000,1401.18,2894,3101.53,
5000000000,1353.2,2025.34,2462.85,
6000000000,1389.16,1559.42,2145.59,
7000000000,1408.16,2138.01,1774.77,
8000000000,1295.75,1567.68,1812.5,
9000000000,1077.87,1748.19,1605.53,
10000000000,1122.98,1394.47,1707.95,
11000000000,1006,1455.41,1369.3,
12000000000,903.428,995.878,1178,
13000000000,869.444,710.611,1092.56,
14000000000,1057.91,857.082,1155.1,
15000000000,998.124,751.19,1148.19,
16000000000,971.98,615.514,735.788,
17000000000,895.452,661.096,784.056,
18000000000,889.024,705.082,873.203,
19000000000,867.066,696.046,622.111,
20000000000,957.868,613.328,733.775,
21000000000,1131.53,785.704,705.696,
22000000000,1156.24,937.4,749.901,
23000000000,1362.45,1048.78,845.032,
24000000000,1595.82,1230.59,921.37,
25000000000,1489.24,1199.55,896.318,
26000000000,1516.14,1136.09,869.964,
27000000000,1324.69,1229.19,902.604,
28000000000,1199.69,1043.32,940.648,
29000000000,1081.3,861.335,765.072,
30000000000,1008.62,885.751,737.68,
31000000000,970.936,820.664,785.2,
32000000000,857.088,768.878,797.024,
33000000000,783.404,743.928,752.828,
34000000000,759.112,719.862,760.888,
35000000000,678.896,712.954,685,
36000000000,753.907,735.036,721.184,
37000000000,870.216,760.4,752.208,
38000000000,921.87,773.5,975.008,
39000000000,1098.12,827.128,1118.74,
40000000000,1422.39,833.94,1254.17,
41000000000,1543.38,942.08,1432.18,
42000000000,1625.21,885.932,1431.44,
43000000000,1555.53,935.98,1197.34,
44000000000,1412.31,865.766,1088.05,
45000000000,1335.38,797.596,907.99,
46000000000,1267.72,765.912,859.804,
47000000000,1144.75,764.896,742.948,
48000000000,930.121,673.616,686.085,
49000000000,850.959,637.522,695.941,
50000000000,764.692,648.94,639.088,
51000000000,745.994,617.149,644.045,
52000000000,767.492,620.827,636.071,
53000000000,813.596,647.952,694.185,
54000000000,851.11,692.444,739.412,
55000000000,872.712,747,806,
56000000000,1075.72,890.504,852.928,
57000000000,1289.96,977.56,913.312,
58000000000,1546.88,1060.9,861.516,
59000000000,1644.48,1193.02,960.826,
60000000000,1548.6,1091,894.027,
61000000000,1771.77,1047.01,885.721,
62000000000,1585.74,1029.99,870.85,
63000000000,1241.91,933.899,652.991,
64000000000,1105.89,794.877,663.898,
65000000000,924.08,778.928,688.96,
66000000000,812.718,711.08,607.068,
67000000000,782.702,661.576,626.062,
68000000000,833.966,642.036,669,
69000000000,816.02,654.084,634.935,
70000000000,769.22,624.044,656.17,
71000000000,823.042,639.98,705.99,
72000000000,817.04,685.976,784.03,
73000000000,912.988,725.072,755.41,
74000000000,1155.52,756.904,769.5,
75000000000,1231.34,808.66,764.646,
76000000000,1252.8,863.008,789.904,
77000000000,1235.52,928.46,773.573,
78000000000,1118.43,872.812,729.014,
79000000000,1116.08,888.782,806.19,
80000000000,972.16,788.2,711.138,
81000000000,845.04,768.028,669.858,
82000000000,875.95,742.526,645.352,
83000000000,855.876,714.838,654.505,
84000000000,757.041,689.376,679.011,
85000000000,739.748,653.04,679.125,
86000000000,757.461,642.088,589.87,
87000000000,788.088,626.44,706.127,
88000000000,828.966,630.19,741.628,
89000000000,837.77,619.99,796.792,
90000000000,830.038,698.073,893.296,
91000000000,900.893,774.216,926.096,
92000000000,1083.6,762.136,1047.28,
93000000000,1135.41,775.986,837.984,
94000000000,1107.68,835.36,811.96,
95000000000,1117.34,777.92,817.919,
