Frame number,1000000000,1000000001,1000000002,1000000003,1000000004,
0.000000,3478.3,4196.03,14977.5,13668.4,12189,
1.000000,3378.66,3944.38,9143.89,7621.11,9989.35,
2.000000,3848.52,3834.48,8441.25,3939.77,8618.16,
3.000000,3904.05,3175.38,8063.77,7862.85,7669.24,
4.000000,3050.51,2992,6586.9,5386.44,5313.29,
5.000000,2474.38,2890.4,5533.71,4568.62,5016.45,
6.000000,2296.25,2221.23,4395.87,3660.26,3989.32,
7.000000,1826.28,2146.3,3399.64,2644.12,3321.15,
8.000000,1558.81,1791.23,2643.57,2026.85,2729.16,
9.000000,1292.21,1507.39,2109.89,1598.93,2244.18,
10.000000,1138.18,1376.4,1700.14,1297.02,1864.94,
11.000000,1034.81,1311.7,1424.24,1130.01,1224.58,
12.000000,909.058,1278.14,1291.98,1084.6,1485.73,
13.000000,837.024,1283.29,1168.88,971.048,1391.01,
14.000000,777.83,1278.02,1079.53,999.87,1408.13,
15.000000,860.05,1366.49,1253.28,1216,1602.86,
16.000000,1179,1607.2,1573.22,1709.49,1808.5,
17.000000,1549.1,1753.46,1998.97,2387.35,2210.12,
18.000000,1969.8,1803.84,2818.71,2763.03,2520.4,
19.000000,2114.42,1816.96,2782.84,2957.84,2904.46,
20.000000,2049.28,1756.83,2967.1,2731.58,2899.95,
21.000000,2102.42,1834.61,2753.08,2598.4,2694.17,
22.000000,1780.44,1803.44,2521.43,2336.5,2586.19,
23.000000,1472.8,1790.56,2307,2141.72,2185.29,
24.000000,1339.17,1677.6,2011.7,1873.74,2128.08,
25.000000,1269.95,1593.95,1866.67,1714.16,1763.3,
26.000000,1191.97,1426.58,1636.57,1454.82,1778.03,
27.000000,1112.1,1548.16,1555.37,1401.19,1606.92,
28.000000,1095.6,1426.85,1436.97,1250.58,1609.67,
29.000000,1056.11,1431.06,1337.1,1114.16,1475.6,
30.000000,1021.02,1344.72,1254.81,1116.18,1510.68,
31.000000,1002.4,1433.13,1233.4,1096.96,1644.12,
32.000000,971.124,1442.66,1189.49,1047.94,1590.7,
33.000000,1055.54,1581.47,1263.79,1123.03,1799.63,
34.000000,1124.91,1739.47,1341.17,1174.05,1957.73,
35.000000,1341.48,1808.5,1480.36,1330.8,2137,
36.000000,1568.04,1856.3,1599.94,1558.18,2244.42,
37.000000,1652.56,1835.07,1717.85,1752.2,2180.48,
38.000000,1653.5,1788.64,1762.61,1901.4,2281.32,
39.000000,1584.77,1712.72,1665.55,1914.08,2121.51,
40.000000,1590.44,1652.8,1784.27,1923.93,2034.73,
41.000000,1483.11,1557.45,1701.97,1822.4,1897.38,
42.000000,1407.86,1496.27,1698.55,1764.96,1778.97,
43.000000,1297.63,1421.23,1638.73,1601.78,1862.34,
44.000000,1241.71,1367.1,1531.14,1556.16,1691.03,
45.000000,1187.66,1330.88,1466.55,1390.03,1645.47,
46.000000,1109.99,1296.68,1394.38,1260.84,1568.81,
47.000000,1104.06,1250.28,1294.27,1211.3,1663.51,
48.000000,1057.18,1109.39,1268.66,1161.97,1716.9,
49.000000,1088.31,1266.97,1233.26,1173.58,1687.21,
50.000000,1078.15,1381.16,1193.57,1150.17,1699.57,
51.000000,1127.51,1399.95,1125.59,1164.98,1783.91,
52.000000,1141.54,1349.34,1177.12,1163.97,1783.73,
53.000000,1184.12,1374.3,1221.73,1293.26,1758.87,
54.000000,1246.96,1312.13,1272.35,1314.8,1794.58,
55.000000,1274.18,1369.31,1285.63,1354.22,1710.87,
56.000000,1247.06,1278.24,1309,1526.81,1630.7,
57.000000,1190.52,1233.23,1344.24,1568.86,1596.08,
58.000000,1166.5,1243.92,1351.98,1632.16,1560.87,
59.000000,1212,1198.08,1399.86,1497.94,1510.99,
60.000000,1153.08,1155.24,1403.98,1494.56,1534.44,
61.000000,1122.33,1137.94,1416.52,1456.42,1592,
62.000000,1178.12,1135.86,1376.5,1452.02,1561.69,
63.000000,1123,1061.25,1371.09,1432.73,1498.8,
64.000000,1063.04,1062.95,1335.5,1338.1,1521.75,
65.000000,1038.49,1073.3,1290.4,1268.93,1702.7,
66.000000,1056.57,1104.08,1329.81,1267.27,1708.45,
67.000000,1048.03,1103.98,1248.58,1262.07,1581.08,
68.000000,1031.64,1086.16,1264.46,1189.17,1550.31,
69.000000,1050.13,1063.18,1158.45,1223.01,1573.68,
70.000000,992.9,1093.86,1146.98,1290.87,1655.84,
71.000000,1028.05,1104.41,1133.81,1174.13,1573.02,
72.000000,1000.99,1111.48,1121.82,1221.12,1500.86,
73.000000,996.9,1090.85,1128.8,1248.36,1493.86,
74.000000,1041.94,1079.2,1117.96,1249.06,1457.48,
75.000000,1001.14,1042.91,1101.03,1253.12,1418.2,
76.000000,1001.98,1082.7,1105.96,1249.21,1444.33,
77.000000,1027.88,1063.92,1135.63,1256.14,1405.09,
78.000000,980.078,1034.8,1152.84,1355.21,1433.89,
79.000000,1002.2,1032,1212,1318.17,1419.94,
80.000000,1041.88,986,1206.82,1353.05,1501.08,
81.000000,1048.96,1024.38,1223.12,1345.24,1558.31,
82.000000,1007.99,968.902,1235.17,1322.25,1519.04,
83.000000,936.918,999.316,1243.77,1312,1462.4,
84.000000,985.8,960.839,1246.92,1314.9,1484.04,
85.000000,974.924,981.2,1261.11,1311.75,1444.99,
86.000000,925.104,1016.14,1174,1289.08,1438.86,
87.000000,956.192,920.22,1205.17,1190.83,1368.02,
88.000000,945.412,928.814,1228.07,1264.5,1413.52,
89.000000,930.128,945.112,1204.22,1187.26,1360.98,
90.000000,909.068,996.344,1156.78,1270.14,1356.58,
91.000000,906.448,978.26,1157.62,1229.92,1279.92,
92.000000,896.36,965.748,1169.89,1216.18,1339.59,
93.000000,912.468,914.048,1131.79,1208.14,1311.88,
94.000000,877.016,897.181,1136.42,1179.77,1256.79,
