Frame number,1000000000,1000000001,
0.000000,1189.79,911.116,
1.000000,1074.99,1257.43,
2.000000,1126.05,1671.83,
3.000000,1238.91,2092.42,
4.000000,1250.19,2460.6,
5.000000,1257.87,2428.34,
6.000000,1232.34,2205.42,
7.000000,1134.29,2223.15,
8.000000,1032.87,2035.16,
9.000000,972.975,1983.66,
10.000000,921.624,1882.26,
11.000000,896.017,1878.44,
12.000000,845.994,1896.21,
13.000000,892.218,1798.23,
14.000000,824,1812.02,
15.000000,818.186,1672.76,
16.000000,858.088,1635.03,
17.000000,867.154,1725,
18.000000,962.9,1811.64,
19.000000,1009.08,1812,
20.000000,966.924,1828.23,
21.000000,993.068,2027.73,
22.000000,1028.52,2017,
23.000000,970.924,2096.16,
24.000000,978.464,2130.32,
25.000000,922.56,2029.32,
26.000000,895,1863.23,
27.000000,895.074,1888.06,
28.000000,885.005,1797.73,
29.000000,865.512,1642.02,
30.000000,822.944,1728,
31.000000,782.5,1594.9,
32.000000,783.5,1470.04,
33.000000,812.512,1484.87,
34.000000,855.072,1511.9,
35.000000,853.06,1533.23,
36.000000,850.894,1561,
37.000000,909.1,1523,
38.000000,909.9,1545.99,
39.000000,862.98,1564.04,
40.000000,835.976,1670.96,
41.000000,820.1,1747.13,
42.000000,808.948,1727.62,
43.000000,785.98,1691.02,
44.000000,785.082,1655.9,
45.000000,761.976,1562.97,
46.000000,748.48,1495.92,
47.000000,752.963,1447.88,
48.000000,739.96,1382.92,
49.000000,762.035,1363.92,
50.000000,784.08,1329.95,
51.000000,769.002,1290.94,
52.000000,793.012,1345.04,
53.000000,769.894,1331.88,
54.000000,796.013,1357.92,
55.000000,797.493,1342.06,
56.000000,802.032,1351.86,
57.000000,768.928,1464,
58.000000,759.064,1392.82,
59.000000,782.02,1384.1,
60.000000,753.978,1313.96,
61.000000,758.964,1299.97,
62.000000,756.952,1260.98,
63.000000,753.989,1225.01,
64.000000,716.02,1182.03,
65.000000,726.076,1121.92,
66.000000,734.002,1121.94,
67.000000,714.513,1097.04,
68.000000,749.544,1125.48,
69.000000,743,1128.11,
70.000000,760.064,1113.4,
71.000000,783,1141,
72.000000,817.468,1163,
73.000000,748.104,1191.96,
74.000000,754.944,1208.94,
75.000000,740.48,1223.09,
76.000000,728.56,1229.07,
77.000000,727.024,1180.72,
78.000000,717,1093.83,
79.000000,707.043,1078.93,
80.000000,697.92,1072.9,
81.000000,702,1012.94,
82.000000,710.984,1002.05,
83.000000,686.48,992.552,
84.000000,698,1007.95,
85.000000,687.92,1001.54,
86.000000,683.1,999.98,
87.000000,724.156,1008.03,
88.000000,751,1002.97,
89.000000,736.075,1013.88,
90.000000,714,1022,
91.000000,736.176,1023.98,
92.000000,701.088,988.968,
93.000000,691.059,972.044,
94.000000,703.924,939.072,
95.000000,689,912.5,
