Time [ms],1000000000,1000000001,1000000002,1000000003,
0,748.756,651.149,658.056,614.119,
1000000000,711.072,670.908,661.512,655.054,
2000000000,762.944,722.984,746,787.094,
3000000000,776.028,784.066,835.5,846.145,
4000000000,840.108,895.06,825.82,883.2,
5000000000,792.886,851.976,834.93,845.911,
6000000000,765.052,802.018,739.168,768.992,
7000000000,726.96,736.974,661.057,668.026,
8000000000,664.984,687.96,645.776,621.125,
9000000000,627.977,623,603.914,612.972,
10000000000,598.106,620.796,595.857,582.05,
11000000000,578.408,550.202,584.964,543.057,
12000000000,539.48,573.146,552.11,515.946,
13000000000,501.562,519.041,540.569,505.04,
14000000000,501.918,525.941,511.588,494.04,
15000000000,494.97,510.023,531,497.031,
16000000000,494.012,494.976,508.016,511.005,
17000000000,501.07,509.076,524.032,493.024,
18000000000,523.034,541.068,509.949,515.047,
19000000000,539.88,568.891,562.488,540.182,
20000000000,595.105,602.1,578.864,537.032,
21000000000,611.036,608.043,631.96,610.904,
22000000000,635.94,632.934,576.965,656.236,
23000000000,654.892,638.908,607.926,593.032,
24000000000,607.1,607.838,588.97,633.135,
25000000000,661.08,630.964,588.102,593.888,
26000000000,592.031,595.924,591.048,592.955,
27000000000,578.048,598.044,566.1,565.883,
28000000000,562.064,564.96,527.913,524.652,
29000000000,544.484,555.028,509.042,519.54,
30000000000,537.574,517.04,501.023,503.006,
31000000000,527.492,521.08,496.056,487.944,
32000000000,511.475,503.058,498.971,483.568,
33000000000,508.515,512.976,482.878,476.5,
34000000000,498.52,486.93,474.994,490.982,
35000000000,490.502,463.067,462.08,466.56,
36000000000,493.02,491,475.936,491.003,
37000000000,495.504,492.509,508.986,517.963,
38000000000,506.99,526.077,529.972,496.977,
39000000000,499.04,505.956,561.102,535.071,
40000000000,514.47,541.949,570.928,574.914,
41000000000,519.06,523.037,570.073,546.012,
42000000000,514.48,547.032,557.884,533.52,
43000000000,510.476,526.58,570.887,540.99,
44000000000,510,513.952,536.987,524.592,
45000000000,515.6,516.008,547.06,521,
46000000000,505.5,508.04,530.904,503.902,
47000000000,519.465,499.95,498.964,496.003,
48000000000,499.96,505.132,491.953,507.04,
49000000000,490.985,493.941,492.978,495.428,
50000000000,485.464,482,489.035,490.08,
51000000000,473.944,487.012,481.928,479.008,
52000000000,472.01,481.095,470.032,490.02,
53000000000,478.996,460.045,464.025,476.963,
54000000000,458,478.996,475.028,468.96,
55000000000,467.964,476.947,487.04,468.029,
56000000000,469.047,466.033,469.96,466.006,
57000000000,472.039,480.929,490.056,470.06,
58000000000,461,483.99,484.02,468.059,
59000000000,473.936,494.997,492.968,470.958,
60000000000,477.984,501.027,486.976,491.048,
61000000000,464.066,488.527,503.01,493.068,
62000000000,481.96,488.968,493.989,472.064,
63000000000,477.023,482.047,488.96,481.09,
64000000000,460.017,485.006,475.936,472.032,
65000000000,476.008,479.044,480.952,466.946,
66000000000,463.014,457.028,486.504,478,
67000000000,458,471,481.544,454.01,
68000000000,440.992,466.984,472.02,471.077,
69000000000,442.948,454.965,478.984,469,
70000000000,442.968,461.985,471.48,471.031,
71000000000,447.988,458.016,466.034,453.016,
72000000000,441.98,468.032,462.546,471.032,
73000000000,448.008,441.989,452.536,456.048,
74000000000,437.946,460.06,463,436.973,
75000000000,447.524,454.012,452.003,447.947,
76000000000,448.52,460.064,467.05,458.024,
77000000000,450.964,462,467.012,455.05,
78000000000,465.52,465.972,470.988,454.016,
79000000000,445.516,461.936,470.496,442.05,
80000000000,452,458.994,479.96,442.07,
81000000000,458.504,456.98,470.054,456.008,
82000000000,456.996,454.988,464.056,451.04,
83000000000,440.98,450.05,467.993,443.05,
84000000000,440.034,459.016,461.016,447.04,
85000000000,450.962,443.996,463.996,446,
86000000000,437.016,434.016,464.01,445.98,
87000000000,435.021,440.494,471.96,442.96,
88000000000,442.016,430.992,462.97,437.94,
89000000000,440.017,450.004,460.02,442.028,
90000000000,431.024,441.966,472.044,442.02,
91000000000,436,455,459,442.008,
92000000000,431.03,444.022,461.004,439.024,
93000000000,440.016,446.05,465.075,421.96,
94000000000,431.984,440.012,459.06,448.966,
