Frame number,1000000000,1000000001,1000000002,
0.000000,2121.63,4439.12,3813.54,
1.000000,3033.8,5688.35,3711.33,
2.000000,2728.38,7948.53,5359.72,
3.000000,3578.69,9370.79,5767.92,
4.000000,3651.89,7837.86,5029.05,
5.000000,3779.77,5604.57,3726.99,
6.000000,3567.41,4309.86,2867.36,
7.000000,3505.88,3482.24,2365.48,
8.000000,3339.92,2688.33,1869.57,
9.000000,2971.16,2049.4,1632.92,
10.000000,2803.45,1799.52,1494.74,
11.000000,2526.8,1544.58,1281.06,
12.000000,2387.78,1365.62,1166.32,
13.000000,2144.74,1280.24,1062.98,
14.000000,1971.87,1214.29,1008.1,
15.000000,1756.11,1234.72,1021.95,
16.000000,1688.03,1543.78,1040.96,
17.000000,1819.87,2244,1385.1,
18.000000,2129.38,3298.18,1999.49,
19.000000,2429.12,3398.54,2972.49,
20.000000,2507.23,3057.29,3010.38,
21.000000,2486.82,3006,2535.68,
22.000000,2376.17,2418.1,2063.77,
23.000000,2488.3,1920.22,1588.07,
24.000000,2397.91,1563.85,1509.56,
25.000000,2306.72,1394.87,1244.16,
26.000000,2079.23,1191.06,1091.13,
27.000000,1926.32,1064.07,966.1,
28.000000,1750.44,933.001,884.05,
29.000000,1715.87,956.092,805.964,
30.000000,1560.56,923.108,786.924,
31.000000,1413.24,921.994,764.834,
32.000000,1299.87,1035.06,777.032,
33.000000,1177.63,1557.45,962.022,
34.000000,1236.2,2270.28,1294.27,
35.000000,1534.01,2593.8,1745.3,
36.000000,1580.4,2659.1,1945.55,
37.000000,1590.92,2296.07,1774.02,
38.000000,1491.19,2030.54,1546.98,
39.000000,1494.65,1825.58,1395.2,
40.000000,1523.82,1522.83,1259.2,
41.000000,4466.49,1370.94,1115.93,
42.000000,3718.41,1167.42,982.18,
43.000000,2502.55,982.588,885.496,
44.000000,1754.92,952.464,797.452,
45.000000,1287.52,879.008,742.463,
46.000000,1043.76,832.488,699,
47.000000,950.42,796.04,668.512,
48.000000,1083.08,840.984,678.464,
49.000000,1289.71,1023.17,689.973,
50.000000,1748,1306.71,814.532,
51.000000,2083.35,1753.27,982.516,
52.000000,2179.75,1969.26,1202.13,
53.000000,1836.91,1776.62,1249.54,
54.000000,1695.06,1599.17,1182.04,
55.000000,1359.77,1463.24,1124.99,
56.000000,1157.28,1307.21,1060.93,
57.000000,975.088,1172.14,965.07,
58.000000,893.133,1031.1,870.062,
59.000000,845.04,911.04,814.088,
60.000000,807.036,843,772.972,
61.000000,769.492,808.044,722.912,
62.000000,769.54,770.084,710.041,
63.000000,906.272,774.976,657.052,
64.000000,1151.69,752.512,640.488,
65.000000,1552.38,840.932,663.04,
66.000000,2158.7,1003.42,705.941,
67.000000,2254.55,1312.55,809.984,
68.000000,2168.62,1599.28,970.956,
69.000000,1819.34,1600.88,1034.63,
70.000000,1730.4,1506.92,1048.46,
71.000000,1401.51,1491.18,989.49,
72.000000,1192.89,1379.44,946.918,
73.000000,1008.99,1183.44,881.908,
74.000000,890.056,1080.51,841.12,
75.000000,825.584,989.557,782.07,
76.000000,775.484,907.501,762.9,
77.000000,781.05,860.52,742.44,
78.000000,786.4,813,700.002,
79.000000,829.558,783.92,676.502,
80.000000,1075.34,787.084,650.456,
81.000000,1384.83,810.96,646.49,
82.000000,1805.21,1011.1,645.063,
83.000000,2038.05,1259.82,733.5,
84.000000,1909.61,1457.69,859.034,
85.000000,1765.78,1559.68,964.064,
86.000000,1567.76,1459.15,952.556,
87.000000,1378.3,1410.52,915.4,
88.000000,1277,1317.56,905.12,
89.000000,1146.35,1187.04,876.04,
90.000000,1038.19,1093.05,858.088,
91.000000,951.046,1030.92,798.008,
92.000000,888.992,939.957,777.172,
93.000000,846.14,882.005,770.948,
94.000000,814.13,817.03,708.888,
