Frame number,1000000000,1000000001,
0.000000,515.045,591.955,
1.000000,531.93,561.1,
2.000000,562.057,596.947,
3.000000,720.115,694.081,
4.000000,826.037,807.015,
5.000000,854.97,791.006,
6.000000,810.547,833.138,
7.000000,782.125,916.848,
8.000000,757.064,782.168,
9.000000,658.036,652.931,
10.000000,695.461,656.022,
11.000000,670,692.082,
12.000000,623.003,620.61,
13.000000,585.583,590.538,
14.000000,514.963,599.548,
15.000000,515.018,579,
16.000000,519.016,541.956,
17.000000,535.035,570.92,
18.000000,517.934,518.982,
19.000000,548.049,507.02,
20.000000,538.98,535.012,
21.000000,540.497,577.964,
22.000000,574.001,599.99,
23.000000,639.043,639.152,
24.000000,691.975,672.08,
25.000000,697.044,675,
26.000000,739.555,652.941,
27.000000,674.951,665.022,
28.000000,644.02,638.023,
29.000000,663.032,617.068,
30.000000,645.044,614.061,
31.000000,611.975,583.056,
32.000000,570.963,569.922,
33.000000,571.05,578.009,
34.000000,550.966,566.992,
35.000000,539.021,535,
36.000000,516.988,547.04,
37.000000,503.968,519,
38.000000,493.03,526.98,
39.000000,492.035,529.08,
40.000000,495.032,538.97,
41.000000,520.984,550.94,
42.000000,569.979,562.984,
43.000000,601.535,602.96,
44.000000,623.536,568.992,
45.000000,629.944,579.504,
46.000000,607,602.56,
47.000000,608.02,567.512,
48.000000,577.068,582.976,
49.000000,560.014,560.95,
50.000000,572.981,553.492,
51.000000,549.48,556.008,
52.000000,560.06,537.512,
53.000000,542.008,530.042,
54.000000,542.987,528.018,
55.000000,524.994,526.988,
56.000000,519.974,528.968,
57.000000,516.954,505.04,
58.000000,544.032,507.936,
59.000000,532.056,520.96,
60.000000,522,537.04,
61.000000,551.962,532,
62.000000,556.94,545.995,
63.000000,591.044,543.034,
64.000000,564.024,551.004,
65.000000,560.016,545.008,
66.000000,538.5,522.98,
67.000000,552.476,531.024,
68.000000,546.472,516,
69.000000,539.96,525.004,
70.000000,522.501,523.032,
71.000000,521.52,499.5,
72.000000,531.46,493.008,
73.000000,500,501.032,
74.000000,508.994,492.984,
75.000000,515.476,510.968,
76.000000,505.536,514.964,
77.000000,511.004,505.025,
78.000000,515.954,512.016,
79.000000,524.03,521.976,
80.000000,500.064,508.98,
81.000000,529.496,514.525,
82.000000,505.028,522.516,
83.000000,516,522.02,
84.000000,520.036,508,
85.000000,511.024,516.48,
86.000000,511,503.995,
87.000000,507.984,498.992,
88.000000,489.032,498.991,
89.000000,491,487.976,
90.000000,489.016,501.974,
91.000000,491.02,492.984,
92.000000,489,478.976,
93.000000,498.496,483.012,
94.000000,483.984,479.036,
95.000000,480.98,477,
