Frame number,1000000000,1000000001,1000000002,
0.000000,7345.21,3135.53,2756.04,
1.000000,4108.52,1617.96,1725.1,
2.000000,1258,1167.27,1001.31,
3.000000,967.19,1216.52,1038.34,
4.000000,760.06,1130.15,1141.94,
5.000000,651.06,1130.07,1195.11,
6.000000,632,1063.03,1134.16,
7.000000,625.992,1053.78,1113.85,
8.000000,620.02,979.082,1022.99,
9.000000,658.038,964.986,941.994,
10.000000,666.032,826.576,918.029,
11.000000,606.976,799.036,829.012,
12.000000,580.022,761.94,829.545,
13.000000,552.984,776.9,789.068,
14.000000,549.004,808.95,772.928,
15.000000,575.012,760.024,831.928,
16.000000,597.012,868.088,833.136,
17.000000,636.98,904.992,873.488,
18.000000,693.992,951.864,859.94,
19.000000,798.516,1086.77,845.94,
20.000000,835.944,1002.61,855.018,
21.000000,913.92,1048.76,855.032,
22.000000,879.944,1067.09,985.904,
23.000000,844.118,1094.85,1125.96,
24.000000,797.06,1036.04,1224.74,
25.000000,727.945,1054.46,1496.07,
26.000000,709.94,1040.2,1588.34,
27.000000,684.008,858.087,1505.18,
28.000000,664.031,862.056,1476.24,
29.000000,674.504,763.968,1566.17,
30.000000,707.055,806.88,1500.12,
31.000000,699.872,803.876,1488.97,
32.000000,695,832.064,1535,
33.000000,715.028,959.162,1655.87,
34.000000,734.004,1045.94,1775.66,
35.000000,794.072,1090.02,1876.02,
36.000000,812.172,1219.14,1780.84,
37.000000,824.928,1105.48,1749.71,
38.000000,883.94,831.879,1876,
39.000000,886.6,1171.88,1849.18,
40.000000,909.499,1054.04,1745.94,
41.000000,862.864,1057.64,1702.46,
42.000000,858.918,951.152,1558.47,
43.000000,847.988,1034.89,1500.16,
44.000000,764.076,1056,1350.84,
45.000000,800.13,1032.84,1355.84,
46.000000,803.026,978.172,1344.14,
47.000000,807.824,1060.85,1276.04,
48.000000,771.016,990.744,1298.82,
49.000000,769.042,994.92,1162.72,
50.000000,788.004,945.972,1186.41,
51.000000,741.062,951.084,1186,
52.000000,794.096,973.088,1293.94,
53.000000,820.997,995.054,1342.45,
54.000000,837.064,958.5,1352.09,
55.000000,838.91,950.952,1302.3,
56.000000,819.96,963.076,1298.18,
57.000000,830,1014.56,1279.3,
58.000000,818.949,924.2,1330,
59.000000,838.078,944.824,1275.17,
60.000000,853.023,980.188,1265.5,
61.000000,853.59,948,1331.89,
62.000000,855.436,958.04,1224.16,
63.000000,857.014,998.936,1171.07,
64.000000,829.9,968.02,1216.9,
65.000000,844.46,1018.41,1210.92,
66.000000,803.568,996.62,1161.21,
67.000000,828.008,1007.11,1116.12,
68.000000,808.168,1053.11,1195.18,
69.000000,816.893,985.45,1124.94,
70.000000,818.997,970.88,1152.1,
71.000000,823.1,934.7,1144.86,
72.000000,828.896,1017.01,1248.4,
73.000000,815.46,946.247,1209.41,
74.000000,831.066,968.1,1204.17,
75.000000,802.088,993.932,1250.05,
76.000000,811,954.076,1245.84,
77.000000,804.992,992.016,1238.17,
78.000000,821.128,931.842,1220.86,
79.000000,826.874,979.26,1228.96,
80.000000,840.061,918.964,1183.05,
81.000000,827.928,937.94,1221.15,
82.000000,827.014,942.2,1215.89,
83.000000,840.956,945.884,1245.79,
84.000000,827.932,908.98,1251.18,
85.000000,809.1,899.892,1229.82,
86.000000,809.058,965.188,1225.11,
87.000000,830.93,925.732,1246.92,
88.000000,811.916,934.159,1266.84,
89.000000,810.036,974.644,1246.96,
90.000000,821.079,955.12,1185.09,
91.000000,793.84,912.8,1193.22,
92.000000,799.488,850.82,1168.96,
93.000000,819.952,896.984,1122.05,
94.000000,782.994,883.944,1120.22,
95.000000,810.164,868.24,1061.86,
