Frame number,1000000000,1000000001,1000000002,1000000003,1000000004,1000000005,
0.000000,653.047,719.11,704.588,668.955,609.066,621.03,
1.000000,580.989,684.02,667.104,598.044,592.019,597.99,
2.000000,580,705.076,704.004,604.108,637.964,642.88,
3.000000,617.92,731.072,703.124,673,686.036,637,
4.000000,625.89,757.902,771.132,632.894,703.948,640.932,
5.000000,620.176,700.012,683,649.954,672.092,637,
6.000000,588.852,647.456,692,619.13,657.032,624.024,
7.000000,607.866,689.904,673.96,635,591.889,622.05,
8.000000,593.032,610.024,582.43,625.115,557.504,564,
9.000000,548.064,589,614.991,568.019,574.015,556,
10.000000,510.01,548.942,531.06,551,530.522,516.02,
11.000000,495.035,513,547.966,537.953,509.512,506.1,
12.000000,500.956,525.004,533.448,576.083,491.996,489.048,
13.000000,497.012,509.008,511.972,532.997,501.005,488.968,
14.000000,499.975,531.988,508.018,544.017,515.982,492.016,
15.000000,517,557,542.438,541.971,526.492,509.04,
16.000000,543.98,559.998,547.983,571.08,534.12,509.96,
17.000000,544.957,585.04,582.923,611.072,572.567,523.016,
18.000000,544.915,589.062,597.995,633.975,593.02,534.064,
19.000000,574.048,629.076,628.04,626.075,613.497,582.96,
20.000000,571.92,604.128,644.018,635,575.008,580.97,
21.000000,557.93,612.98,611.544,697.896,626.492,575.035,
22.000000,590.96,620.96,622.06,670.926,629.072,587.959,
23.000000,588.058,608.484,604,641.07,579.48,533.956,
24.000000,539.05,566.044,584.069,598.923,580.056,558.02,
25.000000,538.086,537.98,586,595.008,544.984,500.976,
26.000000,517.988,534.96,525.04,574.933,515.992,518.056,
27.000000,537.02,527.096,524.962,550.925,483.976,485.04,
28.000000,491.962,506.012,497.951,523.9,471.008,468.048,
29.000000,493.98,482.05,487.02,506.008,482.044,478.96,
30.000000,493.008,487,493.046,499.03,464.036,475.024,
31.000000,496.068,488.5,484.978,519.005,474.526,442.008,
32.000000,501.044,508,479.994,528.974,486.964,475.037,
33.000000,512.956,510.024,511.07,532.036,492.941,474.008,
34.000000,511.968,535.08,519.018,518.984,541,481.024,
35.000000,541.928,554.108,542,571.999,525.079,509.016,
36.000000,549.936,533.05,513.97,563.05,559.08,513.04,
37.000000,533.988,565.937,575.44,591.1,546.02,516.038,
38.000000,526.022,584.023,583.025,537.97,552.057,507.038,
39.000000,555.064,582.094,589.11,605.12,571.066,518.003,
40.000000,533.004,551.974,607.162,607.932,569.071,535.054,
41.000000,551.448,569.888,582.032,531.012,572.986,524.99,
42.000000,521.016,551.968,575.516,595.99,549.073,532.058,
43.000000,529.932,544.944,553.06,606.112,528,504.024,
44.000000,530.97,542.952,554.592,585.93,541.138,496.007,
45.000000,528.012,521,537.059,529.076,497.012,505.96,
46.000000,515.09,523.994,517.945,537.018,493.092,481.046,
47.000000,502.956,495.96,489.972,498.995,471.952,468.928,
48.000000,482.064,474.005,475.98,492.995,488.008,458.98,
49.000000,463.997,472.456,486.08,495.495,469.04,455.03,
50.000000,487,469.024,474.048,491.547,470,451.012,
51.000000,472.02,476.99,459.974,490.487,470.028,443.952,
52.000000,490,492,491.964,497.024,481.464,454.99,
53.000000,518.052,514.045,487.03,499.016,498.05,465,
54.000000,495.055,522.956,512.97,541.028,518.54,476,
55.000000,484.078,537.992,530.92,545.459,531.994,470.045,
56.000000,516.055,520.023,541,527,525.008,485.488,
57.000000,504.036,534.08,536.076,534.052,530.556,484.007,
58.000000,517.968,522.04,528.022,533.97,548.884,499.96,
59.000000,502.053,506.003,538.04,542.04,540,495.052,
60.000000,502.002,515.056,551,532.1,552.54,486.02,
61.000000,492.96,519.993,514.93,519.074,530.064,478.06,
62.000000,495.028,544.932,530.02,544.96,533.52,476.98,
63.000000,500.019,507,540,556.041,529.526,466.988,
64.000000,501.97,493.963,544.002,541.992,508,469.94,
65.000000,510.968,505,533.952,513.056,504.932,468.96,
66.000000,510.934,496.059,514.032,515.996,501.072,471.069,
67.000000,498.014,469.008,504.048,499.05,482,455.028,
68.000000,493.998,501.488,478.968,480.956,465,447.944,
69.000000,491.968,467.979,473.94,496.012,476.084,447.963,
70.000000,481.966,477.008,477.984,495,483.94,464.05,
71.000000,499.986,484.492,468.024,495.991,472.025,450,
72.000000,472.028,499.484,482.055,474.55,476.04,446.05,
73.000000,496,498.024,496.06,511.504,485.974,458.012,
74.000000,506.01,506.52,509.962,513.02,513.04,464.024,
75.000000,499.037,502.052,506.047,499.54,503,470.984,
76.000000,509,504.488,518.982,489.96,510.959,468.04,
77.000000,471.98,495.008,518.968,517.994,509.08,456.468,
78.000000,503.006,497.97,527.994,503.966,500.036,471.98,
79.000000,472.007,506.02,535.014,468.07,516.09,463.512,
80.000000,489.028,497.038,504.036,512.024,522.04,445.02,
81.000000,481.966,489.028,498.968,493.064,499.972,455.014,
82.000000,481.981,485.936,513.558,511.96,496.952,459.04,
83.000000,483.975,480.02,502.128,501.068,506.08,460.528,
84.000000,481.013,502.032,512.976,514.055,507.044,450.027,
85.000000,470.018,490.036,498.96,480,502.04,452.448,
86.000000,465.983,482.98,506.946,502.106,490.05,436,
87.000000,481.955,486.008,497.96,470.972,492.048,449.516,
88.000000,483.016,476.984,484.989,490.963,486.038,458.04,
89.000000,466.94,493.918,486.993,478.048,472.972,451.02,
90.000000,480.968,476.976,477.998,501.512,469.011,456.52,
91.000000,468.005,479.985,485.008,487.05,480,450.952,
92.000000,499,466.024,481,503.008,486.992,469.01,
93.000000,487.002,477,477.012,498.1,473.99,455.09,
94.000000,508.963,492.99,507.08,505.02,475.04,444.99,
