Time [ms],1000000000,
0,661,
1000000000,621.021,
2000000000,596.01,
3000000000,597.955,
4000000000,595.969,
5000000000,596.976,
6000000000,592.524,
7000000000,584.999,
8000000000,587.511,
9000000000,564.989,
10000000000,537,
11000000000,539.954,
12000000000,530.991,
13000000000,508.976,
14000000000,516.008,
15000000000,494.944,
16000000000,498.984,
17000000000,501.982,
18000000000,500.98,
19000000000,515.007,
20000000000,510.044,
21000000000,518.01,
22000000000,518.04,
23000000000,530.02,
24000000000,528.032,
25000000000,514.032,
26000000000,509.016,
27000000000,507.026,
28000000000,493.97,
29000000000,484,
30000000000,493.016,
31000000000,486,
32000000000,480.016,
33000000000,481.06,
34000000000,503.04,
35000000000,488.015,
36000000000,499.008,
37000000000,499.035,
38000000000,497.976,
39000000000,491.038,
40000000000,487.968,
41000000000,486.016,
42000000000,479.944,
43000000000,475.963,
44000000000,469.041,
45000000000,463.022,
46000000000,472.016,
47000000000,472.008,
48000000000,476.04,
49000000000,466.006,
50000000000,477.032,
51000000000,474.011,
52000000000,479.992,
53000000000,476.986,
54000000000,470.984,
55000000000,462.984,
56000000000,470.98,
57000000000,464.033,
58000000000,465.018,
59000000000,465.993,
60000000000,450.98,
61000000000,471.988,
62000000000,463.992,
63000000000,467.99,
64000000000,455.018,
65000000000,465.044,
66000000000,469.984,
67000000000,465.991,
68000000000,464.983,
69000000000,451.99,
70000000000,460.99,
71000000000,462.007,
72000000000,454.975,
73000000000,458.032,
74000000000,460.015,
75000000000,468.98,
76000000000,458,
77000000000,458,
78000000000,444.008,
79000000000,459.024,
80000000000,460.019,
81000000000,459.976,
82000000000,464.96,
83000000000,469,
84000000000,467.998,
85000000000,455.032,
86000000000,463.98,
87000000000,453.976,
88000000000,454.026,
89000000000,447.968,
90000000000,450.956,
91000000000,451.02,
92000000000,455.99,
93000000000,454.984,
94000000000,461.985,
