Frame number,1000000000,1000000001,1000000002,1000000003,
0.000000,544.5,617.349,679.096,565.258,
1.000000,545.704,581.825,639.54,543.534,
2.000000,553.997,637.75,656.78,562.952,
3.000000,545.121,643.312,673.61,621.72,
4.000000,541.92,745.39,704.342,694.86,
5.000000,521.792,752.326,683.11,683.588,
6.000000,534.724,558.69,657.912,709.952,
7.000000,569.114,550.344,620.532,711.536,
8.000000,525.23,537.792,590.186,703.938,
9.000000,515.973,501.952,546.01,626.076,
10.000000,509.02,513.855,518.865,606.123,
11.000000,521.024,451.93,526.024,536.28,
12.000000,515.115,453.031,515.093,543.094,
13.000000,493.892,475.954,497.08,528.85,
14.000000,485.968,507.227,528.99,538.88,
15.000000,484.19,509.807,543.081,519.944,
16.000000,486.943,486.122,547.178,519.97,
17.000000,495.08,495.142,567.008,508.073,
18.000000,479.974,506.855,570.872,483.856,
19.000000,516.89,523.146,595.272,506.05,
20.000000,492,524.165,627.17,532.764,
21.000000,526.022,537.057,605.92,563.47,
22.000000,538.246,532.081,726.832,531.38,
23.000000,581.062,540.236,696.56,568.114,
24.000000,553.456,501.06,660.942,593.056,
25.000000,587.046,512.116,615.852,625.87,
26.000000,593.204,509.951,601.22,594.81,
27.000000,614.662,512.092,557.104,560.908,
28.000000,584.416,493.935,556.872,534.14,
29.000000,549.92,490.085,533.944,510.04,
30.000000,517,484.913,518.04,500.98,
31.000000,511.034,479.88,520.21,484.034,
32.000000,498,485.94,532.56,498.92,
33.000000,498.858,497.042,529.032,508.088,
34.000000,485.076,506.236,554.54,519.502,
35.000000,491.423,484.023,547.6,517.965,
36.000000,544.997,521.065,542.498,532.988,
37.000000,596.508,524.368,559.856,556.128,
38.000000,640.4,544.458,558.472,549.632,
39.000000,705.478,535.97,557.022,578.848,
40.000000,783.656,510.18,570.952,555.638,
41.000000,852.34,524.7,563.406,511.048,
42.000000,747.366,497.874,558.5,494.04,
43.000000,792.516,477.924,530.55,502.2,
44.000000,560.968,478.951,536.535,475.063,
45.000000,600.264,483,515.944,485.48,
46.000000,479.796,480.004,536.584,487.036,
47.000000,478.904,474.98,528.588,480.496,
48.000000,568.52,481.144,522.904,472.552,
49.000000,513.512,479.033,545.008,484,
50.000000,553.04,481.11,528.012,487.048,
51.000000,572.56,494.996,532.035,495.03,
52.000000,579.144,511.9,495.48,500.48,
53.000000,751.48,511.109,493.46,490,
54.000000,671.1,505.082,510,514.102,
55.000000,787.5,482.898,489.408,496.944,
56.000000,804.204,483.909,510.016,479.08,
57.000000,839.908,495.975,498.01,476.052,
58.000000,858.612,497.091,498.5,482.01,
59.000000,833.336,468.944,492.944,478.984,
60.000000,738.8,481.95,471.512,472.968,
61.000000,692.68,480,480.96,483.052,
62.000000,605.136,475,479.496,474.056,
63.000000,547.868,492.99,485.984,494.016,
64.000000,560.192,471.953,483.464,473.997,
65.000000,550.084,509,494.024,477.94,
66.000000,536.22,497.038,491.414,488.056,
67.000000,554.5,499.858,488.484,485.008,
68.000000,592.5,479.18,473.48,478.004,
69.000000,620.88,490.853,480.012,475.054,
70.000000,577.556,505.144,489.476,484.974,
71.000000,699,498.574,475.052,479.066,
72.000000,678.448,467.056,483.972,480.076,
73.000000,725.312,479.532,472.06,466.044,
74.000000,736.92,473.542,459.55,469.024,
75.000000,668.896,481.036,472.94,463.074,
76.000000,587.95,465.494,458.015,475.08,
77.000000,546.568,458.029,473.036,466.964,
78.000000,555.06,464.479,480.009,469.054,
79.000000,546.152,465.504,498.96,477,
80.000000,511.088,478.536,488.04,458.021,
81.000000,485.9,468.48,485.972,479.994,
82.000000,483.096,464.976,478.966,480.942,
83.000000,516.384,475.501,483.005,471.955,
84.000000,544,466.518,470.998,463.032,
85.000000,563.784,459.436,468.052,463.975,
86.000000,583.56,475.972,488.98,458.998,
87.000000,693.16,475.937,459.96,464.466,
88.000000,693.892,470.002,470.036,460.019,
89.000000,679.856,477.574,476.028,459.98,
90.000000,584.492,460.474,471.024,465.936,
91.000000,507.852,482.546,471.024,461.066,
92.000000,559.732,469.984,484.04,460.98,
93.000000,506.044,493.016,468.958,466.044,
94.000000,491.112,471.952,468.036,466.953,
95.000000,459.524,474.058,473.51,448.957,
