Time [ms],1000000000,1000000001,1000000002,1000000003,
0,659.003,649.73,589.41,671.54,
1000000000,859.416,889.745,770.47,730.917,
2000000000,1214.1,1489.56,999.888,1265.48,
3000000000,1527.87,1958.33,1235.71,1533.44,
4000000000,2279.34,1682.29,1166.24,1746.74,
5000000000,2648.93,1943.29,1271.43,1391.64,
6000000000,1636.65,1344.7,1240.78,1217.02,
7000000000,1365.05,898.436,1289.6,1222.33,
8000000000,1208.44,938.751,986.032,1123.65,
9000000000,1192.49,926.882,981.064,975.912,
10000000000,949.412,856.69,904.44,910.916,
11000000000,1012.7,812.48,909.886,840.112,
12000000000,837.02,793.92,914,826.536,
13000000000,760.812,748.124,757.96,770.374,
14000000000,734.144,708.96,651.56,709.684,
15000000000,700.64,720.51,644.748,697.858,
16000000000,650.64,698.168,670.208,647.944,
17000000000,642.464,667.875,685.12,622.144,
18000000000,659.056,682.905,627.028,577.12,
19000000000,663.104,648.965,695.984,654.092,
20000000000,680.928,662.478,624.154,605.958,
21000000000,639.374,735.921,679.938,609.116,
22000000000,702.526,842.062,707.768,697.982,
23000000000,730.086,889.078,737.8,745.096,
24000000000,779.967,912.456,873.784,766.564,
25000000000,838.844,870.344,887.448,751.457,
26000000000,811.882,796.04,869.7,708.118,
27000000000,766.998,788.1,950.645,674.15,
28000000000,754.96,731.056,772.92,625.842,
29000000000,697.82,723.232,750.98,591.913,
30000000000,679.006,702.424,636.448,598.896,
31000000000,666.058,677.84,699.092,629.85,
32000000000,671.088,598.063,725.489,618.952,
33000000000,652.86,618.632,700.396,584.904,
34000000000,677.08,618.027,678.992,560.918,
35000000000,666.6,592.117,653.94,562.155,
36000000000,659.037,560.54,690.492,600.96,
37000000000,644.017,572.964,679.552,579.105,
38000000000,657.64,566.524,739.12,562.148,
39000000000,662.044,590.604,726.964,601.932,
40000000000,727.028,644.082,865.904,596.195,
41000000000,693.012,563.48,815.448,635.524,
42000000000,716.76,598.848,697.141,659.52,
43000000000,740.68,633.12,717.907,654.32,
44000000000,678.924,681.431,786.168,631.1,
45000000000,662.094,669.012,685.078,622.012,
46000000000,690.682,605.025,659.99,638.04,
47000000000,643.028,602.176,616.854,625.008,
48000000000,617.896,616.1,660.44,615.52,
49000000000,614.973,611.1,632.966,582.2,
50000000000,600.548,594.552,599,593.096,
51000000000,596.042,630.124,600.452,612.472,
52000000000,587.088,613.55,588.971,590.504,
53000000000,598.56,589.496,587.604,589.425,
54000000000,577.016,580.984,582.997,553.133,
55000000000,582.996,581.46,557.032,571.912,
56000000000,588.16,577.576,601.926,584.024,
57000000000,562.928,563.022,615.928,605.6,
58000000000,607.972,604.47,653.86,618.536,
59000000000,612.02,613.912,609.028,635.645,
60000000000,628.106,628.084,591.079,597.431,
61000000000,617.775,597.09,595.032,608.924,
62000000000,617.024,567.444,586.186,623.988,
63000000000,620.035,548.48,586.952,633.4,
64000000000,597.37,546.454,594.468,612.456,
65000000000,602.606,556.002,571.48,599.995,
66000000000,587.038,528,586.068,598.516,
67000000000,572.497,534.528,562.047,539.029,
68000000000,551.853,531.062,568.102,562.016,
69000000000,550.48,522.06,571.656,570.464,
70000000000,550.041,536.06,580.125,584.256,
71000000000,527.083,494.934,563.38,491,
72000000000,521.112,495.051,576.588,496.906,
73000000000,523,494.056,553.94,496.068,
74000000000,530.532,507.02,591.208,524.92,
75000000000,543.04,532.024,576.834,541,
76000000000,546.5,531.5,566.004,553.52,
77000000000,556.905,534.512,614.052,539.104,
78000000000,543.084,541.558,595.6,573.989,
79000000000,564.996,516.418,598.55,553.973,
80000000000,552.504,515.012,567.54,555.862,
81000000000,537,528.019,554.983,561.14,
82000000000,522.078,527.024,573.504,529.01,
83000000000,524.928,529.064,535.973,537.164,
84000000000,543.046,524,511.512,528.535,
85000000000,518.996,501.937,532,521.521,
86000000000,517.94,504.933,513.04,515.585,
87000000000,512.016,469.063,512.925,515.09,
88000000000,513.476,463.936,503.048,540.016,
89000000000,504.04,485.032,548.562,524.014,
90000000000,508.38,493.06,553.902,505.972,
91000000000,495.584,480.993,563.02,495.612,
92000000000,503.074,497.01,547.008,492.55,
93000000000,535.958,508.963,552.007,521.552,
94000000000,538.461,522.97,537.008,537.96,
