Frame number,1000000000,1000000001,1000000002,1000000003,1000000004,1000000005,1000000006,1000000007,
0.000000,560.942,568.035,509.904,566.944,537.062,528.046,507.464,548.096,
1.000000,509,516.061,531.134,628.005,523.06,537.03,512.064,529.076,
2.000000,510.04,506.04,487.992,581.128,505.97,546.528,508.54,548,
3.000000,570.078,537.926,519.92,629.13,559.35,574.58,515.92,546,
4.000000,542.02,522.956,503.062,616.048,550.6,552.047,508.018,578.09,
5.000000,521.952,507.968,486.024,579.608,528.03,549.544,501.056,547.926,
6.000000,504.036,499.98,464,538.982,501.984,541.968,534.968,529.062,
7.000000,485.008,494.04,485.08,513.536,493.052,499.988,494.948,507.019,
8.000000,481.97,484.016,463.97,532.067,472.946,488.512,499.04,490.985,
9.000000,474.016,485.48,460.019,486.44,481.984,499.98,481.084,508.475,
10.000000,474.968,464.49,444,499.06,466.965,487,485.04,513.485,
11.000000,478.02,478.47,441.996,506.926,473.056,488.952,481.02,523.514,
12.000000,493.068,470.968,446,482.01,466.944,471.985,467.988,500.011,
13.000000,499.04,495.005,449.502,487.056,472.54,476.944,478.997,501.497,
14.000000,505.023,511.99,459.024,481.984,522,493.924,477,528.992,
15.000000,550.5,547.02,471.964,526.04,531.136,530.085,551.1,585.52,
16.000000,599.968,612.017,490.98,562.084,550.02,550.09,582.914,617.082,
17.000000,619.04,674.046,494.528,585.07,549.898,569,632.096,707.985,
18.000000,609.082,674.901,510.044,594.008,560.064,614.858,637.037,717.939,
19.000000,631.024,703.6,544.074,613.08,546.909,612.13,623.904,706.936,
20.000000,642.102,660.024,545.996,583.976,521.056,582.52,607.622,619.003,
21.000000,591.952,635.158,528.524,557.004,537.48,624.916,627.921,621.115,
22.000000,580.94,586.084,531.884,533.5,549.932,567.915,581.884,635.908,
23.000000,576.998,588.096,506.015,535.96,505,564.108,536.148,605.975,
24.000000,520.956,554,495.092,509.016,523,536.913,537.08,591.5,
25.000000,520.08,516.076,479.472,497,468.484,522.003,517,535.022,
26.000000,500.538,508.969,476.55,481.926,467.008,507.968,509.072,536,
27.000000,494.956,514.03,485.007,459.96,468.95,482.954,512.948,520.55,
28.000000,489,517.013,458.016,451.952,455.98,466,492,499.966,
29.000000,480.952,484.54,437.98,438.02,440,461,491.975,509.52,
30.000000,475.024,480.997,452,437.994,452.896,455.02,475.964,508,
31.000000,483.068,514.947,447.012,492.05,452.988,486.984,521.052,501.52,
32.000000,499.992,511.007,460.968,536.948,495.104,507.964,651.043,543.496,
33.000000,511,535.965,475.98,659.18,493.944,534.016,758.848,560.088,
34.000000,529.08,582.11,473.016,772.504,526.916,524.088,919.242,592.944,
35.000000,580.984,624.176,485.988,790.688,606.928,534.124,1027.23,645.004,
36.000000,553.88,608.87,469.544,739.396,626.136,624.064,1026.99,743.948,
37.000000,500.962,566.052,493.512,732,530.044,597.024,953.136,792.504,
38.000000,514.952,582.876,529.92,647.82,497.068,651.296,890.318,754.164,
39.000000,467.976,582.99,537.128,582.88,491.02,693.104,764.85,714,
40.000000,488.06,527.976,541.088,567.936,494.952,663.888,709.904,684.104,
41.000000,480.016,482.492,493.432,573.88,546.862,613,741.24,679.944,
42.000000,502.088,504.96,491,601.04,565.064,539.096,562.92,580.804,
43.000000,470.021,486.034,483.952,562.968,522.96,645.064,636.072,553.012,
44.000000,486,474.952,449.008,558.92,549.58,566.92,602.964,557.012,
45.000000,482,534.024,470.024,547.082,541.932,604.1,552.49,514.54,
46.000000,480.047,509.02,481.082,552.53,516.01,544.14,561.92,506.064,
47.000000,457.036,535.012,497.04,532.96,515.044,542.912,558.892,524.916,
48.000000,497.52,520.09,519.003,517.068,512.976,590.05,547.07,550.984,
49.000000,528.972,500.97,515.44,552.08,562.052,569.088,528.028,576.94,
50.000000,549.048,524.086,524.924,570.96,546.938,564,543.934,649.544,
51.000000,591,518.503,527.11,592,514.008,592.119,579,750.1,
52.000000,607.088,541.1,577.498,620.2,516.958,583.916,616.068,781.888,
53.000000,601.984,550.964,592.548,663.206,538.048,654.104,713.1,894.264,
54.000000,565.848,554.081,586.938,663,508.944,540,641.928,744.128,
55.000000,566.037,533.13,559.368,634.008,545.09,627.12,625.934,726.01,
56.000000,555.09,496.942,569.099,610,535.028,630,609.928,674.02,
57.000000,545.56,508.03,552.54,592,514.086,639.088,605.588,578.504,
58.000000,501.994,512.078,533.5,590.192,521.082,617.04,570.424,580.492,
59.000000,479.972,474.998,503.028,587,490.502,598.88,547.472,526.512,
60.000000,493.047,454.984,503.156,531,511.6,559.026,545.04,524.002,
61.000000,499.959,458.988,541.92,520.04,489.512,517.104,500.472,492.467,
62.000000,485.04,438.04,511,511.02,486.072,514.956,487.016,490.524,
63.000000,491,442.02,526.98,536.872,501.952,484.944,484.472,485.994,
64.000000,476.984,435.99,495.044,552.884,497.56,486.972,463.082,478.034,
65.000000,474.984,444,520.052,546.86,481.528,467.96,475.94,484.992,
66.000000,476.025,442.022,493.078,569.1,485.488,497,462,500.527,
67.000000,489.96,442.986,503.052,595,512.04,493,477.86,482.54,
68.000000,492.956,454.988,514.042,600.052,490.476,489.04,511.512,501.48,
69.000000,507.024,456.508,541.036,598.932,499.036,494,527.14,538.012,
70.000000,499.96,442.993,489.98,623,511.948,479.04,531,555.506,
71.000000,527.932,460,484.982,554,482.94,486.032,525.492,568.048,
72.000000,550.946,454.001,484.036,599.164,507.04,490.912,497.06,576.96,
73.000000,538.05,455.022,552.077,602,497.008,491.9,570.976,613.08,
74.000000,490.044,460.024,542,620.144,505.925,480.104,568.06,568.02,
75.000000,514.062,445.516,533.99,566.08,518.011,483.982,531.936,548.016,
76.000000,490.036,453.984,514.964,511.972,508.96,525.032,498.948,540.029,
77.000000,478.512,438.01,504.05,585.026,488.048,510.036,489.9,512,
78.000000,474.968,437.026,470.072,539.5,504.102,533.008,479.908,479.992,
79.000000,469.98,431,512.038,555.224,504.04,531.964,462.04,487.024,
80.000000,463.976,430.02,522.093,534.88,505.064,514.968,455.92,483.008,
81.000000,469.016,425.988,499.944,562.05,496.02,506.856,466.876,473.492,
82.000000,469.996,428.002,496.04,575.034,500.038,475.944,460.02,457.014,
83.000000,461.464,428.992,510.078,577.036,545.112,480.896,479.024,466.022,
84.000000,486.04,437.496,515.994,580.064,533.468,515.966,473.08,449.972,
85.000000,491.05,438.03,526.99,561.92,511.968,482.08,452.992,474.5,
86.000000,513.93,440.508,540,577.92,507.1,520.015,465.048,468.996,
87.000000,500.036,445.016,528.912,591.108,491.03,508.596,471.44,473.5,
88.000000,513.04,437.016,532.04,613.04,506.964,530.848,549.912,480.488,
89.000000,515,452.052,529.11,604.96,513.5,504.064,540.016,507.512,
90.000000,539.58,434.024,534.116,575.4,491,496.932,478.08,504,
91.000000,540.938,447.003,570.95,566.208,515.008,508.024,513.036,526.9,
92.000000,528.05,434.036,553.86,485.904,522.012,483,507.884,549.938,
93.000000,502.068,436,546.924,536.18,536.024,508.04,529.856,544.942,
94.000000,497.996,440.024,529.96,504.096,510.09,523.98,517.028,539.539,
