type:genetic
1,238:1
1,241:1
1,243:1
1,244:1
1,254:1
1,286:1
1,288:1
1,294:1
1,300:1
1,304:1
1,311:1
1,313:1
1,314:1
1,317:1
1,325:1
1,333:1
1,349:1
1,350:1
1,354:1
1,356:1
1,358:1
1,363:1
1,365:1
1,366:1
1,368:1
1,371:1
1,374:1
1,378:1
1,379:1
1,383:1
1,388:1
1,390:1
1,391:1
1,394:1
1,398:1
1,402:1
1,404:1
1,406:1
1,407:1
1,409:1
1,410:1
1,419:1
1,426:1
1,427:1
1,429:1
1,433:1
1,434:1
1,440:1
1,445:1
1,448:1
1,451:1
1,455:1
1,456:1
1,458:1
1,459:1
1,464:1
1,466:1
1,473:1
1,476:1
1,479:1
1,485:1
1,487:1
1,489:1
1,494:1
1,502:1
1,504:1
1,506:1
1,514:1
1,516:1
1,519:1
2,106:1
2,108:1
2,127:1
2,148:1
2,163:1
2,177:1
2,180:1
2,202:1
2,203:1
2,236:1
2,241:1
2,250:1
2,254:1
2,263:1
2,264:1
2,268:1
2,285:1
2,293:1
2,294:1
2,300:1
2,301:1
2,306:1
2,307:1
2,310:1
2,311:1
2,327:1
2,330:1
2,336:1
2,352:1
2,365:1
