cid: 2, volume: 36.74722997886631, center: [0.6772894318510659 53.720689379611656 48.93391930934466]
cid: 3, volume: 310.6270702420673, center: [5.041538836517686 51.03222525531202 63.67145994333365]
cid: 4, volume: 164.6935926115938, center: [2.241717545356097 45.51765484727864 64.02452716035744]
cid: 5, volume: 54.273518063446964, center: [0.8990442820387542 26.427793763270337 63.178214330402625]
cid: 6, volume: 65.89824858265143, center: [1.016685782654725 62.67591097640424 59.41890139388676]
cid: 7, volume: 64.76847937618145, center: [1.034420030871792 33.66373509302272 55.71621425749368]
cid: 8, volume: 209.11136088701957, center: [3.051585518213947 53.33788550302836 31.58354391962039]
cid: 9, volume: 102.69007471440473, center: [1.2467458102789988 48.41338490480602 75.72545191702373]
cid: 10, volume: 42.39607601121631, center: [0.6261404040383597 26.544335732713886 68.03030179207573]
cid: 11, volume: 124.39353578606524, center: [2.316520823794795 51.027226017698375 57.93147077548996]
cid: 12, volume: 157.54334276538233, center: [2.2461971055594048 31.13063605719947 20.387505476750327]
cid: 13, volume: 14.582941994040393, center: [0.9592849962391298 49.030761103975536 41.45377623333333]
cid: 14, volume: 90.55992112914788, center: [2.5109843343438345 19.274405957895603 47.34360181634931]
cid: 15, volume: 299.299647408776, center: [2.900696430690475 22.145096727297112 57.18876963359988]
cid: 16, volume: 72.5133445942192, center: [1.8558623438082407 27.07228526488315 35.029644988806886]
cid: 17, volume: 104.74149774720551, center: [1.646505442616839 34.85907134071814 38.330188273531085]
cid: 18, volume: 104.86042082157077, center: [2.233236488645634 42.7339712083924 25.43911328390984]
cid: 19, volume: 174.504746246728, center: [2.273046273372904 59.63719099302325 64.55735855313058]
cid: 20, volume: 37.936460722518945, center: [0.8233407494437682 59.542337615595606 24.85256347241379]
cid: 21, volume: 201.35163028468617, center: [3.039109131782961 24.27017246093023 47.44324989736434]
cid: 22, volume: 153.20265055105025, center: [1.5440548351280157 41.206276573180666 20.346823071657287]
cid: 23, volume: 306.9701857053355, center: [3.0050320896914653 64.28080099749153 52.626703395050846]
cid: 24, volume: 72.39442151985394, center: [1.7075053181290332 41.79745484002053 42.094870076488704]
cid: 25, volume: 297.20362822308823, center: [4.670402206000215 46.25250284303006 43.43855040934827]
cid: 26, volume: 18.373614989433154, center: [0.6642952664918734 15.636933911893204 57.163012067475734]
cid: 27, volume: 140.0170546808017, center: [2.0144507674724355 49.67474481511837 25.87353775292494]
cid: 28, volume: 116.2919013449317, center: [2.197660338758696 21.83256228292215 42.521678656052664]
cid: 29, volume: 252.10205227006222, center: [2.3453139790033513 57.49183185892446 55.53712710557227]
cid: 30, volume: 220.03741834432813, center: [2.475491313137124 63.41751734884475 40.6653352961897]
cid: 31, volume: 161.2299580707055, center: [2.4941497822303456 41.80250593061036 76.46105490998524]
cid: 32, volume: 38.204037639840784, center: [0.49486661635432877 33.18635314470817 64.65808794385214]
cid: 33, volume: 133.14924713620775, center: [2.04063929048399 38.059341791314054 56.13297215419225]
cid: 34, volume: 75.30803684180289, center: [1.146302133375895 66.1502169711212 64.22657332876037]
cid: 35, volume: 171.45734246611815, center: [2.7842820389019494 36.62517093680423 73.95666951177388]
cid: 36, volume: 114.84995906825289, center: [2.2913711517873203 69.23911096968678 41.780670545055656]
cid: 37, volume: 223.81322595542522, center: [2.752593724096428 18.98223487119421 18.425997865927204]
cid: 38, volume: 155.52165050117287, center: [1.7885047368823686 62.72341949658765 69.42313120409099]
cid: 39, volume: 64.79821014477275, center: [1.587620621166499 42.033465399105296 47.109780321403996]
cid: 40, volume: 224.89839900900827, center: [3.9150737907432944 48.863020924747175 33.86150089942495]
cid: 41, volume: 270.1783595735822, center: [4.975145792660277 55.34465273047593 61.287672029215955]
cid: 42, volume: 190.38097667449063, center: [2.900365183295737 67.43751751766222 36.210924053033494]
cid: 43, volume: 119.23524743547196, center: [3.0942261686486625 44.88439645029298 34.84100795894527]
cid: 44, volume: 125.9989972899963, center: [1.7986938742299565 48.54629849380604 70.0014585916352]
cid: 45, volume: 129.7004779796151, center: [3.3021182809210257 29.000506142338107 48.77579843329513]
cid: 46, volume: 130.6221318059459, center: [1.7993469663263248 40.11173197398429 69.58079521218846]
cid: 47, volume: 75.20397915173328, center: [2.2952029870837114 22.588955627416485 13.128798442972919]
cid: 48, volume: 187.66061134838523, center: [4.418128584281403 50.76518754168251 43.23423073963878]
cid: 49, volume: 173.3452462716667, center: [3.013087801102009 26.462185227116027 40.70092185528685]
cid: 50, volume: 392.34208771529876, center: [5.377346906511585 40.58207141285947 36.91982468867124]
cid: 51, volume: 419.0700486788917, center: [5.225682621720616 44.834324678408 49.674357221432366]
cid: 52, volume: 340.80380036225284, center: [4.738803287989627 63.87573822309604 30.25889924632295]
cid: 53, volume: 359.29633842605125, center: [5.288658758214548 31.317147257885807 72.2054836022259]
cid: 54, volume: 156.6068235547559, center: [2.6174287754570114 44.290642597475085 58.774490048770765]
cid: 55, volume: 248.59382157628696, center: [3.221222624394262 56.74130739317706 28.58046514093763]
cid: 56, volume: 316.5434931917392, center: [3.523167359596396 29.801120511439844 56.70658513027614]
cid: 57, volume: 269.80672496619076, center: [5.540199852902633 33.61497346709091 28.738797590826447]
cid: 58, volume: 508.1137006098824, center: [4.82372798671111 39.67245113518329 63.784654338419]
cid: 59, volume: 402.3316259619809, center: [4.710814924186849 60.417396879593575 34.57830266482911]
cid: 60, volume: 240.1354179120576, center: [3.7881182141096668 68.17408699951096 59.43888175591185]
cid: 61, volume: 287.11003228633655, center: [3.8627074031947997 64.40153756598323 46.44515602541162]
cid: 62, volume: 249.5600715555047, center: [3.811843396771191 19.2724907498213 51.96452446309864]
cid: 63, volume: 343.0782041594885, center: [4.512669178587813 27.915365867970884 12.270707284804367]
cid: 64, volume: 50.319325840801966, center: [0.897573616037599 11.665656797725259 40.722469907237816]
cid: 65, volume: 110.73224761835564, center: [3.308931787876521 27.598477750020137 51.88360793149416]
cid: 66, volume: 20.558826480894865, center: [2.0889926141003534 29.566977406290675 62.58744098329718]
cid: 67, volume: 166.86393871875984, center: [3.0967055435539277 38.0938555338441 25.43847775539421]
cid: 68, volume: 281.6990324027171, center: [3.21588683082346 57.21926103012665 44.178327515572555]
cid: 69, volume: 225.38895669076499, center: [2.7427535591379484 19.568167955401663 62.85812958878117]
cid: 70, volume: 333.1183966813977, center: [4.244402595106353 54.6905980072337 68.58702986871347]
cid: 71, volume: 444.1479519856665, center: [5.168796031893242 37.2940256622063 43.43033493832586]
cid: 72, volume: 264.90114814862363, center: [5.01811108160912 22.993969940218857 35.13882891425926]
cid: 73, volume: 293.6359359921304, center: [6.449882815802269 31.546043544312255 41.83869202034121]
cid: 74, volume: 224.00647595126878, center: [4.192921992335632 43.238346317479596 71.5061390673701]
cid: 75, volume: 275.2177248498102, center: [3.981709019906632 45.47657638395809 29.449864607642866]
cid: 76, volume: 418.3416448484044, center: [4.072619253491705 53.256075380537986 38.01826668783313]
cid: 77, volume: 91.10994034808722, center: [1.6445319493907842 40.204831300440524 52.83267356882036]
cid: 78, volume: 263.07270588025773, center: [6.460933249657235 29.578411740549246 45.04308914951687]
cid: 79, volume: 326.50330066982997, center: [6.235789488562216 33.109949436728286 50.738655452199055]
cid: 80, volume: 241.28005250282325, center: [7.416331041827873 11.353478733879614 39.50576557136344]
cid: 81, volume: 373.7157611928394, center: [4.0175505515213406 32.972370420107396 66.9229831124821]
cid: 82, volume: 382.70931869171244, center: [6.310913121142081 38.28381887495436 29.956775318523984]
cid: 83, volume: 309.31891642404946, center: [4.314518035884274 54.02105818065168 74.20119576672434]
cid: 84, volume: 323.4410315049244, center: [6.199544608483546 69.2647632278794 54.84319309869933]
cid: 85, volume: 495.5375854957559, center: [8.540932320271507 62.12441664969252 60.43636698941353]
cid: 86, volume: 195.83657271099707, center: [6.010519814531626 51.04545089537726 47.49389783241233]
cid: 87, volume: 187.73493826986353, center: [5.161060354555309 70.12487985200728 50.31788790382453]
cid: 88, volume: 443.28575969651837, center: [6.829363703975585 57.43865906042254 48.47479286725353]
cid: 89, volume: 205.30582250733116, center: [9.288331290445138 35.67864058494678 57.812173037759756]
cid: 90, volume: 425.7743369962334, center: [4.920165041696667 50.25069298026674 19.545905085021996]
cid: 91, volume: 221.55368754248522, center: [4.866889138044041 70.08442078989533 46.13549571789452]
cid: 92, volume: 89.38555576979091, center: [5.882462025102558 40.06787911571595 32.9087774371362]
cid: 93, volume: 234.7690141813251, center: [7.727869422129695 60.92155081538657 38.34538683151396]
cid: 94, volume: 264.3957250825713, center: [7.538176699508539 29.018391930327223 31.36378918579782]
cid: 95, volume: 527.5576232686029, center: [9.947326999098907 18.43929076323368 24.411405477207023]
cid: 96, volume: 146.09699685772577, center: [7.491281220992468 42.37403199252137 40.82857241837607]
cid: 97, volume: 298.3185320452626, center: [8.749575739509131 45.84315240665238 22.793421156024518]
cid: 98, volume: 339.04968501536524, center: [6.782071818113349 60.322975662337775 70.73752529367327]
cid: 99, volume: 273.835244110314, center: [6.894845988613247 65.56199936114217 64.61114632643722]
cid: 100, volume: 630.3071595201903, center: [11.844693818775031 41.238606035319926 55.75073509350251]
cid: 101, volume: 229.84857197946235, center: [7.6848199539547775 34.99727870871168 37.16406404183159]
cid: 102, volume: 457.8241055376718, center: [12.264032530911551 38.089007043395675 52.29769351521527]
cid: 103, volume: 27.38203787260184, center: [10.31960922222615 24.746872358631922 11.081116636644952]
cid: 104, volume: 426.9932985084773, center: [10.015931891374263 33.13348654802256 60.41534252038713]
cid: 105, volume: 246.88430238228628, center: [6.678506353778698 47.84617364483382 75.4912882034682]
cid: 106, volume: 26.32659558761013, center: [7.2594611374235125 34.07823926916996 54.89046291343873]
cid: 107, volume: 354.52455006714507, center: [9.223291463414395 24.889670965570883 38.739470436366304]
cid: 108, volume: 354.45022314566677, center: [9.765991171681458 40.00896987350277 46.96007816239306]
cid: 109, volume: 103.07657470609183, center: [8.195474655035891 21.935026829550043 66.12543857111335]
cid: 110, volume: 284.49372465030075, center: [8.493264165158145 27.8746527886613 60.383167015106075]
cid: 111, volume: 553.3341996372737, center: [11.18619986136008 7.690913841130484 41.908634901190126]
cid: 112, volume: 323.47076227351573, center: [6.692950705782534 26.27126340272978 68.77873184813879]
cid: 113, volume: 413.42120264654164, center: [9.118450146755734 46.32165347623962 60.593679374679084]
cid: 114, volume: 419.664664050718, center: [9.853461161354437 58.3243651119514 54.42868688822217]
cid: 115, volume: 245.56128317997272, center: [10.672671744081832 26.036941437272233 26.699952402590956]
cid: 116, volume: 258.7022828973343, center: [8.649217401736898 31.59071043626961 34.62533693885537]
cid: 117, volume: 314.46233939034704, center: [8.626263758667145 24.50085368716082 54.05276763444739]
cid: 118, volume: 303.6849357759951, center: [12.215540970880769 45.131714030995155 32.028464387135934]
cid: 119, volume: 413.34687572506334, center: [8.283968720375421 48.51231729282888 68.80281323475869]
cid: 120, volume: 620.2878905049168, center: [16.14041831354377 11.222813118621037 25.34622327091092]
cid: 121, volume: 440.2234905316128, center: [8.814855921044485 24.472283540821905 62.446261207628154]
cid: 122, volume: 232.0486488552197, center: [9.518450746288355 64.33238511443946 49.631801354125564]
cid: 123, volume: 346.48237716319414, center: [10.506654310590056 56.42571645473657 41.497229353586754]
cid: 124, volume: 197.33797652485853, center: [9.5999354929612 58.26137163862147 65.46667316870057]
cid: 125, volume: 229.4769373720709, center: [10.188768929848074 48.4333005904839 37.334681707929]
cid: 126, volume: 400.0572221647452, center: [11.862134466953965 31.826821859404728 66.53097028137262]
cid: 127, volume: 256.888706013264, center: [9.760669513106373 37.53277966967768 69.53192072039813]
cid: 128, volume: 340.3875696019744, center: [11.353405650352116 50.12470614344048 23.751455902039478]
cid: 129, volume: 389.7852416164456, center: [10.631203359256343 18.390644734106253 40.926679235147404]
cid: 130, volume: 380.6578956589117, center: [11.950573061444288 63.55232212040458 43.38096471230914]
cid: 131, volume: 341.35381958119217, center: [11.431821770949982 21.802525406993862 14.978989880398903]
cid: 132, volume: 393.679972301908, center: [12.434057020680871 38.25931285425745 74.72034822954727]
cid: 133, volume: 229.95262966953194, center: [11.642886793841557 35.83016596083134 23.948131764063614]
cid: 134, volume: 243.50986014717193, center: [10.34535266150969 54.59412851319822 26.34091397213235]
cid: 135, volume: 91.31805572822644, center: [12.608469070256861 45.563844121601825 37.34245366721472]
cid: 136, volume: 312.336589436068, center: [11.343021027432767 41.0857201079149 23.18986860656799]
cid: 137, volume: 318.1192239270789, center: [12.963462681035578 44.560697144102804 27.175663223649533]
cid: 138, volume: 270.52026341238235, center: [13.167866128834051 58.21913091269371 29.42972831961754]
cid: 139, volume: 539.1377576349205, center: [14.51623236974905 49.68565684489908 45.344437744215284]
cid: 140, volume: 439.435625163943, center: [13.753182351344979 55.273617702723186 34.47027030390718]
cid: 141, volume: 326.47356990123865, center: [13.488663581845834 25.24355950081049 44.74249410327839]
cid: 142, volume: 180.36170765921722, center: [12.815187366926153 52.75916516434518 30.741467814184457]
cid: 143, volume: 341.54706957703576, center: [12.291647934522281 24.68220630135794 49.39541981380571]
cid: 144, volume: 10.07873055245605, center: [11.938076161621376 41.5057880039823 65.43330930840708]
cid: 145, volume: 248.87626387790445, center: [12.10981253207682 43.49130232775057 76.04199828483455]
cid: 146, volume: 472.8232782919906, center: [12.506551585806141 51.63004342796869 56.23467244432986]
cid: 147, volume: 216.67784149350945, center: [13.62668977405118 55.30476633889956 67.4466991042467]
cid: 148, volume: 283.8693785098831, center: [13.247421057281889 23.023616925 31.191997116422286]
cid: 149, volume: 265.71874428488485, center: [10.136546490884797 68.32193977624615 41.6418957461035]
cid: 150, volume: 497.7971239086959, center: [14.07794906479639 43.681796499862635 70.23109803775196]
cid: 151, volume: 244.7585524280072, center: [12.341308471426078 55.21359534486486 72.89712053513513]
cid: 152, volume: 207.6545532260451, center: [12.672296907459216 20.399137321404538 63.44027003179182]
cid: 153, volume: 313.58528171690324, center: [13.129949005291207 20.056403324925338 53.912871708409575]
cid: 154, volume: 219.5914568154584, center: [13.374212126259367 39.13091062835093 32.86629526043867]
cid: 155, volume: 300.2510320036981, center: [12.842259108840338 30.171086105451035 54.491201752727996]
cid: 156, volume: 356.54624233135456, center: [14.24524654646251 63.43084519429643 56.327744162526585]
cid: 157, volume: 84.03401742335407, center: [12.863111197486674 33.887239679479926 53.75183020279498]
cid: 158, volume: 117.51086285717564, center: [11.133959429225444 49.659422918026564 29.269417212371916]
cid: 159, volume: 57.41011414983078, center: [13.399077800411034 65.10931609699638 50.138219243474886]
cid: 160, volume: 297.35228206604484, center: [12.623699429697046 20.986870385837125 43.98842687832325]
cid: 161, volume: 297.7982435949146, center: [12.786655428824938 38.96239943443818 62.417557658753054]
cid: 162, volume: 90.85722881506103, center: [12.420969155305484 67.77500015237239 60.083191933066104]
cid: 163, volume: 286.36676307155363, center: [16.375816333160643 68.21367422725291 56.93043134760174]
cid: 164, volume: 174.54934239961497, center: [13.773744684259794 28.61589116895759 39.37778842549821]
cid: 165, volume: 449.00893265034665, center: [16.53251867246709 37.399396185608346 40.06462096331402]
cid: 166, volume: 248.54922542339997, center: [15.799958602550996 34.12080046471292 36.22573076219498]
cid: 167, volume: 144.11990074640326, center: [16.124904352961686 42.05303745075812 64.37528144967509]
cid: 168, volume: 205.72205326760957, center: [17.432755256970037 43.18654410440061 34.391890622306526]
cid: 169, volume: 180.18332304766932, center: [14.889514429214216 47.75402581989935 65.86848966675193]
cid: 170, volume: 512.0678928325275, center: [18.92509619532808 43.941625451900016 48.155400244828286]
cid: 171, volume: 170.25324633816984, center: [14.939175442247736 60.92225455499869 69.27596257562212]
cid: 172, volume: 168.8261694457867, center: [18.70437461809593 16.82642794989874 28.54910747732676]
cid: 173, volume: 243.03416784971088, center: [16.020308348521766 24.30289420341917 36.259748893699914]
cid: 174, volume: 274.4149940978447, center: [15.97112458301626 29.420524639972914 27.556713706868905]
cid: 175, volume: 220.34959141453695, center: [16.095691212130347 30.885016576806315 33.31581088053026]
cid: 176, volume: 624.5542557977707, center: [17.77286516527933 33.862762802149284 46.36643545951349]
cid: 177, volume: 298.15501281801033, center: [16.10355915405116 61.18418782575161 33.473535121962406]
cid: 178, volume: 80.39199827091788, center: [14.454671225303185 20.09628902962278 35.231624589497045]
cid: 179, volume: 129.03153568631052, center: [17.649892017153558 50.21892797903226 27.39044266403226]
cid: 180, volume: 356.72462694290243, center: [17.354011881040893 53.994408075184396 49.22438077812227]
cid: 181, volume: 146.51322761800418, center: [16.35116266075078 28.53207401377841 48.18501846434659]
cid: 182, volume: 138.12915087525315, center: [16.337050983370403 32.999675809868705 25.37243752464486]
cid: 183, volume: 528.6279309378904, center: [17.739961597585232 43.77326341398723 40.77089087149968]
cid: 184, volume: 345.575588721159, center: [18.69508867527107 46.22512319494128 60.174111019060526]
cid: 185, volume: 134.44253556993, center: [15.856141708843486 50.008205343343654 32.49584519419505]
cid: 186, volume: 582.9906413071112, center: [16.6136536895441 57.41182932052629 60.07969178530011]
cid: 187, volume: 272.77980182532235, center: [14.741468802488422 49.661677606594004 74.41050421118257]
cid: 188, volume: 272.2892441435656, center: [14.761974192106699 65.1469642070481 64.46118668028608]
cid: 189, volume: 255.75893680679405, center: [17.07004145427927 18.975697621255446 47.008688258866606]
cid: 190, volume: 253.46966762526273, center: [15.897531255939722 51.936316345838954 39.06839776600199]
cid: 191, volume: 247.06268699383418, center: [18.325807809244214 55.84115690734657 41.57349833075813]
cid: 192, volume: 379.39433799378077, center: [18.360245419575513 62.67435776832145 38.08063479520022]
cid: 193, volume: 173.96959241208432, center: [18.181712190890867 28.980797125224303 42.34947981996924]
cid: 194, volume: 187.24438058810682, center: [17.642517488383767 55.55591911571928 24.82101077029216]
cid: 195, volume: 287.85330150111946, center: [17.436942734854682 24.33959603886594 58.00117003030882]
cid: 196, volume: 298.82395511131494, center: [17.97171606930815 15.234935443801612 39.71040618128047]
cid: 197, volume: 189.4741882324555, center: [17.77958206822668 37.02719003134317 26.766212003169624]
cid: 198, volume: 317.2124354850438, center: [18.480391535130607 58.78902734854492 44.21467705586954]
cid: 199, volume: 398.52608758229246, center: [18.417356524403417 66.80570310082808 33.4300099525346]
cid: 200, volume: 140.62653543692366, center: [20.155320056959 7.287291614080338 32.92414975810782]
cid: 201, volume: 340.9375888209138, center: [17.47531964385517 32.06032446258993 71.6708443299019]
cid: 202, volume: 539.1674884035118, center: [18.711106295064287 61.27717599659223 50.39418533692307]
cid: 203, volume: 157.9893042942521, center: [20.202797597978975 18.738136123136997 34.462253013765526]
cid: 204, volume: 148.41599680784842, center: [17.66991847325286 50.062185218659856 69.0855167635517]
cid: 205, volume: 345.79856948559393, center: [17.82094898133622 26.01287186263864 67.75606749975496]
cid: 206, volume: 319.2787239021402, center: [19.42050448468135 44.890942720621105 54.52936058796909]
cid: 207, volume: 145.27940072146458, center: [18.93059213838201 48.357602557566764 39.373056122848666]
cid: 208, volume: 188.25522672021157, center: [18.462444575345412 18.930917937176247 60.8610743394741]
cid: 209, volume: 448.29539420415506, center: [19.5188777257654 37.73774620909905 68.58829649626952]
cid: 210, volume: 76.15536374665538, center: [20.314789246964168 9.801720083915674 31.02373249301191]
cid: 211, volume: 252.19124457583615, center: [19.75049886763935 26.717648322281168 53.51587386712644]
cid: 212, volume: 274.6974363994622, center: [22.20177058125113 48.57232669004275 49.50142603961795]
cid: 213, volume: 380.34572258870287, center: [22.400681764175953 39.91551797930118 44.41533946517236]
cid: 214, volume: 114.09182446917433, center: [20.020021640045847 35.92031830553746 22.102956402097718]
cid: 215, volume: 287.6154553523889, center: [19.67410427488614 39.518566832127355 28.78800324345152]
cid: 216, volume: 227.61876433511367, center: [18.96176727074836 64.33692921057994 45.85380939670847]
cid: 217, volume: 133.19384328909473, center: [19.83132675367695 19.19625148265625 51.00593219296875]
cid: 218, volume: 295.01841673162653, center: [21.42681769609221 32.9391363787262 55.59117085469616]
cid: 219, volume: 179.18734229986023, center: [19.121447516847443 40.16502299529616 20.503483583101044]
cid: 220, volume: 277.2840132669067, center: [20.255408808625695 53.68435596619847 17.91357092800086]
cid: 221, volume: 184.99970755946248, center: [19.32923032025754 55.54238604571314 70.8748063005223]
cid: 222, volume: 183.3050537497575, center: [20.136628179348683 33.40943675751358 30.150956906966183]
cid: 223, volume: 173.8358039534234, center: [20.95963143678963 43.24432525933812 23.291642572370446]
cid: 224, volume: 237.78668719334365, center: [20.702972778580122 15.921164633702176 56.09043055590773]
cid: 225, volume: 246.92889853517326, center: [19.46191742768888 61.141624764348926 66.25943788457649]
cid: 226, volume: 417.80649101376076, center: [21.612900250412657 39.620136831270905 60.10622100082188]
cid: 227, volume: 257.58737907515996, center: [21.46921928597911 47.64954327138158 33.866772478479916]
cid: 228, volume: 80.30280596514393, center: [19.995202961794007 68.09154864207702 39.135814474065164]
cid: 229, volume: 284.4639938817094, center: [21.51994461685154 21.178906454692726 29.087689363858694]
cid: 230, volume: 273.2108979698964, center: [19.99407179177456 49.101069808199576 21.995023803150335]
cid: 231, volume: 209.95868779187208, center: [21.99084211239951 62.03470925180544 24.521461514252337]
cid: 232, volume: 176.0656115977721, center: [23.00233632616443 11.446784944148936 41.6367375572695]
cid: 233, volume: 160.02586194275722, center: [21.3458448775388 28.847170486316767 37.507969431695315]
cid: 234, volume: 529.817161681543, center: [22.70018062233342 52.2321050780225 54.891430268045234]
cid: 235, volume: 58.59934489348341, center: [21.757359531726017 48.71481482458143 68.45525180570776]
cid: 236, volume: 196.83255345880616, center: [21.4892332039621 23.483054254655993 35.02272453339627]
cid: 237, volume: 290.45474375285954, center: [21.006223286423246 25.205178627836634 61.61111755390757]
cid: 238, volume: 165.67470797510722, center: [22.359711559405277 57.06289634740242 35.350492812247644]
cid: 239, volume: 126.40036266597906, center: [19.495243998635814 68.67076399620134 42.79671199514289]
cid: 240, volume: 133.92224711958195, center: [22.715124402824475 17.17129628251748 39.148061863636364]
cid: 241, volume: 357.482761541981, center: [22.531147559759862 26.973071559792917 29.210236961576847]
cid: 242, volume: 170.81813094140486, center: [22.49016245237992 24.375863456104778 39.941754861047784]
cid: 243, volume: 177.98324617191196, center: [22.358880704226852 24.142185280506137 50.466518724605365]
cid: 244, volume: 474.8301051719044, center: [20.913206314094293 33.72488377215891 62.61531908635026]
cid: 245, volume: 173.5236308832146, center: [22.627388733252886 37.15857524854793 73.20332408601901]
cid: 246, volume: 315.27993552660826, center: [23.234456882854687 40.19783253960583 34.21792153290584]
cid: 247, volume: 157.3500927695388, center: [23.402609954721484 43.54124385423713 27.892692521322626]
cid: 248, volume: 173.6276885732842, center: [21.707542988387473 46.794337515744864 72.99137200471746]
cid: 249, volume: 238.1583218007351, center: [21.9170577724825 48.243774680088634 15.659887792247675]
cid: 250, volume: 377.31318419238863, center: [21.984396399384654 67.87352420369552 50.41985712972973]
cid: 251, volume: 146.88486222539564, center: [22.45017290835199 47.03440391804473 26.849367779465638]
cid: 252, volume: 176.95753465551155, center: [22.616262664537437 57.41817306764113 27.720886916935484]
cid: 253, volume: 188.56739979042038, center: [23.236732378511938 51.271300685084746 29.85116544011825]
cid: 254, volume: 139.98732391221037, center: [22.071501039224827 24.00167924450462 11.845424472347881]
cid: 255, volume: 176.24399620932, center: [22.84442813222794 28.708527065587045 47.09787152191296]
cid: 256, volume: 112.07013220496485, center: [22.807008092741 60.13785199832869 30.12949719275766]
cid: 257, volume: 237.51911027602182, center: [24.244482466763703 19.62559518627488 52.768996483665035]
cid: 258, volume: 159.49070810811352, center: [24.980231493756484 14.732520537561749 27.40095297723926]
cid: 259, volume: 262.4780905084314, center: [26.486265135141764 37.011931532961434 53.13756477456533]
cid: 260, volume: 133.77359327662538, center: [24.09616254932757 21.567912597366377 47.19621693640404]
cid: 261, volume: 267.5620519375464, center: [24.2430287841763 31.72564113496861 39.97952272509583]
cid: 262, volume: 173.6574193418755, center: [22.9013141931849 32.41214968310221 23.46708966877247]
cid: 263, volume: 215.80078382006562, center: [23.226617967956948 13.792360906302955 33.12250275323414]
cid: 264, volume: 346.2593963987593, center: [25.69435212119578 35.65515328280599 33.18346454047568]
cid: 265, volume: 172.97361166427524, center: [23.05234900532411 63.53846209620144 61.357977264291854]
cid: 266, volume: 364.305972933688, center: [23.503673606494615 30.220990476349616 65.1860294940874]
cid: 267, volume: 84.98540201827618, center: [25.207246377410172 50.628617428598915 19.878886788298058]
cid: 268, volume: 220.84014909629366, center: [23.87857598209553 54.24071603612682 23.87225306789176]
cid: 269, volume: 351.1352424477351, center: [25.43242820378221 63.69031373398247 42.59260931063461]
cid: 270, volume: 244.9666678081464, center: [25.003091937247724 29.313310256690336 57.49458974935373]
cid: 271, volume: 155.29866973673802, center: [23.769829933729486 43.34909381986216 14.609774149277305]
cid: 272, volume: 139.21432392883617, center: [24.196996846448855 19.710745977917778 43.024339347004805]
cid: 273, volume: 293.4129552276955, center: [24.004547269329088 31.832661419191407 50.81476308100618]
cid: 274, volume: 343.360646461106, center: [27.531620131315393 46.1349620566456 42.6419081571911]
cid: 275, volume: 263.10243664884905, center: [26.089123469491255 54.50693946012204 32.94652966139895]
cid: 276, volume: 128.60043954173642, center: [22.90215087417523 53.07951213474743 71.13755719568836]
cid: 277, volume: 138.85755470574037, center: [25.22086935992896 14.12668543533883 50.29076503716947]
cid: 278, volume: 214.65614922929998, center: [26.65968883799791 25.28278649900277 42.871758624889196]
cid: 279, volume: 236.76097567694325, center: [24.644777966023728 43.08223882791486 72.00581430487851]
cid: 280, volume: 416.86997180313426, center: [24.991271255229087 43.89344827144029 65.81892230437185]
cid: 281, volume: 346.67562715903773, center: [25.303823183698093 61.24593943714249 54.30768491785944]
cid: 282, volume: 109.49842072181603, center: [26.39071137551686 24.72374002127342 46.42472847971762]
cid: 283, volume: 163.89086185962827, center: [25.48072096265778 39.16945495314286 20.696242797523812]
cid: 284, volume: 261.0361482317526, center: [25.9064564579821 58.18707778754556 66.22032256426537]
cid: 285, volume: 311.50412791551116, center: [26.325822825108677 62.56219899979957 33.798219760730134]
cid: 286, volume: 209.3492070357501, center: [25.521751684643686 21.997757991628205 56.30410343108713]
cid: 287, volume: 138.41159317687064, center: [26.209241784689937 44.11416481417678 33.11996860835571]
cid: 288, volume: 200.08807261955525, center: [24.268965180045246 44.537279152288264 19.042410183677564]
cid: 289, volume: 181.0455153368175, center: [26.388530127113555 11.226662501855653 35.90481125209787]
cid: 290, volume: 348.84597326620377, center: [27.67955431395562 37.31239200124004 40.07369821321856]
cid: 291, volume: 76.27428682102065, center: [26.100909119582276 49.076933572714864 23.7878080154161]
cid: 292, volume: 229.41747583488825, center: [26.21832568796386 57.57512874611547 39.35076660796994]
cid: 293, volume: 98.28992096289, center: [25.576154363003777 20.92559855530853 37.70594370662432]
cid: 294, volume: 36.98507612759684, center: [27.336491345862377 7.071598580546624 42.62960107596463]
cid: 295, volume: 129.4180356779976, center: [27.355149247521997 14.466202847760165 41.095585653618194]
cid: 296, volume: 134.8587663302084, center: [25.971086114740718 32.41420756643518 28.736979300462963]
cid: 297, volume: 483.6601434435252, center: [27.06012969741835 57.12855554709553 59.06884112342943]
cid: 298, volume: 258.8806675088822, center: [27.459737075298676 30.220022872678726 33.29603515705426]
cid: 299, volume: 227.76741817807024, center: [26.708771004245804 52.25849467694818 37.00850220497324]
cid: 300, volume: 211.47495699002917, center: [26.459734237660925 64.45874358401518 58.343193820940535]
cid: 301, volume: 129.01667030201486, center: [26.01662784147366 26.094083425406154 34.283581141894224]
cid: 302, volume: 141.31034311452393, center: [26.63891414769821 8.91151169779087 39.493541308762886]
cid: 303, volume: 318.17868546426155, center: [28.355224538223034 9.994187579714072 29.930408662633152]
cid: 304, volume: 157.42441969101708, center: [26.937820211515575 36.222292795410766 25.298058672691216]
cid: 305, volume: 337.3698965899559, center: [26.85940827779566 51.090774288235295 42.0539644]
cid: 306, volume: 228.57014893003577, center: [26.481890040904517 18.949872306848334 60.76137146657778]
cid: 307, volume: 188.67145748048998, center: [27.849841058130547 29.398859146872045 23.875894081460764]
cid: 308, volume: 82.13124823350987, center: [27.613022072253536 41.221858181918556 63.23836158515837]
cid: 309, volume: 257.23060985206416, center: [27.89937124038137 17.1570387473301 33.19752511080097]
cid: 310, volume: 160.0704580956442, center: [27.969890299336818 18.233052185577638 47.018908737565006]
cid: 311, volume: 373.2697996639697, center: [28.796194463575247 42.19473420480286 55.21745346912783]
cid: 312, volume: 82.38395976653604, center: [27.647717688671964 49.479596950631546 15.70397232011909]
cid: 313, volume: 392.49074155825537, center: [27.72846128176932 54.06043746724236 45.992415836086806]
cid: 314, volume: 110.89576684560788, center: [27.998691967755256 11.677539032855227 25.175731996327077]
cid: 315, volume: 113.97290139480907, center: [26.91048522078898 15.767181231211685 55.83328991895135]
cid: 316, volume: 113.55667063453065, center: [27.9372764422537 41.60178638058647 23.94987588296898]
cid: 317, volume: 97.05609406635038, center: [27.173020277028716 54.95443726858631 18.28370158525042]
cid: 318, volume: 143.5847469117596, center: [28.24380304401507 26.51951747035925 53.633918000641884]
cid: 319, volume: 96.00065178135867, center: [27.815252912592065 59.3022285150511 27.179866659569527]
cid: 320, volume: 206.9856109327405, center: [27.131080182162073 65.2334333614335 28.436265588559323]
cid: 321, volume: 304.948493441126, center: [28.426595829583263 43.472023457487566 50.904013655118455]
cid: 322, volume: 16.396518878110655, center: [31.869060760693486 6.970561907434271 30.51341803517679]
cid: 323, volume: 125.27059345950906, center: [29.490611865925523 7.233223043503027 35.488775245710215]
cid: 324, volume: 178.17649616775552, center: [28.76484147911429 32.17007078084432 44.67013431202236]
cid: 325, volume: 87.3044019683988, center: [28.15374701358281 34.91209086793802 16.09820961454112]
cid: 326, volume: 230.02695659101025, center: [29.047308560001998 35.23533536341605 57.25750867027918]
cid: 327, volume: 526.1156809919241, center: [29.108076840468634 50.495745094402686 61.84581414030855]
cid: 328, volume: 189.10255362506405, center: [28.73817775831042 54.66041020541624 25.67088817744674]
cid: 329, volume: 239.3178217757964, center: [27.292408197620336 50.23610180950991 69.18582242161625]
cid: 330, volume: 224.54162978591248, center: [28.69699020777228 36.35312874893744 65.90671416444886]
cid: 331, volume: 120.88530509228998, center: [27.826476034824047 39.50076528600591 14.904585156972454]
cid: 332, volume: 199.38939955765932, center: [28.189361744512393 48.08895973408633 36.59483237541937]
cid: 333, volume: 325.12081993033377, center: [28.76725526628801 58.42753547536921 47.9415991484843]
cid: 334, volume: 136.5831509085047, center: [29.094393216620084 21.629535352144103 33.02862389895516]
cid: 335, volume: 179.52924613866037, center: [28.76744948994878 34.679795143595264 20.427711222944442]
cid: 336, volume: 457.30381708732375, center: [28.232097701623175 37.61679790135228 48.000751987432956]
cid: 337, volume: 146.51322761800418, center: [28.193386823081042 58.990545499218754 21.344041592045453]
cid: 338, volume: 217.18326455956182, center: [28.15773830790161 67.17886818712526 51.521323539876796]
cid: 339, volume: 208.07078398632353, center: [29.347276719860947 44.96080257599486 27.958230701486034]
cid: 340, volume: 163.8759964753326, center: [29.433844173704568 44.8459553965439 59.28525514473875]
cid: 341, volume: 533.2510654538399, center: [29.729402732197062 51.73331093378959 53.312219136003016]
cid: 342, volume: 111.16334376292973, center: [29.087584390668752 29.97836490569671 59.401698269951865]
cid: 343, volume: 225.87951437252167, center: [28.242506569752955 34.475726299822306 70.72382157271471]
cid: 344, volume: 116.27703596063604, center: [29.51295215236733 18.74112517843263 42.081888077627205]
cid: 345, volume: 150.94311213811025, center: [30.127119254601748 39.015458620908014 27.8258578692338]
cid: 346, volume: 92.40322878180946, center: [29.914793638618956 61.33202625810811 23.71011929695946]
cid: 347, volume: 89.8463826829563, center: [29.79222927563167 40.96274893600265 18.65935733681337]
cid: 348, volume: 135.27499709048683, center: [30.386624478318815 27.00168235523077 26.616422509846153]
cid: 349, volume: 269.360763437321, center: [30.55727679441851 43.120037988327816 37.713569300529805]
cid: 350, volume: 154.5256697533638, center: [29.267900453232965 14.121824181818182 45.35895917333334]
cid: 351, volume: 108.3091899781634, center: [29.82013674366159 50.20754820440571 21.25168320839967]
cid: 352, volume: 125.09220884796117, center: [30.045744573228944 21.505116162602494 38.3806164913369]
cid: 353, volume: 125.31518961239604, center: [30.874768417932703 50.13985533185054 25.528364178042704]
cid: 354, volume: 177.31430387860735, center: [30.097638059097637 50.5111635721831 30.96490582253521]
cid: 355, volume: 158.79203504621762, center: [30.281712386864793 67.36857030786369 34.01226251245085]
cid: 356, volume: 234.90280263998602, center: [30.0488497692926 68.165963169333 44.80897080552462]
cid: 357, volume: 196.96634191746708, center: [30.671988464573737 25.975325071381132 36.446498751283016]
cid: 358, volume: 152.59316979492826, center: [30.09274359807568 26.074546416093522 50.351894604841696]
cid: 359, volume: 163.3854387935759, center: [31.384702115837406 27.29196184962242 46.61973527064871]
cid: 360, volume: 72.82551766442802, center: [30.167830915111832 14.647261285854256 50.79055199748928]
cid: 361, volume: 265.25791737171943, center: [29.538083672349238 29.097924631355077 68.1035679691493]
cid: 362, volume: 140.25490082953223, center: [30.177973448067824 45.915148908966614 22.182974733895072]
cid: 363, volume: 100.63865168160393, center: [30.76529840335845 54.786391229246675 19.320860824431318]
cid: 364, volume: 182.29420761765275, center: [30.92363687932723 31.526113665424447 38.287829417247]
cid: 365, volume: 162.55297727301905, center: [30.93471253105881 15.918811446337449 37.26687123319616]
cid: 366, volume: 188.4187459474638, center: [30.208187818673807 22.687467880497042 57.81564336054438]
cid: 367, volume: 216.99001456371826, center: [30.29606303861112 23.00432058651093 64.11371663086251]
cid: 368, volume: 156.20545817877314, center: [30.818916804593076 44.94096810519604 15.572544426646365]
cid: 369, volume: 60.96294099649302, center: [30.586079947053545 50.32515790029261 16.82298863240673]
cid: 370, volume: 165.43686182637668, center: [31.280640761245603 56.988290887995326 37.21876092160122]
cid: 371, volume: 160.1745157857138, center: [30.52619630664116 58.626849691823665 42.1449194568167]
cid: 372, volume: 73.04849842886289, center: [30.851381314941175 16.76146847051282 56.297447943589745]
cid: 373, volume: 109.67680533336393, center: [31.488633483277493 34.47996675796964 25.733421216603414]
cid: 374, volume: 133.40195866923392, center: [30.540172728248073 58.73057958603744 63.5602525724649]
cid: 375, volume: 109.30517072597249, center: [31.471403124109774 20.710588253243575 48.59089453182374]
cid: 376, volume: 113.57153601882631, center: [31.85452988118128 55.336988866020945 27.961842887670155]
cid: 377, volume: 226.80116819885248, center: [32.33079586648913 40.34360776188635 33.03149200138297]
cid: 378, volume: 80.22847904366564, center: [31.500905586351095 20.69230755914397 52.58618486575875]
cid: 379, volume: 156.16086202588616, center: [31.406952936925702 23.94451024726321 29.20739466422656]
cid: 380, volume: 133.22357405768602, center: [30.62925572906075 27.46770004422004 62.17956857349922]
cid: 381, volume: 333.6535505160414, center: [31.526496968767358 62.66459382255291 47.066676099309426]
cid: 382, volume: 164.18816954554143, center: [31.336050149272065 63.38457148332277 37.924111334721594]
cid: 383, volume: 85.14892124552841, center: [31.98264761989145 26.461311299319135 41.77663246759777]
cid: 384, volume: 96.10470947142828, center: [31.9323877889706 31.376191121160094 29.786914391832948]
cid: 385, volume: 185.9808229229759, center: [31.360960596035444 39.26652500842459 60.115405444416915]
cid: 386, volume: 257.0522252405163, center: [31.01757658499938 47.49769064406662 47.10236134642609]
cid: 387, volume: 233.19328344598537, center: [31.511401756456547 59.875889783801874 30.993864178447122]
cid: 388, volume: 51.49369120015894, center: [32.18708583177082 15.968994660103927 52.53721771073903]
cid: 389, volume: 94.09788259151446, center: [32.08258497469052 32.33272690943128 49.78832321293839]
cid: 390, volume: 208.79918781681076, center: [32.71209455444038 32.33019366232379 62.220192103246475]
cid: 391, volume: 153.09859286098063, center: [32.79250299889047 46.17113940760268 31.13050372947859]
cid: 392, volume: 55.10597958400381, center: [32.46823722292655 65.26903972149987 29.661827463528457]
cid: 393, volume: 174.17770779222354, center: [30.835535757784303 30.39052363779978 18.07289524849364]
cid: 394, volume: 93.6965172155317, center: [33.192180917219716 24.981657399666826 60.18891094750119]
cid: 395, volume: 66.12122934708631, center: [32.859621989524676 30.220032647144784 24.006947839478418]
cid: 396, volume: 78.77167138269117, center: [32.916300740798505 37.05221097780713 39.05932662126816]
cid: 397, volume: 260.3077444012654, center: [31.38267061784201 40.88764334317286 69.61672585005996]
cid: 398, volume: 74.93640223441143, center: [32.79738558784266 27.502148507835745 55.55275671555247]
cid: 399, volume: 146.78080453532604, center: [33.83359277512153 34.60849792735467 32.94636041463439]
cid: 400, volume: 61.20078714522354, center: [32.49069540651756 40.100904091522956 15.503301068205005]
cid: 401, volume: 127.15849726505762, center: [32.372202931622994 40.778974696153846 21.602993553682488]
cid: 402, volume: 76.43780604827289, center: [32.24224275811585 63.23832854218203 26.546350332497084]
cid: 403, volume: 75.02559454018538, center: [32.54442521517242 26.112908883079058 20.706100705963937]
cid: 404, volume: 91.64509418273092, center: [33.32478919900542 29.983930081459853 52.18156805532847]
cid: 405, volume: 73.27147919329775, center: [32.92844746701611 35.908364491539864 16.30624585185636]
cid: 406, volume: 60.14534486023184, center: [33.63113158192423 46.18075052595156 24.244364460726647]
cid: 407, volume: 87.40845965846842, center: [33.38053534124701 19.12795371107143 28.561410111785715]
cid: 408, volume: 62.330556351693545, center: [33.65615103850857 20.200902675626043 40.10446742053423]
cid: 409, volume: 68.5294216029829, center: [33.966246703787725 21.349644002472886 34.849961093036875]
cid: 410, volume: 48.60980664680131, center: [33.46480813735463 32.92470620651376 21.433177882110094]
cid: 411, volume: 145.0266891884384, center: [33.40025419727848 61.77384406645142 59.11492115916359]
cid: 412, volume: 121.21234354679446, center: [33.54511054619835 34.81070330353201 55.39017779282561]
cid: 413, volume: 218.50628376187538, center: [34.48866872785523 41.44188614192802 42.77222399024423]
cid: 414, volume: 86.82870967093776, center: [33.689240136978455 41.3177302162301 63.83598259753467]
cid: 415, volume: 96.19390177720223, center: [33.70084238988617 44.984499425452015 63.780449572415385]
cid: 416, volume: 145.33886225864723, center: [34.52737515897041 20.87111110966554 43.883118019484506]
cid: 417, volume: 145.39832379582984, center: [33.96506803402109 22.572910672620385 24.147182232624477]
cid: 418, volume: 106.83751693289328, center: [33.65429257028981 36.273939738834 64.69486722656185]
cid: 419, volume: 81.12040210140512, center: [34.43143954888223 37.26505636300165 21.425234406816934]
cid: 420, volume: 86.75438274945947, center: [33.578158781060544 48.34900353130569 17.887641182282387]
cid: 421, volume: 111.5944399075038, center: [34.30223371488367 15.73194293669908 48.87643246484615]
cid: 422, volume: 67.63749854524342, center: [34.50770549574312 22.331944531846155 53.33273592230769]
cid: 423, volume: 156.07166972011223, center: [35.34438344088224 46.908852029317075 37.38202763090771]
cid: 424, volume: 271.85814799899157, center: [33.199129069605114 48.8263458366962 67.73199680636483]
cid: 425, volume: 76.69051758129908, center: [34.367670928430336 51.23997115929444 32.59420019837177]
cid: 426, volume: 48.52061434102736, center: [33.60587907200427 52.63905637233456 19.866595566819854]
cid: 427, volume: 61.498094831136704, center: [34.703986532736764 56.283178673096444 29.233034150253808]
cid: 428, volume: 386.6040493771748, center: [35.61096944177532 60.333032197173836 51.99184758393125]
cid: 429, volume: 217.00487994801392, center: [33.90463240684359 65.09574448220305 54.9667459824702]
cid: 430, volume: 35.88503768971815, center: [34.78800158662015 26.482767472742335 41.93733553371997]
cid: 431, volume: 51.880191191846045, center: [34.600214086431116 27.14521992180516 24.84105754573066]
cid: 432, volume: 136.95478551589616, center: [35.1992323783624 28.12975756968414 37.27319698599804]
cid: 433, volume: 99.8061901610471, center: [34.97009919444166 36.452969541733694 27.571413674262732]
cid: 434, volume: 70.9970753960621, center: [35.16342430691116 41.78420548046483 28.333658373366834]
cid: 435, volume: 61.215652529519204, center: [34.80291241750562 50.67302685531811 26.875514609082078]
cid: 436, volume: 75.97697913510748, center: [34.390549211112166 55.22815734799452 21.989172951888087]
cid: 437, volume: 81.23932517577039, center: [34.32650691312638 15.271471743842634 40.94926257606587]
cid: 438, volume: 59.565594872701176, center: [35.00441697598014 20.991355252258547 48.8343406197155]
cid: 439, volume: 79.63386367183934, center: [35.0078319794683 26.57883697997013 65.2715653272354]
cid: 440, volume: 35.46880692943973, center: [34.79219365260061 42.51994849312657 16.891329545683153]
cid: 441, volume: 177.13591926705945, center: [35.34848235595437 45.22431195347432 57.36542977990936]
cid: 442, volume: 151.99855442310195, center: [35.756769454472824 52.40899581752568 37.926576373701714]
cid: 443, volume: 90.7977672778784, center: [35.24406111582137 62.93736091498035 41.49575403045187]
cid: 444, volume: 163.77193878526302, center: [35.900731857937785 67.23024685087591 40.423822829626936]
cid: 445, volume: 71.39844077204486, center: [35.290306792620896 15.957523439787632 44.12069625334166]
cid: 446, volume: 70.10515233832263, center: [35.17321005289504 17.64914121806616 32.8472841586514]
cid: 447, volume: 125.68682421978748, center: [35.69598685794078 17.844958938947368 54.82596154736842]
cid: 448, volume: 109.70653610195525, center: [35.26291477812905 19.509324521138215 59.0697621451626]
cid: 449, volume: 145.4875161016038, center: [36.04010908928362 26.883858742597322 28.740919695872076]
cid: 450, volume: 108.01188229225025, center: [35.79269967681719 28.272004067630057 45.35521661358382]
cid: 451, volume: 252.08718688576656, center: [36.700846662387505 39.998482897918386 48.20889123845972]
cid: 452, volume: 352.74070395166615, center: [36.053104160440235 53.47358533389945 52.252654912710184]
cid: 453, volume: 132.64382407015538, center: [35.61899454937623 55.68459948585677 34.38027615532892]
cid: 454, volume: 207.95186091195825, center: [34.371366348683665 56.69831423141754 63.93362526916149]
cid: 455, volume: 61.00753714937999, center: [34.511607501122626 58.78896327192982 24.019328490131578]
cid: 456, volume: 135.79528554083484, center: [36.26901866259438 29.71761626137931 56.361590822758615]
cid: 457, volume: 134.0411701939472, center: [35.90627066458313 57.77881397330598 39.98750431054674]
cid: 458, volume: 269.85132111907774, center: [35.29434328369295 33.313690850487525 42.66098528401917]
cid: 459, volume: 257.14141754629026, center: [37.53466728095235 48.07310578869233 50.80870144665279]
cid: 460, volume: 179.46978460147773, center: [36.09200047311553 52.44420422994285 44.45305356965128]
cid: 461, volume: 121.53938200129893, center: [36.01467800878247 61.98825600436644 35.61092918476028]
cid: 462, volume: 193.23513045925694, center: [35.765703247931675 66.21135894474959 49.71054359063005]
cid: 463, volume: 107.59565153197182, center: [36.4595314466633 17.334979518858802 36.52969271750484]
cid: 464, volume: 52.727518096698546, center: [35.878057534575326 21.71594108736961 61.84690537848886]
cid: 465, volume: 117.8081705430888, center: [36.35494366562104 24.38340555622713 56.591502978246055]
cid: 466, volume: 72.03765229675815, center: [36.37769744986622 31.559454369706977 29.215879093025173]
cid: 467, volume: 111.5944399075038, center: [36.1843074261353 33.81322036720395 48.42336946200879]
cid: 468, volume: 131.84109331818985, center: [36.71499998235928 41.38178040568271 24.24826655730071]
cid: 469, volume: 200.37051492117274, center: [37.153833361658975 47.82028910353884 44.411531375361676]
cid: 470, volume: 125.7165549883788, center: [35.903480233196234 66.05925725062079 33.58626497023767]
cid: 471, volume: 178.1467653991642, center: [36.94629805382141 23.968411318983648 31.623916588668223]
cid: 472, volume: 282.2936477745434, center: [37.777220153986406 36.04348744992101 37.26710321739336]
cid: 473, volume: 93.97895951714919, center: [36.649954987380475 46.576940078646 25.670747017193925]
cid: 474, volume: 127.23282418653591, center: [36.70255968448194 22.167396850823696 38.83348319502279]
cid: 475, volume: 62.53867173183276, center: [36.81076492172091 35.01673697470882 22.87708200499168]
cid: 476, volume: 157.78118891411287, center: [37.018410271435044 41.62989721223855 52.311059681034486]
cid: 477, volume: 199.80563031793773, center: [38.01414936063835 30.34274033156759 34.575258876095525]
cid: 478, volume: 186.367322914663, center: [36.812462418283964 37.85052485711893 67.60565466147403]
cid: 479, volume: 492.1631432606415, center: [38.2935134009802 50.693705147580644 60.12600005887097]
cid: 480, volume: 92.09105571160065, center: [36.04196633051569 44.79514475661016 19.138504850169493]
cid: 481, volume: 149.649823704388, center: [37.61270235228881 31.182093380550313 25.164017997764972]
cid: 482, volume: 39.09596069758026, center: [35.82637297765608 38.59478625501901 17.082519149885933]
cid: 483, volume: 204.91932251564404, center: [38.010746735238584 24.86589305334059 50.879199997062024]
cid: 484, volume: 142.4103815524026, center: [37.00345506292974 33.66437630010438 18.434178010741128]
cid: 485, volume: 117.39193978281038, center: [37.18328341171021 35.33287341308092 53.22984814554894]
cid: 486, volume: 126.78686265766616, center: [38.091936230029766 38.2591665336968 31.183321362082307]
cid: 487, volume: 70.35786387134881, center: [37.50559640450535 39.88895499830974 19.013390033319247]
cid: 488, volume: 62.25622943021526, center: [38.21455207461851 50.729687199426934 33.189019288395414]
cid: 489, volume: 94.78169026911472, center: [37.2634407367469 52.17914520098808 28.009543522349436]
cid: 490, volume: 149.5754967829097, center: [37.62488451710204 57.02728355951103 45.908388113029226]
cid: 491, volume: 230.10128351248852, center: [37.63853350565516 39.254830666619284 58.053431822159055]
cid: 492, volume: 123.90297810430853, center: [38.38798501850068 23.14535814489502 46.76702222825435]
cid: 493, volume: 241.74087941598864, center: [38.231686593167936 31.33880541764851 66.48368916604353]
cid: 494, volume: 150.22957369191866, center: [38.56881808872451 42.38650296836533 40.183669164288546]
cid: 495, volume: 169.74782327211747, center: [38.19510271429664 46.54380556483055 31.55783837618005]
cid: 496, volume: 125.76115114126577, center: [38.19628551460534 30.296314853049648 50.95472645492908]
cid: 497, volume: 62.315690967397884, center: [39.041686404636664 47.4653041230916 36.01701164219943]
cid: 498, volume: 100.0143055411863, center: [36.708459323632326 49.360270915532105 21.17526685897741]
cid: 499, volume: 184.9551114065755, center: [38.84202204220192 57.701801082036646 31.722772495201735]
cid: 500, volume: 99.96970938829934, center: [37.20093832077818 63.4200461584684 29.85173692371747]
cid: 501, volume: 103.04684393750051, center: [38.51270805675723 28.459861311872476 40.748833189526835]
cid: 502, volume: 180.19818843196498, center: [37.51709763601396 28.181762091758785 20.950060682172907]
cid: 503, volume: 125.88007421563104, center: [39.38176185081818 34.06934075831365 55.64408284230043]
cid: 504, volume: 127.64905494681433, center: [39.696562233281 24.507279411761967 36.36412116732269]
cid: 505, volume: 161.4083426822534, center: [37.74525276902393 60.389374413934426 27.136584747540983]
cid: 506, volume: 89.44501730697354, center: [38.13179902240653 17.580438128585676 47.44729951131794]
cid: 507, volume: 216.1575530431614, center: [40.18254471578554 42.38345263837425 34.14100497965752]
cid: 508, volume: 95.86686332269775, center: [38.789600861756 51.65282910665219 22.90078419913165]
cid: 509, volume: 139.481900846158, center: [38.0673035643138 55.805182419812425 24.68607558419482]
cid: 510, volume: 174.32636163518012, center: [39.14955725732237 27.683682363085186 59.218812468355075]
cid: 511, volume: 244.550437047868, center: [38.693505713609355 33.76079597355176 61.66645285729135]
cid: 512, volume: 97.725036359655, center: [38.812266326528 44.87136560225129 21.15048465324004]
cid: 513, volume: 120.39474741053327, center: [38.550344407021505 20.36558656153846 28.852969984615388]
cid: 514, volume: 111.93634374630393, center: [38.644693869866956 26.068882912788848 63.7875594138247]
cid: 515, volume: 199.16641879322444, center: [41.08515930711755 42.084011579937304 28.04430683322884]
cid: 516, volume: 137.5791316563138, center: [39.743807887305564 43.97800286888169 49.15994073254457]
cid: 517, volume: 191.40668819089103, center: [38.82302759253557 44.07793717248369 62.3337770946179]
cid: 518, volume: 327.58847372341296, center: [39.466609687893566 56.335005057952536 56.59180949145074]
cid: 519, volume: 102.3481708756046, center: [39.191137972632944 61.87776814287582 39.0362471016122]
cid: 520, volume: 93.66678644694038, center: [39.34026930042575 17.608321722631327 40.686432327471834]
cid: 521, volume: 244.41664858920709, center: [41.04450866878349 39.384599201027854 42.620065977587885]
cid: 522, volume: 97.44259405803749, center: [39.95297857824897 60.72558975560641 42.5130610043936]
cid: 523, volume: 267.5323211689551, center: [39.942054857727896 65.77042909148192 45.49106389288215]
cid: 524, volume: 82.56234437808394, center: [39.3312172301013 23.771227383381348 24.693820029474253]
cid: 525, volume: 176.5561692795288, center: [39.75781343191285 23.503058918439 41.81819358686537]
cid: 526, volume: 109.48355533752039, center: [39.62247810904086 38.291069896252544 24.800044991568228]
cid: 527, volume: 50.6612296796021, center: [40.94686201607266 31.726894490140847 26.734909944454227]
cid: 528, volume: 60.72509484776249, center: [41.16822627037823 35.61787147887393 25.104273807172582]
cid: 529, volume: 180.85226534097393, center: [40.821110147055286 51.34375446697353 39.3351626052359]
cid: 530, volume: 69.70378696233986, center: [39.83792381577347 56.889253769033914 37.184925984900836]
cid: 531, volume: 154.1391697616767, center: [39.75563140030496 19.40644024253062 51.97931501353072]
cid: 532, volume: 170.63974632985696, center: [40.374692317666685 30.99510078929349 46.2646861571217]
cid: 533, volume: 93.57759414116643, center: [40.543456020274895 46.12214233720413 25.9108302249722]
cid: 534, volume: 184.37536141904485, center: [41.61468220021318 46.51430585035878 39.008846459284044]
cid: 535, volume: 123.1745742738213, center: [42.28869495514118 35.23838074880521 40.679135950651705]
cid: 536, volume: 296.3711667025314, center: [40.27900525343713 43.544522849992475 66.94803188983298]
cid: 537, volume: 51.99911426621131, center: [40.38257874973669 18.411661338936536 45.31364452615781]
cid: 538, volume: 85.19351739841538, center: [42.25635993800531 25.786839775833187 33.8926584352818]
cid: 539, volume: 143.24284307295946, center: [41.498187579948194 27.95097239009963 29.30948364922167]
cid: 540, volume: 79.18790214296959, center: [40.124184532627105 22.69959166320631 60.34977099816032]
cid: 541, volume: 172.55738090399683, center: [40.96020556086787 49.29118710620262 65.17135316374052]
cid: 542, volume: 158.18255429009562, center: [41.143927465018024 51.23726882616295 29.128911455483507]
cid: 543, volume: 101.51570935504775, center: [41.7758176509571 53.97192902143799 32.9983414422463]
cid: 544, volume: 356.27866541403273, center: [41.16420592155724 61.60305296470146 57.551040120052576]
cid: 545, volume: 69.70378696233986, center: [40.97018624908332 25.93513445553423 54.663467926935375]
cid: 546, volume: 195.0487073433272, center: [41.38016515390592 33.625838156885905 29.662290296570383]
cid: 547, volume: 92.50728647187907, center: [41.097861839339124 45.38016082474691 57.373100467829026]
cid: 548, volume: 154.00538130301578, center: [41.16422670206661 20.19387250277027 33.06529432418919]
cid: 549, volume: 113.76478601466985, center: [42.10142570756299 30.72077859404155 39.95616222026656]
cid: 550, volume: 121.74749738143814, center: [42.49152346466936 37.53453152153846 32.540836637435895]
cid: 551, volume: 111.50524760172985, center: [42.13678522293053 34.16865173356886 50.02565118441541]
cid: 552, volume: 95.19792102939314, center: [41.179057584229085 40.51400007966895 20.24855200807308]
cid: 553, volume: 196.19334193409287, center: [41.71197991174055 54.814029436816185 43.54241606028943]
cid: 554, volume: 166.62609257002933, center: [41.917391691983035 21.754853896850747 56.45556551257025]
cid: 555, volume: 187.36330366247208, center: [42.54375104390212 44.8492613237623 53.72312570479213]
cid: 556, volume: 98.52776711162052, center: [42.607973700107685 25.756474296228124 43.38828944262221]
cid: 557, volume: 323.05453151323735, center: [41.60487330589069 55.56401873329652 62.61451022350911]
cid: 558, volume: 150.7052659893797, center: [41.96982379159044 65.07626625985402 36.47983407200631]
cid: 559, volume: 88.0476711831817, center: [41.37232076704687 32.707310449383755 20.948032996876584]
cid: 560, volume: 65.76446012399052, center: [42.0580360574469 25.580875034335445 47.10831343813291]
cid: 561, volume: 157.4541504596084, center: [42.720546659913296 46.00833337927681 44.677109349641235]
cid: 562, volume: 342.0970887959751, center: [42.36239126523691 51.403238365206626 51.49977644244557]
cid: 563, volume: 108.6956899698505, center: [42.54720168607332 19.9487315997128 37.353393077543764]
cid: 564, volume: 89.14770962106039, center: [42.83146443933472 32.193094977288645 57.88838715587794]
cid: 565, volume: 122.41643967474275, center: [42.36522479367291 55.031811284371585 25.9941499551184]
cid: 566, volume: 156.48790048039064, center: [44.01539038944359 37.035327318381306 46.528314390396126]
cid: 567, volume: 180.4657653492868, center: [43.20042245547536 58.94839141502471 35.29203548834432]
cid: 568, volume: 164.08411185547183, center: [42.331093515962515 62.84725719746331 31.985343697028448]
cid: 569, volume: 126.16251651724853, center: [43.42535078924995 27.914955035100743 50.468022868681516]
cid: 570, volume: 176.4818423580505, center: [42.328280402312096 39.698350247582546 61.64303122411557]
cid: 571, volume: 200.26645723110315, center: [44.25947974761598 40.59390812186758 54.76869709649644]
cid: 572, volume: 96.89257483909815, center: [42.71789131019012 23.94777393774164 26.704944645013807]
cid: 573, volume: 90.27747882753039, center: [43.29450683421755 29.42245828972501 54.73056623923926]
cid: 574, volume: 110.31601685807722, center: [44.3227241962191 33.5104747853928 44.27187189233257]
cid: 575, volume: 147.3159583699697, center: [42.22501038501833 36.52521203903128 65.86315559064582]
cid: 576, volume: 61.126460223745255, center: [42.674433993058926 37.44846103365759 55.41838401310798]
cid: 577, volume: 125.21113192232643, center: [43.62316130884019 37.72771128513593 50.633616845078954]
cid: 578, volume: 196.19334193409287, center: [43.79019657700507 60.269025031959394 44.35971872868616]
cid: 579, volume: 80.51092134528315, center: [43.53317748379344 55.884801286927626 39.61243881752216]
cid: 580, volume: 89.35582500119959, center: [42.87199059089055 19.20308123182499 42.53581519144901]
cid: 581, volume: 58.92638334798789, center: [44.50706329263304 27.979346328708374 36.155996284889]
cid: 582, volume: 177.23997695712904, center: [43.52165874556304 28.66704333381699 23.44138189507674]
cid: 583, volume: 162.59757342590603, center: [43.594034011442645 58.15827819511794 48.46356678230938]
cid: 584, volume: 106.27263232965828, center: [44.806134787727316 29.440591842047837 31.520124639865717]
cid: 585, volume: 130.74105488031117, center: [42.952372306211906 36.412873528959636 20.734523177055145]
cid: 586, volume: 107.1496900031021, center: [42.74681957616899 48.96212135672864 23.293875754827972]
cid: 587, volume: 165.1544195247592, center: [43.56667336033113 63.707410810153014 51.4319343819802]
cid: 588, volume: 58.06419105883973, center: [42.94782625308596 20.303204717204302 48.70226620322581]
cid: 589, volume: 109.2308438044942, center: [44.375969304074175 36.25303791908002 60.17867537690528]
cid: 590, volume: 107.83349768070235, center: [44.578190366481536 38.255904634201826 27.033355414929694]
cid: 591, volume: 171.3235540074572, center: [45.37870959867492 32.01901649432538 34.48200882510195]
cid: 592, volume: 184.0037268116534, center: [44.72009450914611 40.239197015365974 36.526544252035876]
cid: 593, volume: 68.33617160713933, center: [44.01454171003834 49.125321450424195 33.533228225038066]
cid: 594, volume: 111.10388222574709, center: [45.18628855423394 27.612770694059407 39.59306134423334]
cid: 595, volume: 17.451961163102368, center: [44.44346798465234 33.776403706303235 37.364017343611586]
cid: 596, volume: 190.05393821998615, center: [44.9159387180975 46.57017794595229 28.48521986496676]
cid: 597, volume: 109.36463226315512, center: [43.741213894799024 59.222430893434826 28.889933644338726]
cid: 598, volume: 103.00224778461354, center: [44.64510210731442 22.602470111516812 51.49376963020638]
cid: 599, volume: 164.67872722729814, center: [43.92562814311616 27.094550648059215 61.046341430294284]
cid: 600, volume: 112.41203604376499, center: [45.29747698884386 42.83621075078022 46.40113131621264]
cid: 601, volume: 153.0094005552067, center: [45.28183659053562 53.2199634252696 34.42818009664821]
cid: 602, volume: 125.16653576943946, center: [44.73070470631767 44.49670958861045 59.94082532397862]
cid: 603, volume: 42.79744138719907, center: [45.070838214533325 50.69878821007294 30.27150720229246]
cid: 604, volume: 209.46813011011537, center: [44.339410627343895 64.45780802414306 40.58725323517139]
cid: 605, volume: 88.35984425339052, center: [45.26861473376169 23.261899125504712 30.899133957133245]
cid: 606, volume: 123.02592043086472, center: [45.823465811181 49.82795849249638 42.750718314511836]
cid: 607, volume: 274.6974363994622, center: [45.59557139658354 57.57163597872179 53.09755533604091]
cid: 608, volume: 169.28699635895208, center: [46.457418609257154 28.78174112655427 45.06252793011064]
cid: 609, volume: 118.15007438188893, center: [45.28538972420467 32.4052983377076 63.25899546171364]
cid: 610, volume: 58.6736718149617, center: [46.09596035801925 31.065977519483152 52.794831356321254]
cid: 611, volume: 112.41203604376499, center: [45.56544226312422 21.45405421372653 46.13114314415499]
cid: 612, volume: 98.91426710330762, center: [46.52161201811883 34.560157962849416 30.10429233719567]
cid: 613, volume: 78.9054598413521, center: [45.36632960102261 40.52639787371891 22.47971534971741]
cid: 614, volume: 166.13553488827262, center: [47.16495071882461 45.90496322252148 33.16761845054581]
cid: 615, volume: 150.25930446050998, center: [46.556583723861024 49.77835351516621 46.448154005193906]
cid: 616, volume: 89.54907499704315, center: [46.03225746650297 22.363346189342632 35.421947269272906]
cid: 617, volume: 115.32565136571394, center: [46.22532344779766 33.24715989752514 55.66925443089714]
cid: 618, volume: 49.93282584911486, center: [46.852729485137544 32.20207493774933 38.74603295930336]
cid: 619, volume: 147.7470545145438, center: [47.14108723854835 46.610050049984906 49.460303745970414]
cid: 620, volume: 97.01149791346342, center: [46.40936386108479 50.11066116624272 25.064256805117992]
cid: 621, volume: 131.58838178516368, center: [46.578767901129204 22.07472694914144 40.4343278866132]
cid: 622, volume: 125.73142037267446, center: [46.10809422226812 33.63264233817687 23.734353725313316]
cid: 623, volume: 81.87853670048368, center: [47.761609895020605 49.16806979716776 35.37285236279956]
cid: 624, volume: 213.7196300186735, center: [48.16052011283695 39.50902874272796 42.824712196313556]
cid: 625, volume: 76.43780604827289, center: [46.60991883480361 54.5614298529755 45.835257534014005]
cid: 626, volume: 275.00960946967103, center: [48.02855124757832 44.76550354534054 41.034229369151355]
cid: 627, volume: 100.89136321463012, center: [46.79927033392857 25.78032016014439 56.60453793792545]
cid: 628, volume: 142.0982084821938, center: [47.89316917491668 42.15300916548802 49.023816544136416]
cid: 629, volume: 149.88766985311852, center: [46.84799194032049 43.61113105733413 24.08138379648914]
cid: 630, volume: 59.17909488101407, center: [47.191031725886106 25.426475995478523 29.375134924415974]
cid: 631, volume: 60.026421785866575, center: [46.83604978759937 27.314843751708764 26.63678466872214]
cid: 632, volume: 111.50524760172985, center: [47.53174474248081 29.966852519024133 49.342960126689775]
cid: 633, volume: 111.99580528348656, center: [48.05514635661602 35.42147532172817 34.299862398619595]
cid: 634, volume: 146.9740545311696, center: [47.49745097441733 57.71143803070699 38.98430328615354]
cid: 635, volume: 96.81824791761986, center: [47.812105444937 39.19327151649009 31.05394947001382]
cid: 636, volume: 161.34888114507078, center: [47.621182187161274 46.948019432338306 63.31832752564953]
cid: 637, volume: 83.76644050603223, center: [47.07136332188208 61.871715869441 35.28747582559006]
cid: 638, volume: 179.42518844859077, center: [47.82675027200868 41.24056191253521 64.07386077188899]
cid: 639, volume: 125.34492038098735, center: [48.25565472610486 42.62757997339896 31.442311304459203]
cid: 640, volume: 197.73934190084128, center: [48.81767382679677 51.9819296962562 37.89115640974289]
cid: 641, volume: 172.4979193668142, center: [48.23771023111485 47.686671207600824 57.69143448914168]
cid: 642, volume: 120.54340125348985, center: [48.816991795391324 31.76078493603404 41.50880163081761]
cid: 643, volume: 76.28915220531631, center: [49.014297272385114 34.958142698382694 53.07612297533125]
cid: 644, volume: 49.44226816735815, center: [48.61733639976009 38.26948615210463 24.039186847053518]
cid: 645, volume: 238.29211025939603, center: [49.54019390359483 50.8801120171179 61.62468100021834]
cid: 646, volume: 112.85799757263472, center: [47.691762905675496 24.770287544533723 52.621616690081666]
cid: 647, volume: 275.36637869276683, center: [48.26233291149174 51.92393143500324 56.02847335047506]
cid: 648, volume: 73.73230610646314, center: [48.1312246602569 53.279299145625004 28.396863872661292]
cid: 649, volume: 124.69084347197841, center: [47.923196646727796 57.35427381337625 30.747213855472104]
cid: 650, volume: 186.02541907586289, center: [48.81813281014542 57.019370169642 59.247194108918016]
cid: 651, volume: 172.89928474279697, center: [48.28243744806659 62.71824250925974 48.8111665676812]
cid: 652, volume: 86.15976737763314, center: [48.72344556466054 25.473159088043477 33.76338755144928]
cid: 653, volume: 149.90253523741418, center: [49.545757588282555 37.11931501600555 56.13194767508925]
cid: 654, volume: 77.2108060316471, center: [49.14333522461869 39.94742446536388 58.13469912533693]
cid: 655, volume: 148.04436220045696, center: [49.01315065740698 62.76569983787529 43.69854055481474]
cid: 656, volume: 165.58551566933326, center: [49.20595907582361 24.554046326770806 47.0679471876111]
cid: 657, volume: 130.78565103319815, center: [50.19661501377143 25.31169637249375 40.95261487092521]
cid: 658, volume: 70.10515233832263, center: [48.43081982239046 28.530862543193386 58.01269515349873]
cid: 659, volume: 124.5867857819088, center: [48.53053198214329 31.906265007505073 60.518258891969936]
cid: 660, volume: 84.4502481836325, center: [49.19342940396289 33.65275558341841 50.3782913666256]
cid: 661, volume: 120.03797818743749, center: [50.25206872988541 33.21328820136223 46.547525569523216]
cid: 662, volume: 149.7538813944576, center: [49.80912850259372 35.34092048052412 37.75203443135795]
cid: 663, volume: 185.9808229229759, center: [50.57883035348315 53.864665285916395 41.46232253415394]
cid: 664, volume: 43.109614457407886, center: [50.42830294107125 35.50046928062069 40.75866586665517]
cid: 665, volume: 204.17605330086116, center: [51.14624703421984 40.882128811714594 35.439678851139426]
cid: 666, volume: 98.06694019845511, center: [49.181555451528595 43.51755572428377 58.57656094638472]
cid: 667, volume: 128.73422800039737, center: [51.364538223380656 46.61516376911086 36.346940464780594]
cid: 668, volume: 218.16437992307524, center: [50.320400504758176 56.59402233953393 46.32149054104661]
cid: 669, volume: 54.8978642038646, center: [49.224801969280634 24.515771333793666 37.511397937124286]
cid: 670, volume: 189.62284207541208, center: [50.94049147799988 37.720495492521174 61.66699198558325]
cid: 671, volume: 440.66945206048257, center: [52.142862547469534 52.597569276663066 51.181463289944]
cid: 672, volume: 109.92951686639012, center: [49.69546803763541 34.305704216795135 26.169826660608518]
cid: 673, volume: 103.89417084235302, center: [50.63858148479496 39.80929771974532 26.430827004321074]
cid: 674, volume: 212.56013004361222, center: [51.840778023722294 41.71597645277292 52.69558228588013]
cid: 675, volume: 164.14357339265445, center: [50.72591372189054 50.76637427904365 29.360605548659663]
cid: 676, volume: 189.80122668695998, center: [51.46566281118123 37.581000556907895 49.643483579276314]
cid: 677, volume: 128.60043954173642, center: [51.01842701632976 46.429763029360764 27.052486208808233]
cid: 678, volume: 134.84390094591274, center: [50.48947891797944 60.58687153685371 36.77285245512071]
cid: 679, volume: 109.8254591763205, center: [51.92388901688547 36.010210051786686 44.50870053784515]
cid: 680, volume: 207.49103399879286, center: [52.12091774770697 45.988690913139415 53.56947356344032]
cid: 681, volume: 112.96205526270433, center: [51.14695233009832 28.734398271101462 54.30406633580734]
cid: 682, volume: 31.559210859681706, center: [50.788726085111115 43.42151855426283 26.988150826943006]
cid: 683, volume: 146.260516084978, center: [50.85746591269913 60.34828534933428 53.937297587041364]
cid: 684, volume: 109.87005532920749, center: [50.5049306340592 28.201521198809363 31.380702311527536]
cid: 685, volume: 87.28953658410315, center: [52.11106099023077 27.151397975374657 43.37180427859332]
cid: 686, volume: 122.53536274910802, center: [51.164408681262834 55.70734931169477 32.539164795365764]
cid: 687, volume: 142.32118924662868, center: [51.52967861035718 27.960887375997494 36.764121474347185]
cid: 688, volume: 175.48586161024141, center: [52.737843824897595 33.35483749895807 57.380014477001275]
cid: 689, volume: 176.92780388692023, center: [53.09026404941483 37.19899925305831 29.56710244867249]
cid: 690, volume: 128.79368953757998, center: [53.367689683230694 38.82030205110803 40.36946148760388]
cid: 691, volume: 182.29420761765275, center: [53.29528724119 33.198993915705785 31.47730057649841]
cid: 692, volume: 77.73109448199511, center: [52.96161363982454 61.18375013333334 45.48824788634538]
cid: 693, volume: 116.93111286964499, center: [53.76480080630007 28.95617169672006 46.59755940987795]
cid: 694, volume: 168.84103483008235, center: [53.32385366782872 29.332933961251978 50.74634573153724]
cid: 695, volume: 91.94240186864407, center: [53.759592970008846 42.88469257178658 39.236346673581245]
cid: 696, volume: 119.51768973708946, center: [53.260909646354285 48.976159125746264 40.856182901716416]
cid: 697, volume: 190.4998997488559, center: [54.06609619575913 50.48860413324229 45.36259304067109]
cid: 698, volume: 56.48846032349999, center: [54.78948445339208 45.9306885256579 39.94685385986842]
cid: 699, volume: 133.9073817352863, center: [54.67151076626475 45.902361558836596 48.60507843110569]
cid: 700, volume: 202.748976408478, center: [54.03278164555322 59.12912585285578 40.70207346079625]
cid: 701, volume: 145.78482378751696, center: [54.76555719652984 45.762187289507494 44.66214652719486]
cid: 702, volume: 106.36182463543223, center: [54.31320481592203 29.933666502473795 41.037641985828095]
cid: 703, volume: 132.18299715698998, center: [53.86760410300288 30.722385348279353 35.40289428232119]
cid: 704, volume: 117.79330515879315, center: [54.76011986559885 47.766076587985864 31.445723264045935]
cid: 705, volume: 143.10905461429854, center: [54.15831501344948 55.722071836833905 35.475165715612334]
cid: 706, volume: 176.98726542410287, center: [54.6958863170888 42.93753129355787 29.810059830967578]
cid: 707, volume: 212.85743772952537, center: [54.79286580149268 44.348780627697465 59.62949281374398]
cid: 708, volume: 165.85309258665512, center: [54.95518503704326 50.65042620801291 33.80090237329927]
cid: 709, volume: 167.35449640051655, center: [54.30609813706482 55.15173753930538 57.16446579750399]
cid: 710, volume: 135.58717016069565, center: [54.431992003586636 59.47689463192632 49.49609175310821]
cid: 711, volume: 83.58805589448433, center: [54.823038110945355 40.93162679674551 46.58787346763293]
cid: 712, volume: 80.36226750232657, center: [54.90342740050961 41.61981025083241 43.10475284278579]
cid: 713, volume: 65.14011398357289, center: [56.010749192124955 31.261152299041534 44.11407038051118]
cid: 714, volume: 110.31601685807722, center: [55.733269575510995 33.83279916063873 53.34629013104703]
cid: 715, volume: 188.56739979042038, center: [56.28919650093663 33.64249508977532 39.26478653023256]
cid: 716, volume: 156.0419389515209, center: [56.86537894505676 37.235168898485284 34.930452473478134]
cid: 717, volume: 178.93463076683406, center: [56.134075266961624 39.03860738269503 56.51084368669103]
cid: 718, volume: 78.23651754804749, center: [56.62416981681549 39.95080410216607 32.42893210197606]
cid: 719, volume: 172.33440013956195, center: [56.80205370077079 49.70596102604158 56.97991000244975]
cid: 720, volume: 127.4855357195621, center: [57.15242565510048 56.99383449570896 51.927156511497195]
cid: 721, volume: 92.89378646356617, center: [56.70601844849912 57.967017593086894 45.39077341982717]
cid: 722, volume: 163.40030417787156, center: [57.35276461598555 34.23360406462882 48.07417061935043]
cid: 723, volume: 139.46703546186234, center: [57.13176984593803 53.21055839165423 37.45616916065871]
cid: 724, volume: 152.4147851833804, center: [58.051480932676164 38.18873491161611 50.8759261013557]
cid: 725, volume: 142.52930462676787, center: [57.75099152617716 54.93940000929286 42.24495922237171]
cid: 726, volume: 184.94024602227984, center: [58.54822021095373 36.30883360019291 43.754297270966966]
cid: 727, volume: 66.13609473138196, center: [58.58634261661166 36.63382075927174 39.21415312724208]
cid: 728, volume: 111.89174759341697, center: [58.80229363266265 43.008139986608214 36.480680430091674]
cid: 729, volume: 68.51455621868723, center: [57.17595251729026 44.13398376736819 33.93723874029074]
cid: 730, volume: 74.75801762286355, center: [58.481094977029905 42.464936604255314 55.29574209138994]
cid: 731, volume: 158.37580428593918, center: [59.361728914945985 46.46594402187911 53.44115371695138]
cid: 732, volume: 175.15882315573694, center: [59.17959925386322 54.37902430410762 46.9935442108037]
cid: 733, volume: 103.46307469777894, center: [59.28038779037353 52.65369442827586 52.86241532551724]
cid: 734, volume: 172.20061168090103, center: [59.09186175272036 47.52827267615677 37.35648459501899]
cid: 735, volume: 83.05290205984065, center: [59.477987161550985 50.92403118433864 40.277077153552895]
cid: 736, volume: 110.83630530842525, center: [59.25050637565414 42.019062547210304 51.15307911856223]
cid: 737, volume: 105.11313235459696, center: [59.61456094826023 40.00957978341112 38.84058440721256]
cid: 738, volume: 140.46301620967142, center: [60.204672822927584 50.30211800700603 49.328397509799984]
cid: 739, volume: 120.98936278235959, center: [60.27890927174908 40.729488611647625 46.664147665536305]
cid: 740, volume: 187.7052075012722, center: [60.71160758217129 42.916954995438346 41.95006454604419]
cid: 741, volume: 174.2223039451105, center: [60.97428888080157 46.0557609825256 47.73983048114335]
cid: 742, volume: 160.90291961620102, center: [60.89442765513181 49.053939834035475 43.27448827114745]
cid: 743, volume: 39.54192222645, center: [1.0987402307980254 34.183473611052634 24.46444940131579]
cid: 744, volume: 40.062210676798024, center: [1.8179862779274611 15.89366094 48.29335917896104]
cid: 745, volume: 105.29151696614485, center: [1.5982595788412892 34.475962814273615 14.19804437090216]
cid: 746, volume: 98.1115363513421, center: [1.5521346850361653 12.187580648409092 47.62130709827273]
cid: 747, volume: 63.14815248795473, center: [2.5612766895533725 30.315598941101694 16.0808214875]
cid: 748, volume: 90.72344035640012, center: [3.469088864113761 35.01416011327216 22.3342760964116]
cid: 749, volume: 88.74634424507762, center: [2.2505063651786026 7.821780121055276 49.31331542432161]
cid: 750, volume: 22.907557199608814, center: [4.028258610899425 10.175540786437379 46.77860185269306]
cid: 751, volume: 48.95171048560144, center: [3.9099821999570747 12.629462772972975 44.34659011621622]
cid: 752, volume: 104.66717082572723, center: [5.338717873838806 34.167678534128676 15.908341551810823]
cid: 753, volume: 46.811095147026705, center: [6.0053024989531965 34.310608011845034 20.844462596379802]
cid: 754, volume: 153.1877851667546, center: [2.7988822775222153 55.3858587074527 22.82401409426492]
cid: 755, volume: 62.523806347537096, center: [4.697841575804825 17.17370305149786 57.26641448794579]
cid: 756, volume: 222.10370676142458, center: [5.749844839025803 43.52095259726926 18.59121471239542]
cid: 757, volume: 191.4810151123693, center: [7.987715421413031 56.63045282652744 21.94584041197888]
cid: 758, volume: 171.6208616933704, center: [6.846146926557904 11.53136860064097 46.444153407752275]
cid: 759, volume: 157.2757658480605, center: [7.80668510711812 37.4928908857656 19.176311432835536]
cid: 760, volume: 92.34376724462683, center: [8.781541214919391 18.990415333676754 19.709997483226015]
cid: 761, volume: 52.05857580339394, center: [9.334318001956408 27.873812252484296 15.534388992490005]
cid: 762, volume: 194.9446496532576, center: [11.079555414074377 67.16916119478421 36.46537242682629]
cid: 763, volume: 196.60957269437128, center: [13.165517176418403 61.22288905869499 25.225983524829882]
cid: 764, volume: 69.9713638796617, center: [12.205261392682877 18.95761503027406 19.672391228999363]
cid: 765, volume: 13.646422783413946, center: [11.27404361070258 65.77795796764705 37.99360573006536]
cid: 766, volume: 207.31264938724496, center: [11.597621430206585 31.006193512182705 21.698383945245947]
cid: 767, volume: 179.9157461303475, center: [12.80899166794548 53.35108753030653 19.136812516657027]
cid: 768, volume: 83.02317129124933, center: [19.666007963549774 31.613115700608777 18.949109492658906]
cid: 769, volume: 102.82386317306565, center: [12.112833625791206 47.35888376586671 17.27753898445858]
cid: 770, volume: 106.92670923866723, center: [14.214492419868346 63.82327016446545 29.015499070318366]
cid: 771, volume: 95.13845949221052, center: [15.874955995785252 29.711758836046876 21.118507081546877]
cid: 772, volume: 147.99976604756998, center: [15.929756796101593 14.862823281900361 51.533347559150265]
cid: 773, volume: 73.65797918498485, center: [15.667374612447215 17.98072479741675 18.418924426861757]
cid: 774, volume: 93.25055568666197, center: [16.788724169476566 14.67604428029651 46.44041803935916]
cid: 775, volume: 98.39397865295959, center: [16.17849553966604 47.18845685334643 17.18054607248829]
cid: 776, volume: 327.70739679777824, center: [14.73149343048491 23.031299083941935 20.73154056074847]
cid: 777, volume: 126.96524726921406, center: [17.335201093337073 58.33156230038637 21.013828447874957]
cid: 778, volume: 43.198806763181835, center: [16.967677560432445 15.255027092807984 20.565867899690296]
cid: 779, volume: 230.29453350833208, center: [19.21728449935248 24.526496237606505 24.362328161231606]
cid: 780, volume: 277.00157096528915, center: [14.529128325992138 69.16927034008265 49.06628185672427]
cid: 781, volume: 100.51972860723868, center: [17.795447309686406 18.19176677826087 24.10908750062112]
cid: 782, volume: 25.40494176127934, center: [20.600517447361003 15.63884962592159 43.20943112264482]
cid: 783, volume: 26.965807112323418, center: [20.14027547293209 19.29038606163175 16.11971359332966]
cid: 784, volume: 40.225729904050255, center: [24.256718632457144 20.440420031042127 15.139391285920176]
cid: 785, volume: 125.8949395999267, center: [22.561486676371633 14.206822152497343 46.39563845979455]
cid: 786, volume: 78.75680599839552, center: [22.46085188645708 58.54340443776897 20.758416091166477]
cid: 787, volume: 142.00901617641986, center: [23.396059128980376 23.094693136229456 65.31696045362713]
cid: 788, volume: 77.92434447783867, center: [24.96936579280679 31.2090800217665 17.924938505608548]
cid: 789, volume: 61.319710219588806, center: [24.913834054621933 17.21999008749091 24.14182655818182]
cid: 790, volume: 68.29157545425235, center: [26.59396075989867 13.588087363909448 22.449488048410974]
cid: 791, volume: 26.32659558761013, center: [28.613309184166916 26.738006025296446 19.793540760474308]
cid: 792, volume: 172.51278475110985, center: [28.04210839287661 20.17643802170616 27.74971915765618]
cid: 793, volume: 35.66205692528329, center: [42.442602327169936 44.554405024802 21.168659308086703]
cid: 794, volume: 27.976653244428153, center: [45.5964301177147 55.24608054691817 26.866875297927738]
cid: 795, volume: 70.34299848705315, center: [1.683858022455066 38.35528116923077 16.205783221153848]
cid: 796, volume: 54.52622959647315, center: [12.409977451415811 58.24777862118321 21.395037584541985]
cid: 797, volume: 170.8032655571092, center: [12.77715323237716 37.24816651454308 18.08734395926893]
cid: 798, volume: 47.80707589483578, center: [12.305280652388626 26.8224944443097 16.12246136623134]
cid: 799, volume: 241.19086019704932, center: [26.023027432715857 68.17775711319568 38.77672992935594]
cid: 800, volume: 226.63764897160024, center: [6.056534697163055 61.005778046969695 25.662183540909094]
cid: 801, volume: 159.55016964529617, center: [17.0320055058409 42.50180803533961 15.905367061324887]
cid: 802, volume: 146.20105454779537, center: [22.63851314742816 7.674223536512455 44.983125940355876]
cid: 803, volume: 103.07657470609183, center: [19.985958572223893 64.01016367021921 28.160572406504183]
cid: 804, volume: 55.92357572026499, center: [31.70214701108356 68.11295535422647 39.70100696858054]
cid: 805, volume: 88.07740195177301, center: [48.91461643314284 30.33816576637975 27.411091524050633]
cid: 806, volume: 49.87336431193223, center: [4.471170298247482 33.782612585543966 11.391019424262295]
cid: 807, volume: 63.83196016555499, center: [19.541136637401745 18.60741366043316 20.14589480812762]
cid: 808, volume: 186.7538229063501, center: [19.72052496883499 23.510019115219293 16.17764156702221]
cid: 809, volume: 202.12463026806037, center: [22.31026314515147 27.80684605523277 20.423433005273225]
cid: 810, volume: 162.06241959126234, center: [26.4802986266888 23.68496505715465 23.16680124790864]
cid: 811, volume: 44.92319134147815, center: [21.880951197409843 18.40796975539378 24.28670800701522]
cid: 812, volume: 58.49528720341381, center: [1.9729813181239009 38.27077466188056 11.189208320584498]
cid: 813, volume: 23.294057191295916, center: [0.668921239649041 14.561315189215062 51.739115748436504]
cid: 814, volume: 121.42045892693366, center: [5.039325438094354 15.11770634544564 51.75058762209843]
cid: 815, volume: 283.57207082396997, center: [10.468773830883336 17.414177833251205 57.494250561407]
cid: 816, volume: 215.47374536556114, center: [23.934747648392374 18.547331525774403 19.90439295568127]
cid: 817, volume: 9.09761518894263, center: [28.27687528549678 15.757633976960784 19.58161836029412]
cid: 818, volume: 120.05284357173315, center: [14.079729436193611 15.450865930869242 51.44905116716196]
cid: 819, volume: 33.00115313636052, center: [7.458348209900577 34.64085884662162 11.643990222162161]
cid: 820, volume: 141.57792003184576, center: [10.752357398147062 42.81446818280134 17.383238196419573]
cid: 821, volume: 127.78284340547525, center: [14.570815696749436 27.524468278094464 11.537840342833876]
cid: 822, volume: 379.91462644412877, center: [20.333938809965943 36.443420040016434 16.719754872473295]
cid: 823, volume: 110.31601685807722, center: [10.439069130457925 31.159394379948797 12.778712444387548]
cid: 824, volume: 124.06649733156077, center: [15.389071668420343 27.573320609813084 16.044567192739038]
cid: 825, volume: 50.780152753967364, center: [8.92200636573282 31.636911850819672 16.966837752663935]
cid: 826, volume: 37.564826115127495, center: [0.5900525801223176 7.8057943321329635 43.88813136066482]
cid: 827, volume: 134.2641509583821, center: [2.2168421830527087 7.842529999723206 37.1423228995682]
cid: 828, volume: 45.0123836472521, center: [1.7224950869201432 13.869636114233819 21.810002126254954]
cid: 829, volume: 216.6183799563268, center: [3.010425425611126 12.495489212956356 26.916683850000002]
cid: 830, volume: 160.8880542319054, center: [2.1818465630549952 12.220866840737317 33.45000441490345]
cid: 831, volume: 251.62635997260116, center: [2.7681374207667018 16.591757505222425 41.6463924905122]
cid: 832, volume: 61.83999866993683, center: [0.9280784354628038 16.888467934759614 25.034614822572117]
cid: 833, volume: 30.26592242595947, center: [1.0809656672645547 21.795071044597247 23.23694698747544]
cid: 834, volume: 262.5226866613184, center: [2.7207408535320865 27.16280931677803 26.236468221438276]
cid: 835, volume: 18.15063422499829, center: [0.7109840431208252 29.70540413169533 31.582172191646194]
cid: 836, volume: 25.31574945550539, center: [0.748507638131941 30.852083997357603 25.855831383558428]
cid: 837, volume: 169.1383425159955, center: [2.2189804306194336 31.8122955032431 35.49136020698717]
cid: 838, volume: 60.44265254614499, center: [1.9297002967335002 46.134342311067385 39.13492292353664]
cid: 839, volume: 29.805095512794075, center: [0.5070821514711059 8.211690787930175 30.087937471870323]
cid: 840, volume: 347.359434836638, center: [3.4838827397924303 21.332802392990114 30.947217371254332]
cid: 841, volume: 205.40988019740075, center: [3.5885358887402163 17.81490311762918 36.61604714270517]
cid: 842, volume: 211.37089929995958, center: [4.753077203438379 8.418292306463183 29.783216279189816]
cid: 843, volume: 54.10999883619473, center: [2.3787160562577347 20.757603277500003 25.963320248653847]
cid: 844, volume: 185.25241909248865, center: [6.638419288067872 14.539033786711604 34.69333685609052]
cid: 845, volume: 115.9351321218359, center: [4.632504025734886 35.280555894691624 47.924399751775866]
cid: 846, volume: 21.629134150182235, center: [0.5346830692241882 34.26501079010309 47.959381628041236]
cid: 847, volume: 91.49644033977432, center: [6.675288056845215 13.68436370090983 22.254371448643383]
cid: 848, volume: 151.0323044438842, center: [6.8281399515345145 22.739046227893702 25.926933965728345]
cid: 849, volume: 55.15057573689078, center: [6.814321177415061 7.955782123584906 37.80362718735849]
cid: 850, volume: 126.34090112879643, center: [10.815699151751447 7.212534729403459 35.3300314306036]
cid: 851, volume: 86.88817120812038, center: [7.911344301650034 10.815977664071855 33.93846631185629]
cid: 852, volume: 55.80465264589973, center: [9.277701951932164 34.991467836680876 46.98471233670751]
cid: 853, volume: 192.75943816179588, center: [11.67197080397179 8.811772988370478 30.521968555525564]
cid: 854, volume: 50.6612296796021, center: [8.780165208088146 14.992771456249999 40.02876731073944]
cid: 855, volume: 96.07497870283696, center: [12.840870981507377 13.996038252467896 39.46329063889834]
cid: 856, volume: 118.70009360082827, center: [15.1851158035686 10.786429396643706 34.8288708944521]
cid: 857, volume: 14.25590353953592, center: [3.6157167915563724 16.379660693430658 45.10480989416058]
cid: 858, volume: 102.98738240031788, center: [19.491100217209905 9.237929419702656 36.481472854503465]
cid: 859, volume: 19.280403431468287, center: [0.6474326811929576 35.53167053477255 19.431446854279105]
cid: 860, volume: 586.9002373768693, center: [11.281996831522456 14.711590162174211 29.533191768103645]
cid: 861, volume: 253.15749455505392, center: [12.962592242384925 16.841376928890192 34.059521221779214]
cid: 862, volume: 24.111653327557104, center: [13.596315633170331 15.606495108199754 26.11320075]
cid: 863, volume: 241.81520633746695, center: [2.7793597237830836 24.72210858261511 17.755855278895925]
cid: 864, volume: 98.51290172732486, center: [6.638868854857338 30.905021029470348 24.85224433626075]
cid: 865, volume: 362.86403065700915, center: [7.165585122013226 26.508907673412537 20.09135659885293]
cid: 866, volume: 33.105210826430124, center: [8.124357609109127 32.09891533039964 21.139627131971263]
cid: 867, volume: 661.8812357641676, center: [12.94249545711834 12.094960581924761 46.293402888687254]
cid: 868, volume: 401.2613182926935, center: [6.434533969086724 48.102809427640494 53.667916401607826]
cid: 869, volume: 261.55643668210064, center: [6.559151243853827 52.130534557425406 52.25049762100597]
cid: 870, volume: 658.1500243059576, center: [19.59207561359156 52.051672871757695 63.57200850232416]