{"cid": 2, "neighbors ids": [1, 4, 3, 649, 6, 97, 100, 620, 627] }
{"cid": 4, "neighbors ids": [1, 2, 650, 6, 5, 7, 10, 653, 649, 617, 656, 97, 100, 203, 143, 659] }
{"cid": 647, "neighbors ids": [1, 650, 651, 5] }
{"cid": 650, "neighbors ids": [1, 647, 4, 5, 651, 76, 653, 617, 656, 655] }
{"cid": 3, "neighbors ids": [1, 2, 649, 620, 627] }
{"cid": 651, "neighbors ids": [1, 647, 648, 5, 76, 78, 59, 46, 643, 650, 82, 92, 8, 654, 622, 655, 658] }
{"cid": 648, "neighbors ids": [1, 651, 76, 654, 598, 8] }
{"cid": 649, "neighbors ids": [1, 3, 2, 6, 599, 600, 601, 614, 603, 645, 652, 4, 10, 7, 611, 63, 620, 97, 119, 104, 203, 623, 624, 140, 137, 625, 678, 657, 199, 626] }
{"cid": 5, "neighbors ids": [647, 650, 651, 76, 4, 7, 65, 11, 617, 655, 656, 143, 659, 146] }
{"cid": 6, "neighbors ids": [2, 4, 649, 600, 7, 603, 10] }
{"cid": 76, "neighbors ids": [651, 5, 648, 8, 11, 65, 650, 655, 131, 658, 146, 143, 659, 162, 673] }
{"cid": 654, "neighbors ids": [648, 1, 598, 607, 9, 8, 651, 613, 622, 145] }
{"cid": 7, "neighbors ids": [4, 5, 65, 6, 10, 63, 649, 617, 119, 143, 203, 152] }
{"cid": 598, "neighbors ids": [648, 654, 8, 607, 9] }
{"cid": 8, "neighbors ids": [648, 76, 598, 11, 9, 81, 65, 654, 651, 77, 131, 622, 145, 141, 658, 162] }
{"cid": 607, "neighbors ids": [654, 1, 598, 9, 684, 16, 64, 613] }
{"cid": 599, "neighbors ids": [1, 649, 604, 601, 645, 652] }
{"cid": 600, "neighbors ids": [649, 6, 603, 614] }
{"cid": 65, "neighbors ids": [5, 7, 11, 63, 13, 76, 8, 71, 77, 108, 131, 143, 146, 152] }
{"cid": 11, "neighbors ids": [5, 8, 65, 13, 81, 15, 19, 76, 71, 77] }
{"cid": 603, "neighbors ids": [600, 6, 10, 614, 12, 605, 649, 611] }
{"cid": 9, "neighbors ids": [598, 607, 8, 81, 16, 654, 613, 64, 622, 145, 141, 123] }
{"cid": 10, "neighbors ids": [6, 7, 603, 63, 54, 605, 4, 649, 611, 104, 119, 114] }
{"cid": 604, "neighbors ids": [1, 599, 601, 606, 602, 652, 645, 609, 608] }
{"cid": 601, "neighbors ids": [649, 599, 614, 604, 602, 12, 645] }
{"cid": 63, "neighbors ids": [7, 65, 10, 13, 54, 14, 108, 649, 94, 119, 114, 152, 165] }
{"cid": 614, "neighbors ids": [649, 600, 601, 12, 603, 602, 608, 645, 611, 616, 104, 67, 618, 686, 624, 140, 696] }
{"cid": 13, "neighbors ids": [65, 63, 11, 14, 19, 71, 108, 94] }
{"cid": 606, "neighbors ids": [1, 604, 602, 644, 646, 680, 609, 615] }
{"cid": 684, "neighbors ids": [1, 607, 16, 685, 64, 621, 613, 133] }
{"cid": 602, "neighbors ids": [601, 604, 606, 12, 646, 614, 608, 645, 609, 680] }
{"cid": 81, "neighbors ids": [8, 9, 11, 15, 16, 77, 64, 141, 109, 138, 131, 123, 129, 163, 146, 166] }
{"cid": 12, "neighbors ids": [614, 603, 601, 602, 605, 54, 18, 646, 610, 67, 68, 608, 618, 611, 616, 104] }
{"cid": 54, "neighbors ids": [10, 63, 14, 605, 17, 12, 18, 21, 67, 94, 90, 104, 111, 114] }
{"cid": 14, "neighbors ids": [63, 13, 54, 17, 19, 94, 108] }
{"cid": 16, "neighbors ids": [9, 607, 684, 81, 15, 64, 22, 24, 93, 613] }
{"cid": 605, "neighbors ids": [603, 10, 54, 12, 67, 611, 104] }
{"cid": 15, "neighbors ids": [11, 81, 19, 16, 22, 20, 71, 61, 77, 93, 23, 64, 109, 138, 129] }
{"cid": 19, "neighbors ids": [13, 11, 15, 14, 17, 20, 25, 23, 53, 28, 71, 73, 84, 108, 94, 109, 61, 115] }
{"cid": 71, "neighbors ids": [13, 11, 19, 15, 65, 77, 108, 109, 146, 152] }
{"cid": 644, "neighbors ids": [606, 1, 646, 668, 680] }
{"cid": 17, "neighbors ids": [54, 14, 19, 21, 25, 79, 84, 94, 90, 122, 111] }
{"cid": 685, "neighbors ids": [684, 1, 64, 24, 619, 72, 621] }
{"cid": 64, "neighbors ids": [16, 684, 685, 24, 621, 607, 613, 9, 93, 133, 81, 15, 105, 123, 138] }
{"cid": 646, "neighbors ids": [606, 602, 12, 644, 668, 610, 680, 609, 608, 68, 618, 616, 708, 701, 1, 693] }
{"cid": 18, "neighbors ids": [12, 54, 21, 610, 68, 50, 67] }
{"cid": 22, "neighbors ids": [15, 16, 24, 20, 61, 27, 29, 93] }
{"cid": 21, "neighbors ids": [18, 54, 17, 25, 50, 26, 68, 67, 79, 90, 122] }
{"cid": 20, "neighbors ids": [19, 15, 23, 22, 61, 27] }
{"cid": 24, "neighbors ids": [16, 64, 685, 22, 619, 29, 30, 621, 72, 105, 93] }
{"cid": 668, "neighbors ids": [644, 646, 1, 610, 680, 708] }
{"cid": 25, "neighbors ids": [17, 19, 21, 53, 26, 55, 74, 79, 84] }
{"cid": 610, "neighbors ids": [646, 12, 18, 68, 668, 50, 1, 707, 34, 690, 691, 103, 618, 708, 677, 693, 125] }
{"cid": 23, "neighbors ids": [19, 20, 28, 27, 61, 73, 86, 15, 84, 109, 115, 130] }
{"cid": 619, "neighbors ids": [685, 1, 24, 30, 612, 72] }
{"cid": 68, "neighbors ids": [610, 18, 50, 21, 12, 26, 67, 90, 646, 618, 677, 125, 693, 157] }
{"cid": 53, "neighbors ids": [25, 19, 28, 74, 56, 73, 79, 62, 84, 110] }
{"cid": 61, "neighbors ids": [20, 22, 27, 15, 23, 29, 93, 86, 19, 109, 101, 129, 139, 164, 163] }
{"cid": 50, "neighbors ids": [68, 18, 21, 610, 26, 83, 34, 90, 103, 677, 125, 663] }
{"cid": 26, "neighbors ids": [21, 50, 25, 55, 83, 68, 79, 90, 122] }
{"cid": 28, "neighbors ids": [19, 23, 53, 27, 56, 31, 33, 73, 106, 62, 86] }
{"cid": 27, "neighbors ids": [20, 23, 61, 22, 28, 29, 31, 106, 86, 101, 112] }
{"cid": 29, "neighbors ids": [22, 24, 27, 30, 31, 51, 66, 61, 93, 88, 105, 101, 116, 159, 153] }
{"cid": 30, "neighbors ids": [24, 619, 29, 612, 51, 37, 39, 72, 88, 105] }
{"cid": 55, "neighbors ids": [26, 25, 74, 83, 35, 32, 69, 79, 122, 126, 142] }
{"cid": 74, "neighbors ids": [25, 53, 56, 55, 32, 58, 69, 52, 79, 62, 95, 110, 102, 142] }
{"cid": 612, "neighbors ids": [619, 1, 30, 37, 72, 88, 105, 132, 167] }
{"cid": 56, "neighbors ids": [53, 28, 74, 33, 58, 62] }
{"cid": 83, "neighbors ids": [26, 50, 55, 35, 34, 69, 90, 122, 41, 103, 126, 124, 663, 135, 134, 148] }
{"cid": 31, "neighbors ids": [28, 27, 29, 33, 66, 36, 106, 112, 101] }
{"cid": 33, "neighbors ids": [28, 56, 31, 58, 36, 38, 102, 106, 62, 112, 118] }
{"cid": 707, "neighbors ids": [610, 1, 690, 691] }
{"cid": 34, "neighbors ids": [610, 50, 83, 35, 690, 41, 40, 75, 691, 69, 103, 676, 135, 124] }
{"cid": 35, "neighbors ids": [83, 55, 34, 69, 41] }
{"cid": 690, "neighbors ids": [610, 34, 707, 1, 40, 679, 691, 75, 676] }
{"cid": 32, "neighbors ids": [55, 74, 69, 58, 52] }
{"cid": 69, "neighbors ids": [55, 32, 35, 52, 41, 74, 83, 34, 95, 142, 134, 126, 148] }
{"cid": 58, "neighbors ids": [74, 56, 32, 33, 52, 38, 102, 62, 95] }
{"cid": 51, "neighbors ids": [29, 30, 66, 39, 42, 78, 89, 88, 113, 116] }
{"cid": 37, "neighbors ids": [612, 30, 1, 39, 43, 88, 113, 132] }
{"cid": 66, "neighbors ids": [31, 29, 51, 36, 42, 89, 87, 112, 101, 116, 159, 187] }
{"cid": 36, "neighbors ids": [31, 33, 66, 38, 42, 87, 106, 112] }
{"cid": 41, "neighbors ids": [35, 69, 34, 52, 40, 75, 47, 45, 80, 95, 83, 135, 134, 154, 148, 150] }
{"cid": 52, "neighbors ids": [69, 32, 58, 41, 38, 44, 47, 80, 74, 102, 95, 91, 121] }
{"cid": 39, "neighbors ids": [30, 51, 37, 78, 43, 46, 88, 113] }
{"cid": 38, "neighbors ids": [33, 58, 36, 52, 42, 44, 102, 87, 91, 112, 98, 118, 120] }
{"cid": 40, "neighbors ids": [34, 690, 41, 75, 679] }
{"cid": 42, "neighbors ids": [36, 66, 51, 38, 78, 44, 59, 85, 87, 89] }
{"cid": 78, "neighbors ids": [51, 39, 42, 59, 46, 651, 89, 82, 87, 99, 43, 113, 136, 161, 160, 181] }
{"cid": 43, "neighbors ids": [37, 39, 1, 46, 99, 78, 113, 132, 160] }
{"cid": 75, "neighbors ids": [40, 41, 679, 45, 60, 34, 690, 80, 676, 700, 135, 150, 154] }
{"cid": 679, "neighbors ids": [40, 690, 75, 1, 60, 676, 700] }
{"cid": 44, "neighbors ids": [38, 52, 42, 85, 47, 48, 87, 91, 96, 98] }
{"cid": 47, "neighbors ids": [52, 41, 44, 45, 48, 70, 57, 80, 60, 91, 96, 121, 156, 155, 151] }
{"cid": 59, "neighbors ids": [42, 78, 85, 651, 643, 87, 82, 92, 136] }
{"cid": 46, "neighbors ids": [39, 43, 78, 1, 651, 82, 99] }
{"cid": 85, "neighbors ids": [44, 42, 59, 48, 643, 49, 87, 92, 96, 117, 98, 127, 128, 136, 172, 120, 173, 192] }
{"cid": 45, "neighbors ids": [75, 41, 47, 60, 70, 80] }
{"cid": 60, "neighbors ids": [679, 75, 45, 1, 70, 47, 80, 700, 151, 150, 670, 629] }
{"cid": 48, "neighbors ids": [47, 44, 85, 57, 49, 96] }
{"cid": 70, "neighbors ids": [45, 60, 47, 57, 1, 80, 151, 156] }
{"cid": 643, "neighbors ids": [85, 59, 49, 651, 1, 92, 117] }
{"cid": 57, "neighbors ids": [47, 48, 70, 49, 1, 96, 127, 156] }
{"cid": 49, "neighbors ids": [85, 48, 643, 57, 1, 117, 96, 127, 128] }
{"cid": 67, "neighbors ids": [12, 18, 54, 21, 605, 68, 90, 611, 618, 104, 614, 114, 157, 696, 140, 170, 171, 198] }
{"cid": 87, "neighbors ids": [42, 85, 44, 59, 38, 78, 36, 89, 66, 98, 112, 120, 136, 172, 187] }
{"cid": 691, "neighbors ids": [707, 690, 610, 1, 34, 103, 676, 677, 124, 669, 683] }
{"cid": 72, "neighbors ids": [619, 1, 685, 612, 24, 30, 621, 105, 167, 201, 223] }
{"cid": 645, "neighbors ids": [601, 599, 604, 649, 602, 614, 608, 652, 609, 616, 701, 686, 624] }
{"cid": 680, "neighbors ids": [644, 606, 646, 668, 1, 609, 602, 615, 708, 616, 701, 694, 681] }
{"cid": 652, "neighbors ids": [599, 1, 604, 649, 645, 609, 615, 701, 694, 686, 623, 624, 699, 678] }
{"cid": 608, "neighbors ids": [602, 614, 645, 12, 604, 609, 646, 616] }
{"cid": 609, "neighbors ids": [606, 604, 602, 680, 1, 608, 652, 646, 615, 645, 616, 701, 694] }
{"cid": 73, "neighbors ids": [19, 28, 53, 23, 84, 62, 86, 106, 130, 110, 107] }
{"cid": 79, "neighbors ids": [26, 25, 21, 55, 74, 17, 53, 122, 84, 90, 110, 111, 126, 142, 179, 184, 169] }
{"cid": 80, "neighbors ids": [45, 41, 47, 52, 75, 60, 70, 95, 121, 154, 151, 150, 670, 195, 629] }
{"cid": 82, "neighbors ids": [651, 46, 1, 78, 59, 92, 99, 136, 161] }
{"cid": 653, "neighbors ids": [650, 1, 4, 656, 655] }
{"cid": 77, "neighbors ids": [11, 71, 15, 8, 81, 65, 131, 109, 146] }
{"cid": 621, "neighbors ids": [685, 24, 1, 72, 64, 684, 105, 133, 123, 201, 178] }
{"cid": 102, "neighbors ids": [58, 38, 33, 52, 62, 95, 91, 107, 106, 118, 74, 142, 149, 193, 176] }
{"cid": 89, "neighbors ids": [42, 51, 78, 66, 87, 116, 113, 136, 187, 172, 181, 194, 242, 248] }
{"cid": 92, "neighbors ids": [643, 651, 1, 59, 85, 82, 117, 136, 161, 229] }
{"cid": 90, "neighbors ids": [21, 68, 26, 50, 83, 67, 122, 54, 17, 79, 111, 125, 663, 114, 157, 171, 190, 198] }
{"cid": 88, "neighbors ids": [30, 37, 39, 612, 51, 29, 105, 113, 116, 132, 153, 167] }
{"cid": 93, "neighbors ids": [22, 15, 24, 61, 29, 16, 64, 105, 101, 138, 129, 123, 139, 159, 153, 178, 196, 183, 205, 218] }
{"cid": 105, "neighbors ids": [24, 30, 72, 612, 88, 621, 29, 64, 93, 123, 153, 167, 178, 201, 223, 205] }
{"cid": 62, "neighbors ids": [74, 56, 53, 58, 28, 33, 102, 73, 106, 107, 110, 142] }
{"cid": 676, "neighbors ids": [679, 690, 75, 1, 34, 691, 700, 135, 124, 683, 692] }
{"cid": 615, "neighbors ids": [1, 606, 609, 652, 680, 694] }
{"cid": 108, "neighbors ids": [13, 71, 63, 65, 14, 94, 19, 115, 109, 152, 119, 165, 146, 213, 204, 188] }
{"cid": 106, "neighbors ids": [28, 31, 33, 27, 36, 86, 62, 112, 73, 102, 107, 118, 101, 130, 139, 164, 110, 180, 176, 185] }
{"cid": 95, "neighbors ids": [52, 69, 41, 74, 58, 102, 80, 91, 121, 142, 134, 154, 149, 193] }
{"cid": 611, "neighbors ids": [603, 605, 649, 10, 614, 12, 67, 104] }
{"cid": 94, "neighbors ids": [13, 14, 108, 19, 17, 54, 63, 84, 115, 111, 114, 119, 165, 169, 179, 213, 188] }
{"cid": 84, "neighbors ids": [19, 17, 25, 53, 73, 79, 23, 94, 115, 130, 110, 111, 179, 213] }
{"cid": 91, "neighbors ids": [52, 44, 47, 38, 96, 102, 95, 98, 121, 120, 118, 149, 155] }
{"cid": 613, "neighbors ids": [607, 684, 1, 16, 64, 9, 654, 133, 622, 123, 145, 147] }
{"cid": 122, "neighbors ids": [26, 21, 90, 79, 83, 55, 17, 111, 126, 663, 114, 169, 184, 190, 171, 179, 209, 208, 230] }
{"cid": 86, "neighbors ids": [23, 61, 27, 28, 106, 73, 101, 109, 115, 130, 139, 164] }
{"cid": 103, "neighbors ids": [50, 34, 610, 691, 83, 677, 124, 125, 663, 669, 682, 186, 197, 231] }
{"cid": 96, "neighbors ids": [48, 44, 85, 47, 91, 49, 57, 98, 127, 128, 156, 155, 120, 173] }
{"cid": 617, "neighbors ids": [4, 650, 5, 7, 656, 655] }
{"cid": 618, "neighbors ids": [12, 646, 68, 610, 616, 67, 701, 614, 693, 157, 696, 695] }
{"cid": 117, "neighbors ids": [643, 49, 1, 92, 85, 128, 136, 173, 192, 229, 206] }
{"cid": 616, "neighbors ids": [608, 609, 646, 12, 645, 680, 618, 614, 701, 686, 696] }
{"cid": 133, "neighbors ids": [684, 1, 64, 621, 613, 123, 147, 201, 178, 196, 257] }
{"cid": 708, "neighbors ids": [668, 680, 646, 610, 1, 677] }
{"cid": 700, "neighbors ids": [679, 1, 60, 676, 75, 135, 150, 692, 670, 630] }
{"cid": 99, "neighbors ids": [46, 1, 82, 43, 78, 113, 160, 161] }
{"cid": 109, "neighbors ids": [19, 15, 71, 61, 23, 115, 77, 108, 86, 81, 129, 164, 163, 146, 166, 213, 204] }
{"cid": 112, "neighbors ids": [31, 106, 36, 33, 38, 27, 66, 101, 87, 118, 120, 139, 159, 187, 172, 176, 185, 216, 238, 254] }
{"cid": 104, "neighbors ids": [605, 54, 611, 10, 67, 12, 649, 614, 114, 119, 140, 625, 170, 171, 199] }
{"cid": 677, "neighbors ids": [610, 1, 691, 103, 50, 708, 68, 125, 693, 669, 682] }
{"cid": 101, "neighbors ids": [27, 29, 31, 61, 66, 112, 93, 86, 106, 139, 159] }
{"cid": 656, "neighbors ids": [4, 653, 650, 617, 1, 655, 100, 5, 659, 203, 628] }
{"cid": 620, "neighbors ids": [649, 3, 1, 2, 97, 137, 627, 657] }
{"cid": 701, "neighbors ids": [609, 680, 616, 646, 618, 652, 645, 694, 1, 681, 693, 686, 699, 697, 696, 695] }
{"cid": 121, "neighbors ids": [80, 52, 47, 95, 91, 149, 155, 151, 154, 156, 195, 200] }
{"cid": 97, "neighbors ids": [2, 4, 649, 100, 1, 620, 137, 203, 627, 158] }
{"cid": 622, "neighbors ids": [654, 651, 8, 1, 613, 9, 145, 658, 144, 177] }
{"cid": 694, "neighbors ids": [615, 680, 609, 1, 652, 701, 681, 699, 697] }
{"cid": 115, "neighbors ids": [19, 84, 23, 109, 108, 94, 86, 130, 164, 213] }
{"cid": 113, "neighbors ids": [39, 51, 78, 43, 88, 37, 99, 116, 132, 89, 160, 153, 181, 194, 217] }
{"cid": 98, "neighbors ids": [44, 85, 96, 38, 91, 87, 120, 172] }
{"cid": 131, "neighbors ids": [65, 8, 77, 76, 81, 146, 141, 162, 145, 166, 221, 207] }
{"cid": 127, "neighbors ids": [49, 57, 1, 96, 85, 128, 156, 173, 206] }
{"cid": 100, "neighbors ids": [4, 1, 2, 97, 656, 203, 628, 158] }
{"cid": 655, "neighbors ids": [650, 76, 5, 651, 653, 617, 1, 656, 658, 659, 162, 673] }
{"cid": 145, "neighbors ids": [654, 8, 9, 622, 141, 613, 123, 147, 1, 144, 131, 658, 177, 162, 196, 207, 237, 267, 251] }
{"cid": 107, "neighbors ids": [62, 102, 106, 73, 118, 110, 142, 130, 180, 176, 202] }
{"cid": 116, "neighbors ids": [51, 29, 66, 89, 88, 113, 159, 153, 187, 194, 226, 248] }
{"cid": 681, "neighbors ids": [680, 1, 694, 701, 697] }
{"cid": 110, "neighbors ids": [53, 62, 79, 73, 74, 84, 107, 142, 130, 106, 179, 180, 184] }
{"cid": 118, "neighbors ids": [33, 102, 112, 38, 106, 107, 91, 120, 149, 176] }
{"cid": 119, "neighbors ids": [7, 649, 63, 10, 104, 114, 203, 152, 143, 108, 94, 165, 625, 199, 171, 220] }
{"cid": 111, "neighbors ids": [17, 54, 90, 79, 94, 122, 84, 114, 179, 169] }
{"cid": 135, "neighbors ids": [34, 75, 41, 676, 124, 83, 700, 134, 148, 150, 683, 692, 186, 243, 630, 224] }
{"cid": 141, "neighbors ids": [8, 9, 81, 145, 123, 131, 138, 166, 196, 207, 267, 251] }
{"cid": 130, "neighbors ids": [23, 73, 84, 115, 86, 106, 110, 164, 107, 180, 179, 213, 185, 175, 240] }
{"cid": 114, "neighbors ids": [54, 10, 63, 104, 119, 94, 111, 67, 90, 165, 122, 169, 171] }
{"cid": 138, "neighbors ids": [15, 81, 64, 93, 129, 123, 141, 163, 166, 196, 183, 189, 267, 207, 252, 139, 280, 251, 311] }
{"cid": 124, "neighbors ids": [34, 691, 676, 103, 83, 135, 148, 663, 683, 669, 186] }
{"cid": 120, "neighbors ids": [38, 91, 98, 87, 112, 118, 96, 172, 85, 149, 173, 155, 176, 216, 227, 228, 210] }
{"cid": 658, "neighbors ids": [76, 651, 8, 655, 622, 1, 162, 145, 673, 177, 207, 235, 245] }
{"cid": 123, "neighbors ids": [64, 613, 9, 133, 621, 81, 105, 93, 141, 138, 145, 147, 178, 196] }
{"cid": 693, "neighbors ids": [610, 646, 618, 1, 701, 68, 677, 125, 157, 695, 682] }
{"cid": 125, "neighbors ids": [50, 68, 677, 90, 103, 610, 663, 693, 157, 682, 695, 190, 197, 669, 191, 231] }
{"cid": 132, "neighbors ids": [37, 43, 1, 612, 113, 88, 160, 167, 153, 217, 239] }
{"cid": 128, "neighbors ids": [49, 1, 85, 127, 117, 96, 173, 206] }
{"cid": 126, "neighbors ids": [55, 83, 122, 79, 69, 663, 142, 148, 184, 168, 190, 219, 225] }
{"cid": 143, "neighbors ids": [7, 5, 65, 4, 146, 152, 659, 203, 76, 119, 162, 182, 199, 220, 275, 276] }
{"cid": 129, "neighbors ids": [15, 81, 61, 93, 138, 109, 163, 164, 139, 183, 189] }
{"cid": 663, "neighbors ids": [50, 83, 90, 125, 103, 122, 126, 124, 148, 190, 197, 186, 225, 661, 1, 633, 697, 674, 660, 662, 705] }
{"cid": 142, "neighbors ids": [74, 69, 95, 55, 79, 102, 62, 110, 107, 126, 134, 193, 148, 184, 168, 154, 180, 176, 202, 219] }
{"cid": 203, "neighbors ids": [649, 7, 4, 119, 143, 659, 656, 97, 100, 137, 199, 697, 628, 182, 158, 1, 220, 275, 632, 266, 633, 274, 317, 660, 688, 636, 704] }
{"cid": 686, "neighbors ids": [645, 652, 614, 701, 616, 624, 699, 696] }
{"cid": 139, "neighbors ids": [86, 61, 101, 106, 112, 164, 93, 129, 159, 183, 185, 175, 189, 163, 238, 232, 138, 252, 280, 306, 305, 308, 326] }
{"cid": 134, "neighbors ids": [41, 69, 95, 83, 135, 148, 154, 150, 142, 168, 243, 234, 224] }
{"cid": 146, "neighbors ids": [65, 77, 71, 5, 76, 131, 143, 152, 81, 109, 162, 166, 108, 182, 204, 221, 215, 246, 276] }
{"cid": 152, "neighbors ids": [65, 63, 7, 108, 143, 119, 71, 146, 165, 204, 188, 182, 220, 276, 260, 275] }
{"cid": 157, "neighbors ids": [618, 68, 67, 90, 693, 125, 696, 695, 198, 190, 191, 687, 247, 261, 271] }
{"cid": 659, "neighbors ids": [656, 5, 655, 4, 143, 203, 76, 1, 673, 162, 182, 628] }
{"cid": 623, "neighbors ids": [652, 649, 1, 624, 678] }
{"cid": 624, "neighbors ids": [645, 652, 649, 614, 686, 623, 696, 678, 140, 699] }
{"cid": 136, "neighbors ids": [59, 78, 87, 85, 82, 92, 89, 161, 172, 117, 192, 181, 229, 242, 241, 295, 330] }
{"cid": 154, "neighbors ids": [41, 95, 80, 75, 134, 150, 121, 149, 142, 193, 168, 195, 200, 243, 210, 234, 263, 236] }
{"cid": 147, "neighbors ids": [613, 145, 123, 1, 133, 144, 196, 237, 257] }
{"cid": 699, "neighbors ids": [652, 694, 1, 701, 686, 697, 624, 696, 678, 706] }
{"cid": 148, "neighbors ids": [83, 41, 134, 124, 135, 69, 126, 663, 142, 168, 186, 225, 234, 224] }
{"cid": 160, "neighbors ids": [43, 99, 1, 132, 113, 78, 161, 181, 217, 241, 244] }
{"cid": 156, "neighbors ids": [47, 57, 70, 96, 1, 151, 127, 121, 155, 173, 206, 256] }
{"cid": 140, "neighbors ids": [614, 649, 104, 67, 696, 625, 624, 170, 678, 657, 626, 211, 672] }
{"cid": 696, "neighbors ids": [614, 616, 618, 686, 701, 67, 624, 140, 157, 695, 699, 170, 198, 678, 1, 687, 672, 698, 631] }
{"cid": 164, "neighbors ids": [86, 115, 61, 109, 130, 139, 106, 163, 129, 213, 175, 185, 189] }
{"cid": 159, "neighbors ids": [101, 29, 66, 116, 112, 187, 93, 139, 153, 183, 226, 218, 205, 248, 232, 238] }
{"cid": 150, "neighbors ids": [41, 75, 135, 154, 134, 80, 700, 60, 670, 195, 243, 630] }
{"cid": 151, "neighbors ids": [60, 80, 70, 47, 121, 1, 156, 629, 155, 195, 200, 256] }
{"cid": 697, "neighbors ids": [694, 681, 1, 701, 699, 137, 203, 199, 626, 627, 158, 174, 661, 662, 633, 266, 284, 663, 660] }
{"cid": 669, "neighbors ids": [691, 677, 1, 103, 124, 683, 682, 125, 186, 231, 702, 233, 262] }
{"cid": 149, "neighbors ids": [95, 121, 91, 102, 118, 120, 154, 155, 193, 176, 195, 200, 227, 210] }
{"cid": 155, "neighbors ids": [47, 91, 121, 96, 156, 149, 120, 173, 151, 200, 227, 206, 228, 256, 249, 282] }
{"cid": 137, "neighbors ids": [649, 97, 620, 203, 627, 657, 625, 199, 697, 626, 158, 174, 661] }
{"cid": 162, "neighbors ids": [76, 8, 131, 658, 655, 146, 673, 659, 143, 182, 145, 207, 215, 221, 245, 258, 235] }
{"cid": 144, "neighbors ids": [622, 1, 145, 147, 177, 237] }
{"cid": 153, "neighbors ids": [88, 29, 116, 105, 113, 93, 167, 132, 159, 205, 226, 194, 217, 239, 181, 639] }
{"cid": 172, "neighbors ids": [87, 85, 120, 98, 112, 136, 173, 89, 187, 192, 242, 216, 228, 281] }
{"cid": 625, "neighbors ids": [649, 104, 119, 140, 137, 199, 657, 626, 170] }
{"cid": 163, "neighbors ids": [109, 81, 129, 61, 164, 166, 138, 213, 189, 175, 139, 252, 265] }
{"cid": 695, "neighbors ids": [701, 618, 693, 1, 157, 696, 125, 682, 687, 191] }
{"cid": 683, "neighbors ids": [691, 676, 1, 124, 669, 135, 692, 186, 224, 233, 255, 262] }
{"cid": 161, "neighbors ids": [82, 136, 78, 99, 92, 1, 160, 181, 229, 241] }
{"cid": 165, "neighbors ids": [63, 119, 94, 108, 114, 152, 169, 171, 188, 199, 220, 212] }
{"cid": 682, "neighbors ids": [677, 1, 693, 125, 669, 103, 695, 687, 191, 702, 231] }
{"cid": 627, "neighbors ids": [2, 3, 1, 620, 97, 137, 657, 158, 174, 697] }
{"cid": 678, "neighbors ids": [623, 649, 652, 624, 1, 699, 657, 140, 696, 674, 672, 706, 698] }
{"cid": 187, "neighbors ids": [66, 87, 112, 89, 159, 116, 172, 242, 216, 248, 238, 232, 185, 254, 281] }
{"cid": 166, "neighbors ids": [81, 109, 146, 163, 138, 131, 141, 204, 221, 213, 207, 252, 265] }
{"cid": 179, "neighbors ids": [84, 79, 110, 111, 94, 130, 180, 169, 213, 122, 184, 209, 188, 240, 222, 230, 253] }
{"cid": 167, "neighbors ids": [612, 72, 88, 105, 1, 132, 153, 223, 205, 239] }
{"cid": 173, "neighbors ids": [85, 96, 120, 172, 128, 127, 155, 156, 117, 192, 206, 228, 229, 249] }
{"cid": 673, "neighbors ids": [655, 659, 76, 162, 658, 1, 182, 628, 215, 245, 632] }
{"cid": 193, "neighbors ids": [95, 102, 142, 149, 154, 176, 202, 168, 210, 219, 263, 236, 279, 291] }
{"cid": 657, "neighbors ids": [649, 620, 1, 137, 627, 678, 140, 625, 626, 174, 674, 661, 672, 662] }
{"cid": 170, "neighbors ids": [104, 67, 140, 696, 171, 198, 625, 199, 626, 208, 211, 672, 698, 277] }
{"cid": 180, "neighbors ids": [110, 107, 130, 106, 179, 142, 176, 184, 202, 185, 240, 209, 219, 278, 253, 285, 294] }
{"cid": 692, "neighbors ids": [676, 1, 700, 135, 683, 630, 186, 224, 243, 635, 255] }
{"cid": 184, "neighbors ids": [79, 126, 122, 142, 110, 180, 179, 209, 190, 219, 225, 285, 294, 296, 303, 336] }
{"cid": 176, "neighbors ids": [107, 118, 106, 102, 149, 180, 112, 193, 142, 120, 185, 202, 216, 210, 254, 278, 279] }
{"cid": 177, "neighbors ids": [622, 1, 144, 145, 658, 237, 207, 235, 251, 293] }
{"cid": 169, "neighbors ids": [111, 114, 122, 94, 165, 79, 179, 171, 208, 209, 188, 212, 230, 222, 264] }
{"cid": 168, "neighbors ids": [148, 134, 142, 126, 154, 219, 193, 225, 234, 263] }
{"cid": 670, "neighbors ids": [60, 700, 1, 150, 80, 195, 629, 630] }
{"cid": 178, "neighbors ids": [123, 105, 93, 621, 133, 201, 196, 183, 205, 257, 218, 214, 259] }
{"cid": 181, "neighbors ids": [78, 113, 89, 160, 136, 161, 194, 241, 242, 217, 244, 153, 226, 295, 639, 248, 304] }
{"cid": 171, "neighbors ids": [104, 114, 67, 90, 170, 119, 122, 169, 165, 198, 190, 199, 208, 211, 212, 264] }
{"cid": 201, "neighbors ids": [621, 72, 1, 105, 133, 178, 223, 205, 257, 214] }
{"cid": 190, "neighbors ids": [90, 122, 663, 125, 157, 198, 171, 126, 208, 197, 191, 184, 225, 230, 209, 247, 261, 289, 299] }
{"cid": 192, "neighbors ids": [85, 172, 136, 173, 117, 229, 228, 242, 206, 287, 241, 332, 330, 348] }
{"cid": 182, "neighbors ids": [143, 659, 162, 146, 673, 203, 152, 628, 215, 276, 275, 632] }
{"cid": 196, "neighbors ids": [123, 145, 147, 141, 133, 138, 93, 178, 183, 237, 267, 257, 259, 301] }
{"cid": 198, "neighbors ids": [67, 157, 696, 170, 90, 171, 190, 208, 698, 261, 631, 687, 277, 271] }
{"cid": 213, "neighbors ids": [94, 115, 84, 108, 109, 179, 130, 164, 204, 163, 188, 175, 166, 240, 222, 265, 253, 306, 302] }
{"cid": 195, "neighbors ids": [80, 150, 121, 154, 670, 151, 629, 149, 200, 630, 243, 236, 269] }
{"cid": 199, "neighbors ids": [649, 119, 625, 104, 203, 137, 171, 697, 165, 626, 170, 143, 211, 220, 212, 662, 250, 266, 284] }
{"cid": 629, "neighbors ids": [60, 151, 80, 1, 670, 195, 200, 630, 256, 269, 283, 675, 637] }
{"cid": 204, "neighbors ids": [146, 109, 108, 152, 166, 213, 188, 221, 246, 276, 260, 265, 222, 270, 302, 323, 310, 333] }
{"cid": 626, "neighbors ids": [649, 625, 657, 140, 137, 199, 697, 170, 211, 661, 672, 662] }
{"cid": 223, "neighbors ids": [72, 105, 167, 201, 1, 205, 214, 239, 327] }
{"cid": 185, "neighbors ids": [106, 112, 176, 130, 164, 139, 180, 175, 240, 238, 254, 187, 278, 306, 308, 325, 341] }
{"cid": 186, "neighbors ids": [103, 124, 663, 669, 197, 148, 683, 231, 135, 225, 224, 692, 234, 233, 272] }
{"cid": 158, "neighbors ids": [627, 97, 1, 100, 203, 137, 174, 697, 633] }
{"cid": 183, "neighbors ids": [93, 139, 159, 129, 138, 196, 178, 189, 218, 232, 259, 267, 280] }
{"cid": 197, "neighbors ids": [125, 103, 663, 186, 190, 231, 191, 225, 247, 289] }
{"cid": 628, "neighbors ids": [1, 656, 100, 203, 659, 673, 182, 632, 274] }
{"cid": 205, "neighbors ids": [105, 153, 93, 178, 167, 201, 223, 159, 218, 226, 214, 239, 259, 639, 320, 327, 350] }
{"cid": 200, "neighbors ids": [121, 149, 155, 151, 195, 154, 629, 210, 227, 236, 256, 282, 269, 286, 675, 343] }
{"cid": 206, "neighbors ids": [128, 173, 127, 117, 156, 1, 155, 229, 256, 249, 192, 228, 287] }
{"cid": 188, "neighbors ids": [165, 108, 94, 152, 213, 204, 169, 179, 222, 212, 220, 260] }
{"cid": 687, "neighbors ids": [695, 682, 1, 696, 157, 191, 702, 631, 247, 198, 271, 288, 319] }
{"cid": 191, "neighbors ids": [695, 125, 682, 157, 687, 197, 702, 231, 190, 247] }
{"cid": 202, "neighbors ids": [142, 107, 176, 180, 193, 219, 278, 279, 291, 285] }
{"cid": 194, "neighbors ids": [113, 116, 89, 181, 153, 242, 248, 217, 226] }
{"cid": 229, "neighbors ids": [92, 136, 117, 192, 161, 1, 173, 206, 241, 287, 330, 348] }
{"cid": 174, "neighbors ids": [627, 1, 657, 137, 158, 661, 697, 633] }
{"cid": 208, "neighbors ids": [171, 198, 170, 190, 169, 122, 230, 211, 264, 261, 277] }
{"cid": 175, "neighbors ids": [164, 130, 213, 139, 185, 163, 189, 240, 252, 265, 306, 305] }
{"cid": 702, "neighbors ids": [682, 1, 687, 669, 191, 231, 247, 288, 262, 290] }
{"cid": 221, "neighbors ids": [131, 166, 146, 207, 204, 162, 215, 246, 258, 265, 252, 311, 292, 310, 323] }
{"cid": 209, "neighbors ids": [122, 184, 179, 169, 180, 230, 190, 253, 225, 299, 294, 296, 303] }
{"cid": 216, "neighbors ids": [120, 176, 112, 172, 187, 210, 227, 228, 254, 281, 279, 314] }
{"cid": 242, "neighbors ids": [172, 187, 89, 136, 181, 248, 194, 192, 295, 281, 228, 332, 330, 347, 358] }
{"cid": 207, "neighbors ids": [131, 145, 141, 166, 162, 221, 658, 177, 235, 138, 258, 251, 245, 267, 311, 252, 292, 315] }
{"cid": 231, "neighbors ids": [125, 669, 103, 682, 197, 191, 186, 702, 247, 225, 233, 272, 288, 262, 289, 290, 313] }
{"cid": 227, "neighbors ids": [120, 149, 155, 210, 228, 216, 200, 249, 282, 286, 314, 337, 351] }
{"cid": 217, "neighbors ids": [132, 113, 160, 1, 153, 239, 181, 194, 244, 639, 304] }
{"cid": 674, "neighbors ids": [657, 678, 1, 661, 672, 662, 663] }
{"cid": 237, "neighbors ids": [147, 144, 145, 1, 177, 196, 257, 251, 267, 301, 293, 365] }
{"cid": 189, "neighbors ids": [129, 164, 163, 139, 138, 183, 175, 252] }
{"cid": 630, "neighbors ids": [700, 670, 1, 135, 150, 692, 195, 243, 629, 269, 635, 283] }
{"cid": 211, "neighbors ids": [170, 199, 626, 140, 171, 672, 208, 662, 212, 264, 250, 277, 284, 297, 307] }
{"cid": 243, "neighbors ids": [150, 135, 134, 154, 195, 224, 630, 234, 692, 263, 236, 269, 273, 635, 322, 283, 342, 361] }
{"cid": 225, "neighbors ids": [663, 148, 126, 186, 190, 168, 197, 184, 219, 234, 231, 224, 247, 272, 209, 289, 299, 296, 313, 321] }
{"cid": 219, "neighbors ids": [126, 142, 168, 184, 193, 225, 202, 180, 263, 234, 291, 285, 296, 309] }
{"cid": 226, "neighbors ids": [153, 159, 116, 205, 218, 194, 248, 232, 181, 639, 320, 268] }
{"cid": 241, "neighbors ids": [161, 160, 181, 136, 1, 244, 229, 295, 192, 330] }
{"cid": 661, "neighbors ids": [657, 174, 137, 626, 1, 674, 697, 662, 633, 663, 660] }
{"cid": 240, "neighbors ids": [130, 179, 180, 213, 175, 185, 253, 306, 278, 294, 341] }
{"cid": 248, "neighbors ids": [116, 187, 89, 159, 242, 194, 226, 232, 181, 639, 281, 304, 268, 295, 320, 347, 370, 335, 358, 388, 413] }
{"cid": 210, "neighbors ids": [149, 176, 120, 193, 227, 154, 216, 200, 236, 279, 291, 286, 314] }
{"cid": 228, "neighbors ids": [120, 173, 172, 155, 227, 192, 216, 249, 206, 287, 281, 242, 332, 314, 282, 337, 378, 371] }
{"cid": 672, "neighbors ids": [140, 678, 657, 696, 626, 170, 211, 662, 674, 698, 277, 1, 297, 638, 665] }
{"cid": 220, "neighbors ids": [119, 165, 152, 199, 143, 188, 212, 203, 260, 275, 266, 250, 222, 316] }
{"cid": 212, "neighbors ids": [165, 169, 199, 171, 188, 222, 220, 264, 211, 250, 260, 316] }
{"cid": 218, "neighbors ids": [93, 159, 183, 205, 178, 226, 232, 259, 280, 268, 320] }
{"cid": 215, "neighbors ids": [162, 182, 146, 673, 221, 246, 276, 258, 245, 632] }
{"cid": 230, "neighbors ids": [169, 122, 208, 209, 190, 179, 264, 222, 253, 261, 299, 298, 303, 324] }
{"cid": 239, "neighbors ids": [167, 132, 153, 217, 1, 205, 223, 639, 304, 327, 335] }
{"cid": 222, "neighbors ids": [169, 188, 179, 213, 212, 264, 230, 253, 204, 260, 220, 316, 302, 298] }
{"cid": 257, "neighbors ids": [133, 196, 178, 201, 147, 1, 237, 214, 259, 301, 331, 403, 365] }
{"cid": 662, "neighbors ids": [626, 657, 661, 672, 697, 199, 211, 674, 284, 660, 307, 297, 663, 1, 665, 664] }
{"cid": 234, "neighbors ids": [134, 168, 148, 154, 224, 243, 225, 263, 219, 186, 272, 273, 296, 321, 309] }
{"cid": 224, "neighbors ids": [186, 135, 148, 134, 243, 234, 692, 683, 233, 225, 272, 273, 255, 635] }
{"cid": 267, "neighbors ids": [141, 196, 138, 145, 251, 183, 237, 259, 207, 301, 311, 280, 252, 334, 359, 362, 376, 405] }
{"cid": 232, "neighbors ids": [159, 187, 139, 238, 183, 218, 226, 248, 280, 268, 281, 320] }
{"cid": 238, "neighbors ids": [112, 139, 185, 159, 187, 232, 254, 280, 306, 268, 281, 308, 326, 305] }
{"cid": 244, "neighbors ids": [160, 241, 181, 1, 217, 295, 304] }
{"cid": 235, "neighbors ids": [658, 177, 1, 207, 162, 245, 251, 292, 293, 315] }
{"cid": 246, "neighbors ids": [146, 221, 215, 204, 276, 258, 270, 292, 310, 323] }
{"cid": 214, "neighbors ids": [201, 205, 178, 223, 257, 1, 259, 331, 327, 350] }
{"cid": 256, "neighbors ids": [156, 151, 155, 1, 200, 206, 629, 249, 282, 675, 287, 364] }
{"cid": 245, "neighbors ids": [658, 673, 162, 1, 235, 215, 258, 207, 632, 292, 315, 328] }
{"cid": 698, "neighbors ids": [696, 678, 672, 1, 170, 198, 631, 277, 634, 638] }
{"cid": 247, "neighbors ids": [191, 157, 190, 197, 687, 231, 261, 702, 225, 289, 271, 288, 319, 290, 313] }
{"cid": 254, "neighbors ids": [112, 176, 185, 216, 187, 238, 278, 279, 281, 308, 314, 325, 346] }
{"cid": 263, "neighbors ids": [168, 154, 193, 234, 219, 236, 243, 291, 273, 322, 309, 286, 342, 269, 329, 377, 389] }
{"cid": 276, "neighbors ids": [182, 146, 152, 215, 143, 246, 275, 204, 260, 632, 270, 258, 688, 323, 344, 354, 366, 390] }
{"cid": 258, "neighbors ids": [162, 215, 221, 207, 245, 246, 276, 292, 632, 328, 344, 323, 354, 369] }
{"cid": 706, "neighbors ids": [678, 699, 1] }
{"cid": 631, "neighbors ids": [696, 1, 687, 698, 198, 271, 319, 277, 634] }
{"cid": 252, "neighbors ids": [163, 166, 138, 189, 175, 139, 265, 280, 221, 207, 311, 267, 305, 310, 334, 380] }
{"cid": 236, "neighbors ids": [154, 200, 193, 210, 195, 263, 243, 291, 269, 286, 322] }
{"cid": 249, "neighbors ids": [155, 173, 227, 228, 206, 256, 282, 287, 378] }
{"cid": 251, "neighbors ids": [145, 141, 207, 177, 267, 237, 138, 235, 311, 301, 293, 315, 292, 379, 340, 375] }
{"cid": 264, "neighbors ids": [171, 169, 212, 208, 211, 230, 250, 222, 316, 277, 298, 307, 297, 261, 324, 339, 357, 356, 367, 397] }
{"cid": 265, "neighbors ids": [163, 166, 213, 204, 175, 252, 221, 306, 305, 310, 302, 323, 333, 311, 380, 334, 409] }
{"cid": 259, "neighbors ids": [196, 178, 183, 218, 267, 257, 205, 214, 301, 280, 320, 331, 350, 403, 362, 359, 444] }
{"cid": 260, "neighbors ids": [152, 188, 220, 204, 276, 275, 222, 270, 212, 266, 316, 302, 333, 298, 338, 366, 353] }
{"cid": 261, "neighbors ids": [157, 198, 190, 247, 208, 271, 289, 230, 277, 299, 264, 324, 318, 349, 339] }
{"cid": 275, "neighbors ids": [143, 182, 276, 152, 220, 203, 260, 266, 632, 688, 636, 366, 689, 353] }
{"cid": 250, "neighbors ids": [199, 212, 211, 264, 220, 266, 284, 316, 307] }
{"cid": 278, "neighbors ids": [180, 176, 185, 202, 279, 240, 254, 285, 294, 325, 341, 363, 383] }
{"cid": 233, "neighbors ids": [186, 683, 669, 224, 231, 272, 262, 255] }
{"cid": 280, "neighbors ids": [139, 138, 183, 232, 252, 238, 267, 218, 305, 259, 268, 320, 326, 334, 359, 382, 362, 376] }
{"cid": 639, "neighbors ids": [153, 226, 181, 217, 239, 205, 248, 304, 327, 320, 335, 350, 388, 688, 689, 390, 366, 1, 354, 703, 667] }
{"cid": 632, "neighbors ids": [628, 673, 182, 203, 215, 1, 276, 245, 275, 258, 688, 328, 344] }
{"cid": 253, "neighbors ids": [179, 213, 240, 222, 209, 180, 230, 294, 302, 306, 298, 303, 324, 312, 341] }
{"cid": 272, "neighbors ids": [186, 225, 224, 231, 233, 234, 273, 262, 313, 255, 321, 296, 300, 345, 360] }
{"cid": 295, "neighbors ids": [136, 181, 241, 244, 242, 248, 1, 304, 330, 358] }
{"cid": 633, "neighbors ids": [174, 158, 1, 697, 661, 203, 663, 317, 660, 636, 705] }
{"cid": 277, "neighbors ids": [170, 198, 698, 672, 211, 208, 261, 631, 297, 271, 264, 634, 638, 318, 339, 367, 395, 392] }
{"cid": 266, "neighbors ids": [199, 203, 697, 220, 275, 250, 284, 660, 260, 316, 636, 338, 355, 366, 353] }
{"cid": 279, "neighbors ids": [176, 193, 210, 202, 278, 291, 216, 254, 285, 314, 286, 325, 329, 374, 363, 384, 383] }
{"cid": 269, "neighbors ids": [195, 630, 629, 243, 236, 200, 283, 286, 322, 675, 637, 263, 343, 282, 329, 352] }
{"cid": 282, "neighbors ids": [155, 227, 200, 249, 256, 286, 675, 228, 337, 351, 343, 269, 287, 378, 364, 402, 414] }
{"cid": 271, "neighbors ids": [157, 687, 198, 247, 631, 261, 319, 277, 289, 634, 318, 349] }
{"cid": 291, "neighbors ids": [193, 219, 236, 202, 263, 210, 279, 285, 286, 309, 329, 374, 389, 377] }
{"cid": 306, "neighbors ids": [175, 213, 240, 185, 139, 265, 238, 305, 308, 253, 302, 341, 312, 380, 326, 368, 398, 387, 434] }
{"cid": 288, "neighbors ids": [687, 702, 1, 247, 231, 290, 319, 289, 373, 393] }
{"cid": 289, "neighbors ids": [247, 190, 225, 197, 261, 231, 299, 296, 313, 271, 290, 349, 288, 319, 345, 373, 394, 393] }
{"cid": 255, "neighbors ids": [683, 692, 233, 224, 1, 262, 635, 272, 273, 300] }
{"cid": 281, "neighbors ids": [187, 172, 216, 242, 228, 254, 232, 248, 238, 332, 268, 314, 347, 337, 326, 308, 346, 370, 382] }
{"cid": 635, "neighbors ids": [692, 630, 1, 224, 243, 255, 273, 283, 300, 322, 361, 352, 360] }
{"cid": 301, "neighbors ids": [267, 237, 196, 251, 257, 259, 311, 293, 379, 365, 403, 362, 405] }
{"cid": 311, "neighbors ids": [207, 267, 252, 138, 251, 221, 301, 292, 310, 334, 265, 379, 340, 409, 380, 385, 396, 405, 387] }
{"cid": 262, "neighbors ids": [669, 233, 683, 702, 1, 231, 255, 290, 272, 313, 300, 345, 360] }
{"cid": 273, "neighbors ids": [224, 243, 234, 263, 272, 635, 255, 321, 300, 309, 342, 322, 361, 360] }
{"cid": 287, "neighbors ids": [206, 228, 192, 229, 249, 1, 256, 332, 282, 348, 378, 364, 371] }
{"cid": 284, "neighbors ids": [199, 697, 662, 266, 250, 211, 660, 307, 316, 636, 666, 664, 355] }
{"cid": 285, "neighbors ids": [202, 219, 180, 291, 184, 278, 279, 294, 309, 336, 363, 374, 389] }
{"cid": 270, "neighbors ids": [276, 204, 246, 260, 323, 333, 354, 366] }
{"cid": 305, "neighbors ids": [175, 252, 139, 265, 306, 280, 308, 238, 326, 334, 380, 387, 368] }
{"cid": 304, "neighbors ids": [217, 639, 181, 239, 244, 248, 295, 1, 335, 358] }
{"cid": 286, "neighbors ids": [236, 200, 210, 227, 291, 269, 282, 279, 263, 314, 351, 322, 329, 343] }
{"cid": 283, "neighbors ids": [630, 269, 629, 1, 243, 635, 322, 637, 352] }
{"cid": 274, "neighbors ids": [203, 628, 1, 317, 704] }
{"cid": 293, "neighbors ids": [177, 237, 251, 235, 1, 315, 301, 379, 340, 375, 365] }
{"cid": 292, "neighbors ids": [258, 207, 245, 235, 221, 315, 251, 246, 311, 310, 328, 323, 340, 369] }
{"cid": 290, "neighbors ids": [702, 231, 262, 1, 288, 247, 313, 289, 345, 373] }
{"cid": 660, "neighbors ids": [697, 661, 203, 662, 266, 284, 663, 633, 636, 705, 1, 664, 666] }
{"cid": 319, "neighbors ids": [687, 1, 631, 271, 288, 247, 634, 289, 349, 318, 381, 393] }
{"cid": 299, "neighbors ids": [190, 261, 289, 209, 225, 230, 296, 303, 324, 339, 349, 394] }
{"cid": 332, "neighbors ids": [228, 242, 192, 281, 287, 347, 330, 348, 337, 346, 378, 371, 427, 439, 443, 445] }
{"cid": 296, "neighbors ids": [225, 219, 234, 184, 209, 289, 299, 321, 272, 309, 313, 303, 336, 394] }
{"cid": 675, "neighbors ids": [629, 200, 256, 1, 269, 282, 637, 343, 364, 402] }
{"cid": 317, "neighbors ids": [1, 203, 633, 274, 636] }
{"cid": 294, "neighbors ids": [180, 209, 184, 253, 285, 240, 278, 303, 312, 341, 336, 363, 372, 399, 412] }
{"cid": 268, "neighbors ids": [232, 238, 280, 218, 248, 320, 226, 281, 326, 370, 382] }
{"cid": 314, "neighbors ids": [210, 216, 279, 227, 228, 286, 254, 281, 337, 351, 325, 346, 329, 384, 374, 429, 438] }
{"cid": 297, "neighbors ids": [211, 672, 277, 662, 307, 264, 665, 638, 356, 367, 392, 395] }
{"cid": 316, "neighbors ids": [220, 212, 250, 222, 266, 260, 264, 298, 284, 307, 338, 357, 355, 386, 353, 426] }
{"cid": 313, "neighbors ids": [231, 225, 272, 289, 262, 247, 290, 296, 321, 345, 373, 336, 360, 394, 400, 418, 419, 441] }
{"cid": 322, "neighbors ids": [243, 236, 269, 263, 283, 342, 286, 329, 273, 635, 361, 352, 343, 377, 637, 401, 417, 421, 420, 422] }
{"cid": 302, "neighbors ids": [213, 222, 204, 253, 260, 265, 298, 306, 333, 312, 338, 380, 372, 398, 357, 391] }
{"cid": 308, "neighbors ids": [139, 238, 185, 306, 305, 254, 326, 325, 281, 346, 341, 368, 404, 407] }
{"cid": 315, "neighbors ids": [235, 245, 207, 292, 251, 1, 293, 328, 340, 375, 416] }
{"cid": 307, "neighbors ids": [211, 662, 284, 250, 264, 297, 316, 665, 664, 356, 355, 386] }
{"cid": 320, "neighbors ids": [218, 205, 226, 232, 268, 259, 280, 639, 248, 350, 370, 359, 382, 362, 388, 444, 455, 452] }
{"cid": 321, "neighbors ids": [225, 272, 296, 234, 273, 309, 313, 342, 360, 336, 400] }
{"cid": 330, "neighbors ids": [136, 192, 241, 242, 229, 295, 332, 348, 1, 347, 358] }
{"cid": 298, "neighbors ids": [222, 264, 230, 253, 316, 302, 324, 260, 312, 338, 357, 372, 398] }
{"cid": 303, "neighbors ids": [209, 230, 253, 184, 294, 296, 299, 324, 312, 336, 339, 394, 372, 411, 363, 412, 399] }
{"cid": 327, "neighbors ids": [205, 223, 239, 639, 214, 1, 350, 335, 388] }
{"cid": 309, "neighbors ids": [234, 219, 263, 296, 285, 291, 321, 273, 336, 342, 389, 400] }
{"cid": 310, "neighbors ids": [221, 265, 246, 252, 292, 311, 204, 323, 340, 369, 409, 396] }
{"cid": 331, "neighbors ids": [257, 214, 259, 1, 350, 403, 444] }
{"cid": 326, "neighbors ids": [139, 238, 305, 280, 308, 268, 281, 334, 306, 382, 346, 368, 376, 387, 407, 404, 435] }
{"cid": 300, "neighbors ids": [255, 262, 272, 273, 635, 1, 360, 361] }
{"cid": 328, "neighbors ids": [245, 258, 632, 292, 1, 315, 344, 369, 340, 425, 416] }
{"cid": 323, "neighbors ids": [204, 246, 221, 310, 265, 270, 333, 276, 258, 292, 354, 369, 380, 409, 396, 447] }
{"cid": 688, "neighbors ids": [632, 203, 275, 276, 1, 704, 344, 636, 689, 390, 366, 639] }
{"cid": 324, "neighbors ids": [230, 264, 298, 253, 303, 261, 312, 299, 339, 357, 372, 367, 397, 411, 410] }
{"cid": 350, "neighbors ids": [205, 214, 259, 327, 331, 1, 320, 639, 388, 444, 455] }
{"cid": 347, "neighbors ids": [242, 281, 248, 332, 370, 330, 358, 346, 348, 427, 413, 429, 443, 465, 463, 490] }
{"cid": 337, "neighbors ids": [227, 228, 314, 282, 281, 351, 332, 378, 346, 427, 429, 384, 438] }
{"cid": 636, "neighbors ids": [203, 266, 660, 633, 275, 317, 284, 704, 1, 688, 705, 666, 689, 353, 355] }
{"cid": 325, "neighbors ids": [278, 185, 254, 279, 308, 314, 346, 341, 368, 383, 384, 404, 407] }
{"cid": 351, "neighbors ids": [227, 286, 314, 282, 337, 343, 329, 378, 414, 374, 401, 384, 377, 438, 442, 471] }
{"cid": 348, "neighbors ids": [192, 229, 330, 332, 287, 1, 347, 371, 439, 358, 413, 443] }
{"cid": 637, "neighbors ids": [629, 269, 675, 283, 1, 343, 352, 322, 402, 417] }
{"cid": 634, "neighbors ids": [631, 698, 1, 277, 271, 638, 319, 318, 381, 395] }
{"cid": 335, "neighbors ids": [639, 239, 304, 327, 1, 248, 388, 358] }
{"cid": 342, "neighbors ids": [273, 263, 243, 322, 309, 321, 361, 360, 400, 377, 389, 421, 424, 420] }
{"cid": 333, "neighbors ids": [204, 270, 260, 302, 265, 323, 338, 380, 366, 354, 391, 409, 447, 454] }
{"cid": 336, "neighbors ids": [184, 296, 309, 285, 303, 294, 321, 313, 363, 389, 394, 400, 418, 412, 408, 430] }
{"cid": 343, "neighbors ids": [269, 200, 282, 286, 675, 329, 351, 637, 322, 402, 414, 401, 417] }
{"cid": 638, "neighbors ids": [672, 698, 1, 277, 634, 297, 665, 395] }
{"cid": 312, "neighbors ids": [253, 298, 324, 303, 302, 294, 306, 341, 372, 398] }
{"cid": 329, "neighbors ids": [286, 263, 322, 269, 291, 343, 279, 314, 351, 374, 377, 401] }
{"cid": 334, "neighbors ids": [252, 280, 267, 305, 311, 326, 380, 265, 409, 387, 376, 405, 362, 396] }
{"cid": 665, "neighbors ids": [672, 662, 1, 297, 307, 638, 664, 356, 395, 386, 428, 450] }
{"cid": 318, "neighbors ids": [271, 277, 634, 261, 349, 319, 339, 381, 392, 395] }
{"cid": 345, "neighbors ids": [262, 290, 313, 272, 1, 360, 289, 373, 419] }
{"cid": 344, "neighbors ids": [632, 258, 328, 276, 1, 688, 354, 369, 390, 425] }
{"cid": 349, "neighbors ids": [271, 289, 261, 318, 319, 299, 339, 394, 393, 381, 392, 395, 415, 458] }
{"cid": 378, "neighbors ids": [228, 249, 282, 287, 337, 332, 371, 364, 351, 414, 427, 445, 438, 402, 481, 471] }
{"cid": 341, "neighbors ids": [240, 253, 294, 278, 185, 306, 312, 325, 308, 368, 398, 372, 363, 383, 399, 434, 407] }
{"cid": 704, "neighbors ids": [203, 274, 688, 1, 636, 689] }
{"cid": 705, "neighbors ids": [660, 633, 663, 1, 636, 666, 664] }
{"cid": 370, "neighbors ids": [268, 248, 281, 347, 320, 382, 346, 388, 413, 358, 429, 452, 455, 463, 465] }
{"cid": 346, "neighbors ids": [254, 281, 314, 308, 325, 337, 332, 347, 326, 370, 382, 404, 384, 427, 429] }
{"cid": 358, "neighbors ids": [242, 248, 295, 304, 330, 347, 335, 1, 388, 413, 370, 348, 463] }
{"cid": 361, "neighbors ids": [635, 273, 243, 322, 342, 360, 352, 300, 1, 421, 424] }
{"cid": 364, "neighbors ids": [256, 282, 287, 675, 1, 378, 371, 402, 414, 445, 481] }
{"cid": 340, "neighbors ids": [292, 251, 315, 311, 293, 310, 375, 379, 328, 369, 385, 396, 425, 416, 433] }
{"cid": 379, "neighbors ids": [251, 301, 293, 311, 340, 375, 385, 365, 405, 396, 460, 505] }
{"cid": 338, "neighbors ids": [260, 316, 298, 302, 333, 266, 353, 357, 366, 391, 398, 426, 436, 446] }
{"cid": 339, "neighbors ids": [261, 299, 324, 264, 303, 349, 277, 318, 392, 394, 367, 411, 415, 410] }
{"cid": 360, "neighbors ids": [300, 272, 262, 273, 345, 635, 1, 361, 321, 342, 313, 400, 419, 424, 437] }
{"cid": 352, "neighbors ids": [283, 269, 635, 322, 1, 637, 361, 417, 421, 422] }
{"cid": 365, "neighbors ids": [237, 257, 1, 301, 293, 403, 375, 379, 362, 405, 406, 460, 641] }
{"cid": 403, "neighbors ids": [257, 259, 331, 301, 1, 365, 362, 444, 406, 641, 468] }
{"cid": 354, "neighbors ids": [276, 258, 323, 270, 369, 344, 366, 333, 390, 639, 447, 454, 703, 425, 470] }
{"cid": 369, "neighbors ids": [258, 292, 323, 354, 328, 310, 344, 340, 425, 396, 433, 390, 416, 447, 470] }
{"cid": 371, "neighbors ids": [228, 287, 332, 378, 348, 1, 364, 439, 445, 427] }
{"cid": 664, "neighbors ids": [1, 660, 662, 284, 666, 307, 705, 665, 355, 386, 428] }
{"cid": 666, "neighbors ids": [660, 284, 636, 705, 664, 1, 355, 353, 689, 386, 428, 426, 459, 440, 667, 671] }
{"cid": 375, "neighbors ids": [293, 251, 315, 340, 379, 1, 385, 365, 416, 460] }
{"cid": 366, "neighbors ids": [275, 260, 276, 266, 354, 270, 353, 333, 338, 688, 689, 390, 639, 426, 454, 391, 446, 703, 667] }
{"cid": 357, "neighbors ids": [264, 316, 298, 338, 324, 356, 386, 302, 397, 398, 372, 353, 355, 426, 440, 436] }
{"cid": 380, "neighbors ids": [265, 302, 306, 305, 333, 252, 334, 323, 311, 409, 387, 398, 391, 368, 431, 434, 451, 466, 469] }
{"cid": 362, "neighbors ids": [259, 267, 301, 403, 359, 280, 320, 376, 365, 405, 334, 444, 406, 452] }
{"cid": 359, "neighbors ids": [267, 280, 320, 259, 362, 382, 376, 452] }
{"cid": 355, "neighbors ids": [284, 266, 316, 636, 307, 666, 386, 664, 353, 357, 426, 440, 459] }
{"cid": 356, "neighbors ids": [297, 307, 264, 386, 357, 367, 397, 665, 392, 428, 395, 450, 448] }
{"cid": 373, "neighbors ids": [288, 290, 289, 345, 313, 1, 393, 394, 419, 441] }
{"cid": 382, "neighbors ids": [326, 268, 280, 281, 320, 370, 359, 346, 376, 404, 452, 435, 407, 429, 465, 456] }
{"cid": 363, "neighbors ids": [285, 294, 278, 279, 336, 374, 389, 341, 303, 383, 399, 412, 408, 423, 432, 462, 487] }
{"cid": 388, "neighbors ids": [639, 335, 327, 248, 350, 320, 370, 1, 358, 455, 463] }
{"cid": 374, "neighbors ids": [285, 291, 279, 329, 363, 389, 377, 314, 351, 384, 383, 432, 438, 442, 462] }
{"cid": 689, "neighbors ids": [704, 688, 636, 275, 1, 366, 353, 639, 666, 426, 667] }
{"cid": 353, "neighbors ids": [275, 266, 636, 366, 260, 338, 316, 689, 355, 666, 426, 357] }
{"cid": 394, "neighbors ids": [289, 296, 299, 303, 349, 339, 336, 313, 418, 411, 393, 373, 415, 430, 412, 408, 441, 453, 504] }
{"cid": 409, "neighbors ids": [265, 310, 311, 323, 380, 334, 396, 387, 333, 391, 447, 431, 451, 454, 466, 433, 489, 507] }
{"cid": 381, "neighbors ids": [319, 634, 318, 1, 349, 395, 393, 458] }
{"cid": 368, "neighbors ids": [306, 308, 341, 325, 326, 305, 387, 407, 380, 383, 434, 431, 399, 466, 486, 469] }
{"cid": 389, "neighbors ids": [309, 285, 291, 263, 336, 374, 363, 377, 342, 400, 408, 420, 457, 462, 487] }
{"cid": 377, "neighbors ids": [263, 291, 329, 322, 389, 342, 374, 401, 351, 420, 400, 442, 462] }
{"cid": 390, "neighbors ids": [688, 344, 276, 354, 1, 366, 639, 369, 425, 703, 470] }
{"cid": 402, "neighbors ids": [675, 282, 343, 364, 637, 1, 414, 417, 401, 378, 481, 491, 512] }
{"cid": 386, "neighbors ids": [307, 355, 316, 356, 357, 664, 666, 665, 428, 397, 440, 459, 450, 448, 492] }
{"cid": 385, "neighbors ids": [311, 340, 379, 375, 396, 416, 433, 460, 505] }
{"cid": 395, "neighbors ids": [634, 638, 277, 318, 297, 1, 381, 392, 665, 349, 356, 450, 458, 640] }
{"cid": 367, "neighbors ids": [297, 264, 277, 356, 339, 324, 392, 397, 410, 448] }
{"cid": 372, "neighbors ids": [298, 312, 324, 303, 302, 294, 398, 341, 357, 397, 399, 411, 412, 434, 410, 436, 472, 464] }
{"cid": 393, "neighbors ids": [288, 319, 289, 349, 373, 1, 381, 394, 441, 415, 458, 453] }
{"cid": 392, "neighbors ids": [277, 318, 339, 367, 297, 349, 395, 356, 410, 415, 458, 411, 450, 448, 640, 500, 506] }
{"cid": 376, "neighbors ids": [280, 267, 334, 326, 362, 359, 382, 405, 387, 435, 406, 452, 461] }
{"cid": 400, "neighbors ids": [321, 309, 342, 313, 336, 360, 389, 418, 419, 424, 377, 437, 408, 420, 457, 480] }
{"cid": 384, "neighbors ids": [314, 279, 325, 383, 374, 346, 429, 351, 404, 337, 438, 432, 478] }
{"cid": 396, "neighbors ids": [311, 310, 340, 409, 323, 385, 369, 379, 387, 334, 405, 433, 447, 431, 505, 461, 489] }
{"cid": 405, "neighbors ids": [267, 301, 311, 334, 362, 379, 365, 376, 396, 387, 406, 460, 431, 435, 461, 505, 641] }
{"cid": 387, "neighbors ids": [334, 305, 380, 326, 409, 311, 306, 368, 376, 396, 405, 435, 407, 431] }
{"cid": 398, "neighbors ids": [312, 302, 306, 341, 372, 298, 357, 338, 380, 391, 434, 436, 397, 451, 472, 469, 464, 510, 502, 516] }
{"cid": 383, "neighbors ids": [278, 325, 279, 384, 341, 363, 374, 404, 368, 407, 399, 432, 429, 423, 449, 478] }
{"cid": 414, "neighbors ids": [351, 282, 343, 378, 402, 364, 401, 442, 471, 481, 475, 491, 512] }
{"cid": 401, "neighbors ids": [322, 329, 343, 351, 377, 417, 414, 420, 422, 402, 442, 475, 476, 491] }
{"cid": 417, "neighbors ids": [352, 322, 637, 343, 401, 1, 402, 422, 476, 491] }
{"cid": 391, "neighbors ids": [333, 338, 302, 398, 380, 409, 436, 366, 454, 446, 447, 451, 479] }
{"cid": 397, "neighbors ids": [264, 324, 357, 356, 367, 372, 386, 410, 436, 440, 448, 398, 472, 485, 488] }
{"cid": 411, "neighbors ids": [324, 303, 339, 372, 394, 412, 410, 430, 392, 415, 472, 464, 467, 503, 493, 501] }
{"cid": 444, "neighbors ids": [259, 331, 350, 320, 362, 403, 1, 452, 455, 406, 468, 508] }
{"cid": 404, "neighbors ids": [346, 325, 308, 326, 384, 429, 407, 382, 383, 456, 449] }
{"cid": 399, "neighbors ids": [294, 341, 372, 363, 303, 412, 383, 434, 423, 368, 407, 449, 464] }
{"cid": 427, "neighbors ids": [337, 346, 332, 347, 378, 429, 443, 439, 445, 371, 490, 438, 471, 481, 483, 513, 535] }
{"cid": 407, "neighbors ids": [308, 325, 368, 326, 404, 383, 387, 341, 382, 435, 431, 399, 449, 456, 434, 466, 477, 486, 429, 499] }
{"cid": 419, "neighbors ids": [345, 313, 360, 373, 400, 1, 437, 441, 418, 474] }
{"cid": 429, "neighbors ids": [346, 384, 314, 337, 404, 427, 370, 347, 382, 383, 438, 465, 490, 456, 478, 449, 483, 407, 499, 522, 525, 523, 534] }
{"cid": 425, "neighbors ids": [328, 344, 369, 340, 416, 1, 390, 354, 470, 433, 484] }
{"cid": 418, "neighbors ids": [313, 394, 336, 400, 441, 408, 419, 430, 437, 457, 474, 473, 504] }
{"cid": 421, "neighbors ids": [361, 322, 352, 342, 1, 422, 424, 420, 480, 476, 497] }
{"cid": 416, "neighbors ids": [315, 328, 340, 375, 425, 1, 385, 369, 433, 460, 484, 505] }
{"cid": 426, "neighbors ids": [316, 353, 357, 338, 355, 666, 366, 440, 689, 446, 436, 667, 459, 671] }
{"cid": 412, "neighbors ids": [294, 303, 363, 399, 336, 372, 411, 408, 394, 430, 423, 464, 434, 487, 482, 473, 503] }
{"cid": 413, "neighbors ids": [347, 248, 358, 370, 348, 1, 443, 463] }
{"cid": 439, "neighbors ids": [332, 348, 371, 1, 427, 443, 445, 513, 535] }
{"cid": 428, "neighbors ids": [664, 386, 665, 666, 1, 356, 450, 459] }
{"cid": 434, "neighbors ids": [341, 398, 306, 368, 372, 380, 399, 449, 412, 407, 451, 466, 464, 486, 469, 423, 495, 502] }
{"cid": 408, "neighbors ids": [336, 412, 363, 389, 430, 394, 418, 400, 457, 487, 423, 473, 482] }
{"cid": 424, "neighbors ids": [360, 342, 400, 361, 421, 437, 1, 420, 480] }
{"cid": 433, "neighbors ids": [340, 369, 396, 385, 416, 447, 505, 425, 484, 470, 409, 489, 507, 520, 536, 538] }
{"cid": 440, "neighbors ids": [355, 386, 357, 426, 397, 666, 459, 448, 436, 446, 671, 488, 485, 492, 472, 533] }
{"cid": 415, "neighbors ids": [339, 349, 394, 392, 411, 393, 410, 458, 430, 453, 467, 504, 500] }
{"cid": 435, "neighbors ids": [326, 387, 376, 382, 407, 431, 405, 452, 461, 406, 456, 477, 468, 494] }
{"cid": 420, "neighbors ids": [377, 342, 322, 401, 400, 421, 422, 389, 424, 442, 457, 462, 475, 476, 480, 497] }
{"cid": 422, "neighbors ids": [322, 352, 421, 417, 401, 420, 1, 476] }
{"cid": 445, "neighbors ids": [371, 378, 364, 332, 427, 439, 1, 481, 535] }
{"cid": 447, "neighbors ids": [354, 323, 333, 369, 409, 396, 454, 391, 433, 470, 484, 507, 514, 520] }
{"cid": 436, "neighbors ids": [338, 357, 398, 391, 397, 372, 426, 446, 440, 451, 472, 479, 488, 510, 509] }
{"cid": 406, "neighbors ids": [362, 405, 376, 365, 403, 452, 444, 641, 461, 468, 435] }
{"cid": 410, "neighbors ids": [324, 367, 339, 411, 397, 392, 372, 415, 448, 472, 485, 467, 500, 493, 506] }
{"cid": 452, "neighbors ids": [359, 382, 376, 362, 320, 370, 406, 444, 455, 435, 465, 468, 456, 494, 508, 517, 518] }
{"cid": 430, "neighbors ids": [394, 412, 408, 411, 336, 418, 415, 441, 473, 467, 504, 503] }
{"cid": 441, "neighbors ids": [373, 313, 394, 393, 418, 419, 453, 1, 474, 437, 430, 504] }
{"cid": 455, "neighbors ids": [320, 388, 350, 370, 444, 452, 1, 463, 465, 508, 521, 518] }
{"cid": 438, "neighbors ids": [351, 384, 314, 337, 378, 429, 374, 471, 432, 427, 442, 478, 496, 483, 522, 511] }
{"cid": 443, "neighbors ids": [348, 332, 347, 427, 439, 413, 1, 490, 463, 513] }
{"cid": 450, "neighbors ids": [665, 356, 395, 428, 1, 392, 386, 640, 448, 459, 492, 506] }
{"cid": 437, "neighbors ids": [419, 360, 400, 424, 1, 418, 441, 474, 480, 457] }
{"cid": 454, "neighbors ids": [333, 366, 354, 447, 391, 446, 409, 703, 451, 470, 479, 507, 514, 642, 509, 520, 548] }
{"cid": 460, "neighbors ids": [375, 379, 365, 385, 405, 1, 505, 641, 416, 461, 484] }
{"cid": 458, "neighbors ids": [381, 395, 392, 349, 393, 415, 1, 453, 640, 500, 504, 467] }
{"cid": 431, "neighbors ids": [387, 368, 409, 380, 396, 405, 407, 435, 461, 466, 477, 505, 489, 498, 494] }
{"cid": 423, "neighbors ids": [363, 383, 399, 432, 412, 449, 478, 464, 408, 434, 487, 495, 482] }
{"cid": 432, "neighbors ids": [363, 374, 383, 384, 423, 438, 462, 442, 478, 487, 496, 511] }
{"cid": 463, "neighbors ids": [370, 358, 388, 413, 347, 1, 455, 465, 443, 490, 521, 513] }
{"cid": 446, "neighbors ids": [366, 338, 426, 391, 454, 436, 440, 667, 703, 479, 671, 488, 642, 527, 514] }
{"cid": 448, "neighbors ids": [367, 356, 397, 386, 392, 410, 440, 450, 640, 485, 492, 506] }
{"cid": 465, "neighbors ids": [370, 347, 429, 382, 463, 452, 490, 455, 456, 521, 518, 517, 525, 523, 552] }
{"cid": 703, "neighbors ids": [639, 390, 354, 366, 1, 667, 470, 454, 446, 642, 514] }
{"cid": 459, "neighbors ids": [666, 386, 355, 428, 440, 426, 1, 671, 450, 492] }
{"cid": 451, "neighbors ids": [398, 391, 380, 409, 436, 434, 454, 466, 469, 479, 507, 510, 509, 502, 516, 540, 531] }
{"cid": 457, "neighbors ids": [400, 408, 389, 418, 420, 462, 487, 480, 473, 437, 474, 519, 524, 542] }
{"cid": 442, "neighbors ids": [377, 351, 401, 374, 414, 420, 438, 432, 462, 475, 471, 496] }
{"cid": 471, "neighbors ids": [351, 438, 414, 378, 442, 481, 427, 496, 475, 483, 512, 535, 522, 547] }
{"cid": 481, "neighbors ids": [364, 378, 402, 414, 445, 471, 1, 427, 512, 535, 547] }
{"cid": 667, "neighbors ids": [689, 666, 426, 639, 366, 1, 703, 446, 671, 642] }
{"cid": 505, "neighbors ids": [396, 385, 379, 460, 405, 433, 461, 416, 484, 431, 489, 498, 641, 1, 536, 545] }
{"cid": 641, "neighbors ids": [406, 365, 405, 460, 403, 1, 468, 461, 505, 515, 545] }
{"cid": 461, "neighbors ids": [405, 376, 406, 431, 435, 396, 505, 641, 460, 468, 494, 498, 515, 545] }
{"cid": 449, "neighbors ids": [399, 407, 383, 423, 434, 404, 486, 478, 429, 495, 499] }
{"cid": 462, "neighbors ids": [389, 374, 377, 363, 432, 420, 457, 442, 487, 496, 475, 480, 511, 497, 526, 524, 542, 557] }
{"cid": 453, "neighbors ids": [393, 394, 441, 458, 415, 1, 504] }
{"cid": 456, "neighbors ids": [407, 382, 404, 435, 429, 477, 452, 465, 499, 486, 494, 517, 523, 525, 544] }
{"cid": 490, "neighbors ids": [347, 429, 427, 465, 443, 463, 483, 513, 525, 521, 522, 535, 534, 562, 572] }
{"cid": 470, "neighbors ids": [390, 425, 354, 369, 703, 447, 1, 484, 433, 454, 514, 520] }
{"cid": 640, "neighbors ids": [395, 450, 392, 458, 1, 448, 500, 506] }
{"cid": 468, "neighbors ids": [406, 403, 444, 641, 452, 1, 461, 435, 494, 508, 515] }
{"cid": 472, "neighbors ids": [397, 410, 372, 411, 436, 398, 485, 464, 440, 488, 510, 493, 501, 516, 533, 506, 558, 550, 564] }
{"cid": 466, "neighbors ids": [380, 368, 431, 434, 407, 409, 451, 469, 477, 486, 489, 507, 498, 531, 540, 543] }
{"cid": 464, "neighbors ids": [412, 411, 372, 434, 399, 423, 398, 472, 482, 495, 503, 501, 502, 516, 530, 529] }
{"cid": 478, "neighbors ids": [383, 384, 432, 423, 429, 438, 449, 499, 495, 511, 522, 486, 496, 534, 537, 555, 556, 563] }
{"cid": 475, "neighbors ids": [420, 401, 442, 414, 476, 491, 462, 471, 496, 497, 512, 526, 532, 557, 553] }
{"cid": 476, "neighbors ids": [422, 420, 401, 417, 421, 475, 491, 1, 497, 532, 526] }
{"cid": 480, "neighbors ids": [424, 400, 420, 421, 457, 437, 497, 474, 1, 462, 519, 526, 524] }
{"cid": 491, "neighbors ids": [401, 414, 417, 402, 476, 1, 475, 512, 532] }
{"cid": 477, "neighbors ids": [407, 431, 435, 456, 466, 486, 494, 498, 517, 531, 539, 544, 543, 546] }
{"cid": 486, "neighbors ids": [368, 434, 407, 449, 469, 466, 456, 499, 477, 502, 495, 478, 543, 544, 546, 563, 566] }
{"cid": 487, "neighbors ids": [408, 389, 363, 462, 457, 423, 412, 432, 482, 473, 495, 511, 530, 542, 560, 568] }
{"cid": 484, "neighbors ids": [425, 416, 433, 470, 505, 460, 447, 1, 520, 536, 538] }
{"cid": 469, "neighbors ids": [434, 380, 451, 466, 398, 368, 486, 502, 540, 543, 531] }
{"cid": 671, "neighbors ids": [666, 459, 426, 667, 440, 1, 446, 642, 492, 527, 488, 533, 549] }
{"cid": 474, "neighbors ids": [441, 418, 437, 419, 1, 457, 480, 473, 504, 519] }
{"cid": 473, "neighbors ids": [418, 430, 408, 457, 412, 482, 503, 487, 474, 504, 519, 541, 542] }
{"cid": 467, "neighbors ids": [415, 430, 411, 410, 500, 458, 504, 493, 503, 528] }
{"cid": 504, "neighbors ids": [394, 441, 453, 415, 430, 418, 458, 467, 474, 473, 1, 500, 528, 503, 519, 541] }
{"cid": 496, "neighbors ids": [442, 432, 438, 462, 471, 475, 511, 512, 478, 522, 537, 532, 553, 557, 547, 569, 571] }
{"cid": 479, "neighbors ids": [446, 391, 454, 436, 451, 488, 509, 514, 527, 549, 548] }
{"cid": 485, "neighbors ids": [448, 397, 410, 440, 472, 488, 493, 492, 506, 533, 558] }
{"cid": 497, "neighbors ids": [421, 420, 480, 476, 475, 1, 462, 526] }
{"cid": 492, "neighbors ids": [386, 459, 450, 440, 448, 1, 671, 506, 485, 533] }
{"cid": 500, "neighbors ids": [392, 458, 415, 640, 410, 467, 506, 1, 493, 504, 528, 551, 558] }
{"cid": 482, "neighbors ids": [408, 412, 487, 423, 473, 464, 503, 495, 530, 541, 542, 568, 567] }
{"cid": 483, "neighbors ids": [438, 429, 427, 490, 471, 522, 535] }
{"cid": 488, "neighbors ids": [440, 397, 436, 472, 446, 479, 485, 510, 671, 509, 527, 533, 549, 550] }
{"cid": 494, "neighbors ids": [435, 461, 468, 452, 431, 477, 456, 498, 515, 517, 508, 545, 539, 554, 565] }
{"cid": 508, "neighbors ids": [444, 452, 455, 1, 468, 494, 518, 515, 517, 552, 554] }
{"cid": 489, "neighbors ids": [396, 433, 409, 431, 505, 498, 507, 466, 536, 531, 538, 561] }
{"cid": 495, "neighbors ids": [423, 434, 449, 464, 478, 486, 502, 487, 511, 482, 530, 529, 555, 559, 563, 566] }
{"cid": 499, "neighbors ids": [407, 449, 429, 456, 486, 478, 525, 534, 544, 563, 556] }
{"cid": 512, "neighbors ids": [414, 402, 481, 491, 471, 1, 475, 496, 532, 547, 553] }
{"cid": 513, "neighbors ids": [427, 443, 439, 490, 463, 1, 521, 535, 562, 572] }
{"cid": 507, "neighbors ids": [409, 447, 454, 451, 433, 489, 466, 509, 520, 538, 531, 548, 540, 561, 573, 575] }
{"cid": 503, "neighbors ids": [430, 412, 473, 411, 482, 464, 467, 493, 504, 501, 528, 530, 529, 541, 551, 567] }
{"cid": 498, "neighbors ids": [431, 505, 461, 489, 494, 477, 466, 545, 531, 539, 536, 574, 561] }
{"cid": 493, "neighbors ids": [410, 411, 472, 467, 485, 500, 501, 503, 506, 528, 551, 558] }
{"cid": 642, "neighbors ids": [667, 446, 703, 454, 1, 671, 514, 527] }
{"cid": 506, "neighbors ids": [640, 392, 448, 410, 500, 450, 492, 485, 1, 493, 533, 472, 558] }
{"cid": 510, "neighbors ids": [436, 398, 472, 451, 488, 516, 509, 540, 550, 549, 570, 564, 579] }
{"cid": 521, "neighbors ids": [465, 463, 455, 490, 518, 1, 513, 525, 552, 562] }
{"cid": 514, "neighbors ids": [703, 454, 470, 447, 642, 520, 446, 479, 1, 527, 548] }
{"cid": 502, "neighbors ids": [434, 398, 469, 486, 464, 495, 451, 516, 540, 529, 543, 559, 566, 563] }
{"cid": 511, "neighbors ids": [432, 462, 496, 487, 495, 478, 438, 537, 530, 555, 557, 542, 560, 569, 582] }
{"cid": 501, "neighbors ids": [411, 472, 464, 493, 516, 503, 529, 558, 551, 578] }
{"cid": 518, "neighbors ids": [465, 452, 455, 508, 521, 517, 1, 552] }
{"cid": 509, "neighbors ids": [479, 451, 454, 436, 507, 488, 510, 540, 548, 549, 570, 575] }
{"cid": 517, "neighbors ids": [456, 452, 465, 477, 494, 523, 518, 508, 552, 544, 539, 546, 554, 577] }
{"cid": 522, "neighbors ids": [429, 438, 478, 483, 490, 471, 496, 534, 537, 535, 547, 556, 572, 571, 580] }
{"cid": 520, "neighbors ids": [447, 470, 484, 514, 454, 433, 507, 538, 536, 548, 1] }
{"cid": 515, "neighbors ids": [461, 468, 641, 494, 508, 1, 545, 554, 565] }
{"cid": 516, "neighbors ids": [472, 398, 464, 510, 502, 451, 501, 540, 529, 559, 564, 558, 578, 579] }
{"cid": 525, "neighbors ids": [429, 490, 465, 523, 534, 456, 521, 499, 544, 552, 562, 584] }
{"cid": 535, "neighbors ids": [427, 445, 439, 481, 471, 483, 513, 490, 1, 547, 522, 572] }
{"cid": 519, "neighbors ids": [474, 480, 457, 473, 504, 1, 524, 541, 542] }
{"cid": 530, "neighbors ids": [482, 464, 487, 495, 503, 529, 511, 555, 559, 560, 568, 567, 586] }
{"cid": 523, "neighbors ids": [456, 429, 465, 525, 517, 544, 552, 577, 584] }
{"cid": 527, "neighbors ids": [671, 446, 642, 488, 514, 479, 1, 549, 548] }
{"cid": 533, "neighbors ids": [440, 485, 492, 488, 671, 472, 506, 549, 558, 550, 1, 564] }
{"cid": 528, "neighbors ids": [504, 467, 500, 503, 493, 1, 551, 541, 567] }
{"cid": 534, "neighbors ids": [429, 478, 522, 490, 525, 499, 544, 556, 563, 572, 562, 584, 580, 585, 587] }
{"cid": 526, "neighbors ids": [462, 497, 480, 475, 524, 476, 532, 1, 542, 557, 553] }
{"cid": 524, "neighbors ids": [457, 480, 462, 526, 519, 542, 1] }
{"cid": 537, "neighbors ids": [511, 496, 478, 522, 555, 556, 571, 569, 582, 580] }
{"cid": 532, "neighbors ids": [475, 476, 491, 512, 496, 526, 1, 553] }
{"cid": 536, "neighbors ids": [433, 505, 484, 489, 520, 538, 498, 545, 1, 561, 574] }
{"cid": 545, "neighbors ids": [505, 461, 641, 498, 515, 494, 536, 1, 539, 565, 574] }
{"cid": 531, "neighbors ids": [466, 498, 477, 489, 507, 451, 540, 469, 539, 543, 561, 574, 573, 583, 588] }
{"cid": 529, "neighbors ids": [464, 503, 501, 495, 530, 516, 502, 559, 551, 578, 567, 576, 586] }
{"cid": 541, "neighbors ids": [473, 504, 503, 519, 528, 482, 542, 1, 567, 568] }
{"cid": 539, "neighbors ids": [477, 498, 494, 531, 517, 543, 546, 545, 554, 565, 574, 577, 581, 583] }
{"cid": 544, "neighbors ids": [456, 499, 525, 523, 486, 477, 517, 546, 534, 563, 584, 577, 581, 593] }
{"cid": 552, "neighbors ids": [517, 465, 518, 508, 523, 521, 525, 554, 1, 562, 577, 584] }
{"cid": 542, "neighbors ids": [457, 473, 519, 524, 487, 462, 482, 541, 526, 557, 511, 1, 560, 568] }
{"cid": 549, "neighbors ids": [671, 488, 479, 527, 533, 509, 548, 550, 510, 1, 570] }
{"cid": 538, "neighbors ids": [507, 520, 433, 536, 489, 484, 548, 1, 561, 573] }
{"cid": 540, "neighbors ids": [451, 466, 469, 502, 516, 509, 507, 510, 531, 543, 559, 566, 575, 570, 573, 579, 588, 590] }
{"cid": 543, "neighbors ids": [466, 469, 486, 477, 531, 502, 540, 539, 546, 566, 588, 583, 581, 593, 590] }
{"cid": 548, "neighbors ids": [454, 514, 520, 479, 507, 509, 527, 549, 538, 570, 1, 573, 575] }
{"cid": 547, "neighbors ids": [471, 481, 512, 535, 522, 496, 1, 553, 571, 572, 580] }
{"cid": 551, "neighbors ids": [493, 500, 528, 503, 501, 558, 529, 567, 578, 1, 576] }
{"cid": 554, "neighbors ids": [494, 515, 508, 517, 1, 565, 552, 539, 577] }
{"cid": 558, "neighbors ids": [472, 506, 485, 493, 533, 500, 501, 551, 564, 516, 1, 578, 579] }
{"cid": 546, "neighbors ids": [477, 486, 544, 517, 539, 543, 563, 566, 577, 581, 593] }
{"cid": 550, "neighbors ids": [488, 472, 533, 549, 510, 564, 570, 1] }
{"cid": 557, "neighbors ids": [462, 475, 526, 496, 511, 553, 542, 560, 569, 1] }
{"cid": 553, "neighbors ids": [475, 532, 496, 512, 557, 526, 547, 1, 569, 571] }
{"cid": 555, "neighbors ids": [495, 478, 511, 537, 530, 556, 563, 559, 560, 566, 582, 586, 580, 589, 594, 595] }
{"cid": 556, "neighbors ids": [478, 537, 522, 534, 499, 555, 563, 580, 585, 587, 594] }
{"cid": 562, "neighbors ids": [490, 513, 521, 525, 552, 1, 534, 572, 584, 587] }
{"cid": 559, "neighbors ids": [502, 529, 495, 516, 530, 555, 540, 566, 563, 578, 579, 586, 590, 592, 595, 591] }
{"cid": 563, "neighbors ids": [478, 495, 486, 499, 555, 556, 534, 544, 502, 566, 546, 559, 584, 587, 593, 595, 596, 594, 589, 597] }
{"cid": 565, "neighbors ids": [494, 545, 515, 554, 539, 1, 574, 577, 581] }
{"cid": 560, "neighbors ids": [487, 542, 511, 557, 530, 568, 569, 555, 582, 586, 589, 1] }
{"cid": 567, "neighbors ids": [528, 503, 541, 551, 482, 530, 529, 568, 576, 1, 586] }
{"cid": 572, "neighbors ids": [490, 535, 513, 522, 534, 562, 1, 547, 580, 585, 587] }
{"cid": 568, "neighbors ids": [542, 482, 487, 541, 530, 560, 567, 1, 586, 589] }
{"cid": 570, "neighbors ids": [509, 549, 510, 548, 550, 540, 575, 564, 579, 1] }
{"cid": 564, "neighbors ids": [533, 472, 550, 510, 558, 516, 570, 579, 1] }
{"cid": 569, "neighbors ids": [557, 511, 496, 553, 560, 537, 571, 582, 1] }
{"cid": 571, "neighbors ids": [496, 537, 522, 547, 553, 569, 580, 1, 582] }
{"cid": 561, "neighbors ids": [489, 538, 536, 507, 498, 531, 574, 573, 1, 583] }
{"cid": 574, "neighbors ids": [498, 545, 539, 536, 531, 561, 565, 573, 1, 583, 581] }
{"cid": 566, "neighbors ids": [502, 486, 495, 563, 543, 559, 540, 546, 555, 590, 593, 595, 588, 591, 597] }
{"cid": 578, "neighbors ids": [501, 529, 516, 551, 558, 559, 576, 579, 586, 592, 591, 1] }
{"cid": 573, "neighbors ids": [507, 548, 538, 531, 561, 575, 540, 574, 588, 1, 583] }
{"cid": 575, "neighbors ids": [509, 507, 548, 540, 570, 573, 579, 588, 590, 1] }
{"cid": 579, "neighbors ids": [510, 516, 564, 540, 570, 559, 558, 578, 575, 590, 592, 1] }
{"cid": 576, "neighbors ids": [551, 529, 567, 578, 586, 1] }
{"cid": 577, "neighbors ids": [517, 552, 554, 539, 523, 546, 565, 544, 581, 584, 1] }
{"cid": 582, "neighbors ids": [511, 537, 560, 555, 569, 571, 580, 589, 594, 1] }
{"cid": 580, "neighbors ids": [522, 537, 547, 571, 572, 556, 534, 555, 582, 585, 594, 1] }
{"cid": 584, "neighbors ids": [523, 525, 544, 552, 534, 577, 562, 563, 593, 581, 587, 596, 1] }
{"cid": 586, "neighbors ids": [529, 530, 559, 567, 555, 568, 576, 560, 578, 589, 595, 591, 1] }
{"cid": 581, "neighbors ids": [539, 546, 577, 565, 574, 543, 544, 583, 593, 584, 1] }
{"cid": 583, "neighbors ids": [531, 539, 543, 574, 573, 588, 581, 593, 561, 1] }
{"cid": 588, "neighbors ids": [540, 531, 543, 573, 575, 583, 590, 593, 566, 597, 1] }
{"cid": 585, "neighbors ids": [556, 534, 580, 572, 587, 594, 1] }
{"cid": 590, "neighbors ids": [540, 559, 579, 566, 543, 575, 588, 592, 593, 591, 597, 595, 1] }
{"cid": 593, "neighbors ids": [543, 546, 581, 566, 563, 544, 583, 584, 588, 590, 596, 597, 1] }
{"cid": 589, "neighbors ids": [560, 555, 586, 582, 594, 568, 595, 563, 1] }
{"cid": 587, "neighbors ids": [534, 563, 556, 584, 585, 562, 572, 596, 594, 1] }
{"cid": 594, "neighbors ids": [555, 556, 582, 580, 563, 589, 585, 587, 595, 596, 1] }
{"cid": 592, "neighbors ids": [579, 559, 578, 590, 591, 1] }
{"cid": 595, "neighbors ids": [559, 555, 566, 563, 586, 591, 589, 590, 597, 594, 596, 1] }
{"cid": 591, "neighbors ids": [559, 578, 566, 586, 592, 595, 590, 1] }
{"cid": 596, "neighbors ids": [563, 584, 587, 593, 597, 594, 595, 1] }
{"cid": 597, "neighbors ids": [566, 563, 593, 590, 595, 596, 588, 1] }
