cid: 2, volume: 63.285023359729045, center: [4.426646046156889 0.9133051043945118 11.721567842513423]
cid: 3, volume: 163.51672172128042, center: [7.386016604197543 1.3114226007388026 19.370847305679547]
cid: 4, volume: 192.06985713651707, center: [5.99434765831113 1.8053930839284544 23.075384671165565]
cid: 5, volume: 69.87904846223412, center: [2.5839416556216905 1.354336310462813 26.59223282081758]
cid: 6, volume: 21.72001398267893, center: [1.337386821282844 0.7145283429895714 43.05796884588644]
cid: 7, volume: 248.58467915054436, center: [5.257994781701451 1.9094927906246837 50.79140971853802]
cid: 8, volume: 223.50473252975692, center: [5.110558464099573 2.06937736354935 56.14851301863634]
cid: 9, volume: 37.613627922495546, center: [1.5280569543071458 1.078835716962195 63.69831590766143]
cid: 10, volume: 26.03633194099809, center: [1.7068352955877728 0.9425695447075881 68.70383268632189]
cid: 11, volume: 52.16075200359453, center: [2.536417906587149 1.682085739927624 34.127307468275035]
cid: 12, volume: 263.4967397354079, center: [3.6825769296481905 3.2050344084244715 16.055115865227567]
cid: 13, volume: 115.63453562389147, center: [3.474431920524375 2.260937722711938 1.336615217107411]
cid: 14, volume: 259.1678377597176, center: [7.952144212135831 2.0331525680019427 60.988291684389424]
cid: 15, volume: 242.92187133350754, center: [6.465356085334177 2.574721908619975 36.929442944156655]
cid: 16, volume: 132.86205540505452, center: [2.1946163174875375 3.9825168378480775 9.687596541200985]
cid: 17, volume: 163.30279342597012, center: [4.708380380302257 3.370659547044772 30.504696514448643]
cid: 18, volume: 451.1621907920075, center: [7.54466797939556 3.1039986192681024 41.45108526670758]
cid: 19, volume: 132.87463942242573, center: [3.9032480005319607 3.943065650156265 64.8899770970736]
cid: 20, volume: 16.67382301683058, center: [0.888984649302811 5.103982469433962 66.66297754867925]
cid: 21, volume: 395.15072947282795, center: [3.963716228993632 6.7582096680360495 24.842212663354672]
cid: 22, volume: 42.58431478411674, center: [1.0569968424121001 5.627240077423168 55.245421983451536]
cid: 23, volume: 157.23729705305516, center: [3.699350694747746 6.941412834733893 36.74363135734294]
cid: 24, volume: 44.79910184144669, center: [1.4862761771563444 7.518696423033708 6.830208161235955]
cid: 25, volume: 32.479348835048846, center: [4.24380622863608 7.916910578070516 9.649769188686555]
cid: 26, volume: 21.4179975657703, center: [0.7114248526651132 8.35507071680376 19.223300242068156]
cid: 27, volume: 488.59964247130637, center: [10.020223237186743 7.996286079944369 29.850519333505037]
cid: 28, volume: 155.07284606520997, center: [2.703411710609724 8.916693392031162 68.95947382017367]
cid: 29, volume: 331.29942533139524, center: [5.268361300216477 7.160222045960421 14.238618142363354]
cid: 30, volume: 104.08240767713639, center: [1.9779726986689616 8.05726244710434 2.112530838109056]
cid: 31, volume: 277.65375927799994, center: [5.739114297204467 11.134180664340104 24.706541777284265]
cid: 32, volume: 9.337340889425125, center: [0.4491460533569444 9.628425997304584 10.176537350404313]
cid: 33, volume: 196.12191073004118, center: [2.1561332592831297 10.514620537696505 63.25578862123837]
cid: 34, volume: 56.30089371871699, center: [1.3477180484082103 11.21448780509611 38.32290019982119]
cid: 35, volume: 23.129423928252532, center: [1.1603498573606377 12.198535992383025 15.618269805223068]
cid: 36, volume: 228.5005874261205, center: [3.083658264161122 12.686597231192863 53.14118703469545]
cid: 37, volume: 398.6239182672772, center: [4.539026551973377 13.878892674811377 19.243468041039243]
cid: 38, volume: 330.4562961675253, center: [3.7038420870449116 13.01480445674029 6.67520459527799]
cid: 39, volume: 192.91298630038702, center: [4.09089175793333 14.654052319765167 12.27942366888454]
cid: 40, volume: 211.23531559284385, center: [2.520637783929085 14.087927534016442 57.754520090789946]
cid: 41, volume: 27.04305333069352, center: [0.7961183082097163 15.866458601209866 25.707248611447188]
cid: 42, volume: 290.61529717032863, center: [3.1919359376126897 18.96836279293323 36.22483092023903]
cid: 43, volume: 13.099962083411798, center: [0.5673930316703089 18.053382956772335 23.508895483189242]
cid: 44, volume: 203.5842330311586, center: [3.2723205378550966 18.7699096102114 15.209352451724564]
cid: 45, volume: 161.36485475080642, center: [2.2284204663656793 19.17764821726585 8.982478541370975]
cid: 46, volume: 228.41249930452216, center: [2.223768586412933 20.548318476888326 68.43339539209961]
cid: 47, volume: 80.66355134934642, center: [1.7110102853162916 21.047467447737912 43.21587785678627]
cid: 48, volume: 165.1400599621643, center: [2.2637219908602924 21.516649675074298 62.78556212253295]
cid: 49, volume: 218.47112558127978, center: [2.6893615163981583 21.87477796255976 32.018191252001614]
cid: 50, volume: 27.48349393868527, center: [1.0683694835244888 22.439294665750914 45.862157310439564]
cid: 51, volume: 344.66365177960205, center: [4.210745607004815 21.750657390923365 25.978688689400855]
cid: 52, volume: 54.77822761680265, center: [0.996899901066979 24.355579002067543 20.035437739490007]
cid: 53, volume: 212.3678771562512, center: [2.188778025916222 26.4156023308841 37.93092063273288]
cid: 54, volume: 267.0706006688267, center: [4.413902245070173 26.073824906752108 49.15804983442492]
cid: 55, volume: 197.09088006762303, center: [4.305541743182919 25.67199468343762 28.764588584855066]
cid: 56, volume: 270.90872596704054, center: [3.0812410324555395 28.95533120401338 62.3987868482906]
cid: 57, volume: 296.2781049873654, center: [4.697467842188482 30.22820832874618 43.74350952471968]
cid: 58, volume: 291.4835943689409, center: [3.7813535027392424 29.561037958813625 68.90759560920434]
cid: 59, volume: 319.8353855062385, center: [3.2629654755126567 29.498267488275104 24.252865892744726]
cid: 60, volume: 9.387676958909896, center: [0.7195919122108962 30.10847186863271 39.73038645844505]
cid: 61, volume: 139.19181614276457, center: [2.3976138326658734 31.260632141759334 55.466801347979384]
cid: 62, volume: 105.69316190064909, center: [1.5348069068136823 35.983237028217644 38.50514605619717]
cid: 63, volume: 320.6785146701084, center: [3.298042171605299 34.74298955852922 34.14825412502453]
cid: 64, volume: 40.067511309878164, center: [1.4103570783442576 34.23460993907036 46.6790902701005]
cid: 65, volume: 143.43262999685655, center: [2.455061349899369 35.337853547289 29.025931104053345]
cid: 66, volume: 266.29039159181275, center: [2.3821912375457925 37.61666153130759 44.79091524748358]
cid: 67, volume: 205.1572352025577, center: [2.199433942778678 36.89295478672637 19.830921780408516]
cid: 68, volume: 191.6671685806389, center: [2.1923451733400197 38.99114531153568 62.87747126991006]
cid: 69, volume: 6.367512789823603, center: [0.6635677894054985 39.388975324110675 31.968221308300397]
cid: 70, volume: 16.93808738162563, center: [0.6631294998032294 43.56273745468054 37.36666707578009]
cid: 71, volume: 361.80308343916676, center: [3.3908172627120567 43.959293130325904 51.83674200806929]
cid: 72, volume: 170.41276324069412, center: [2.412535407338532 43.62494876281199 59.95241903190076]
cid: 73, volume: 31.04477085473286, center: [0.8433209106018199 45.24416486015404 41.13098090717471]
cid: 74, volume: 205.4718356368375, center: [2.676323703648871 43.96682898995591 17.266279743875554]
cid: 75, volume: 37.3367795403293, center: [1.163518030922423 45.51039986585777 35.9905772908662]
cid: 76, volume: 129.7412190969987, center: [1.8738778863546943 52.95931664112513 43.96868669738119]
cid: 77, volume: 68.09211799552473, center: [1.2239596422833956 52.358781979301426 38.5676992012567]
cid: 78, volume: 22.76448742448794, center: [1.009668625587678 52.74699340851299 49.02836302929796]
cid: 79, volume: 105.3156413795133, center: [2.0947969815600436 55.9052165298124 33.513331215915876]
cid: 80, volume: 88.96900281433373, center: [4.033826093604077 4.746208788401697 68.41607387439886]
cid: 81, volume: 312.297559100894, center: [4.2816487733062445 7.368591716081719 48.584531715437]
cid: 82, volume: 5.612471747552029, center: [1.0151584157604359 47.902740919282515 41.22933897309417]
cid: 83, volume: 188.13105969933372, center: [7.881422639065226 1.6881544519063545 31.96330090207358]
cid: 84, volume: 178.81888684465096, center: [6.319394070995015 10.811180495847994 11.645434338353272]
cid: 85, volume: 179.8130242169752, center: [3.7708674777577667 26.23466726670866 57.728183304639934]
cid: 86, volume: 274.06731432720994, center: [3.8082944450480154 30.79895933504752 49.59146190210754]
cid: 87, volume: 473.0583810178831, center: [5.375776364120007 35.45297126612045 67.3326293389551]
cid: 88, volume: 465.6589788036217, center: [6.086925400721495 17.189446963625553 39.40279883050481]
cid: 89, volume: 229.0291161557106, center: [5.010279452898206 4.062136830659341 4.669282880109891]
cid: 90, volume: 184.9598873217931, center: [2.908952306650889 15.566646655327254 74.77285869492448]
cid: 91, volume: 394.3201843263292, center: [6.212775249101128 33.033657631274934 73.3837230768789]
cid: 92, volume: 463.721040128458, center: [10.393045232037233 4.343380200651289 48.763903856499326]
cid: 93, volume: 334.4328456568222, center: [8.97929393581203 8.980675364689946 19.38072525436484]
cid: 94, volume: 583.4957174674719, center: [5.393976293993845 9.210300429347827 43.205796121635615]
cid: 95, volume: 282.7754543480754, center: [3.8159226242381865 13.993489489564329 69.92546823621556]
cid: 96, volume: 336.40853638409953, center: [5.5314963621208255 30.317919021209747 30.80893710283171]
cid: 97, volume: 258.5512209085291, center: [3.517006645913581 38.39046839628151 26.413007447581037]
cid: 98, volume: 352.2014781849466, center: [5.407356659150149 49.195187099471205 57.29505772902672]
cid: 99, volume: 52.99129715009326, center: [3.4178278018839685 6.471143338399431 55.160515200189984]
cid: 100, volume: 413.93866740801894, center: [5.3411574655275 20.108591416793335 55.586788617012225]
cid: 101, volume: 369.17731761868583, center: [4.460473663246273 37.073157016054815 51.786614091488566]
cid: 102, volume: 102.88692602687307, center: [9.56934865720993 0.7828762436399218 45.39240012059687]
cid: 103, volume: 13.8046670561986, center: [3.8344398004200766 4.61554845396536 52.29045446672744]
cid: 104, volume: 529.812299361963, center: [4.713283364286762 18.295459264548004 49.25947571431286]
cid: 105, volume: 219.8050314226262, center: [5.216633274776445 22.070145008644875 12.554685880689302]
cid: 106, volume: 312.3982312398635, center: [6.048997944497029 26.263430937844916 54.264311132326284]
cid: 107, volume: 723.0902221661147, center: [7.704770457894212 13.004933390543151 32.316745207149204]
cid: 108, volume: 343.24165781665727, center: [5.544151833875141 38.54907938466051 13.388510161680598]
cid: 109, volume: 437.1939315099834, center: [5.199500623106263 51.01731840648207 33.75535164912786]
cid: 110, volume: 526.7040470712784, center: [6.018322766595861 43.85518874361486 22.796116281543423]
cid: 111, volume: 474.1280224944345, center: [6.523185681359476 28.226231260344505 14.798462984101707]
cid: 112, volume: 371.1907603980767, center: [12.584789301945936 5.216789820591925 25.2960260212225]
cid: 113, volume: 321.6726520424327, center: [6.465061820516741 41.259218646193574 35.617504528440655]
cid: 114, volume: 422.38254306408936, center: [5.580915127002283 35.2227183363027 58.42973937297781]
cid: 115, volume: 506.2298508083476, center: [6.085154064688097 47.0206822145272 28.371456762304863]
cid: 116, volume: 423.9177931833749, center: [6.091312205524143 52.00724317374655 53.22313025475703]
cid: 117, volume: 116.9936094999803, center: [7.323054212754036 1.326024743465634 65.47288941400451]
cid: 118, volume: 295.76216027514647, center: [5.568296909428803 23.66277695783517 71.42170483282986]
cid: 119, volume: 524.3256677881229, center: [6.344680850607298 49.425750516920274 46.05226702131234]
cid: 120, volume: 54.589467356234756, center: [6.704555781093778 5.294307136007377 19.61278688197326]
cid: 121, volume: 522.1486327829066, center: [6.886887571787417 19.439193581616177 20.54757076890078]
cid: 122, volume: 115.65970365863386, center: [6.334811017577125 22.264288071809382 8.91771487607442]
cid: 123, volume: 487.11472842150556, center: [5.661222078008845 43.093132299620244 43.08901601229688]
cid: 124, volume: 224.9644785448153, center: [8.932936843849465 1.8475938717905689 8.627555213962074]
cid: 125, volume: 200.84091724423854, center: [7.833111682470449 10.973094854260653 37.83186667681704]
cid: 126, volume: 561.838623571649, center: [6.941248482939213 15.712048204448228 63.41540417447981]
cid: 127, volume: 433.84658288924606, center: [6.262572444524657 32.79401339291101 16.808907089975637]
cid: 128, volume: 137.61881397136546, center: [3.3031009952382253 6.554126309436723 59.78301957553036]
cid: 129, volume: 166.1971174213445, center: [6.18131525049697 27.754334195350953 41.667632764594536]
cid: 130, volume: 6.493352963535531, center: [5.594415359887771 0.34345847674418606 3.4523734534883723]
cid: 131, volume: 407.33205828814266, center: [7.862892288096421 18.904324804040904 45.95790854255615]
cid: 132, volume: 180.30380089445174, center: [8.683895381457964 7.09107963051368 63.968310230457845]
cid: 133, volume: 334.483181726307, center: [5.997038480600481 44.50295697878104 32.82858920428894]
cid: 134, volume: 551.2177129103621, center: [8.288301703210662 51.869054984133506 39.571780826336095]
cid: 135, volume: 512.0814188859523, center: [8.85542071780259 15.427056685326717 26.053071595999313]
cid: 136, volume: 712.8090799738501, center: [10.36271176465356 24.463458047418968 39.14539872367771]
cid: 137, volume: 183.83990977575692, center: [8.589763261811186 49.76111572564858 20.562256514751184]
cid: 138, volume: 239.73811493859574, center: [10.245289221652902 6.714973389113433 59.46508702451315]
cid: 139, volume: 195.29136558354247, center: [9.385336356185842 10.844378805979767 67.62789723590437]
cid: 140, volume: 190.13191846135337, center: [7.596175981113021 25.59136994652194 66.49154017353895]
cid: 141, volume: 346.60159045476576, center: [7.672802466811084 41.12189536869622 56.36569882939404]
cid: 142, volume: 13.20063422238134, center: [9.023997560450823 0.44132429551954244 3.5117477750238324]
cid: 143, volume: 197.543904692986, center: [12.60833826334383 6.120132607593325 36.13691349802523]
cid: 144, volume: 338.9001718235957, center: [8.73905480190413 26.714762878838513 19.16076823259441]
cid: 145, volume: 550.3871677638634, center: [9.500433613465587 36.93140852687656 39.17005125358393]
cid: 146, volume: 380.64135744384254, center: [8.429622314733663 42.32804852400159 63.407855736511515]
cid: 147, volume: 154.97217392624043, center: [8.038966839287792 7.826919636215997 1.9415553859520913]
cid: 148, volume: 268.1150741106357, center: [8.128351344806967 57.483888292312024 36.62607260968741]
cid: 149, volume: 318.0610390569003, center: [7.62124843037586 57.82481136751731 50.496997072838774]
cid: 150, volume: 119.87534947798348, center: [15.074232810388619 0.8887074595842956 52.51601411715306]
cid: 151, volume: 16.485062756262685, center: [8.85065112208139 17.71221663206107 14.849832161832062]
cid: 152, volume: 393.20020678029306, center: [9.16306025766156 34.00887697625296 23.357040605005444]
cid: 153, volume: 273.4506974760215, center: [9.289510088274683 19.064257944408652 58.81800043120111]
cid: 154, volume: 191.25189600738955, center: [8.501814412389018 28.244771875641533 74.89358540650086]
cid: 155, volume: 27.634502147139585, center: [9.776509575938883 1.6461127149362478 62.891172965391625]
cid: 156, volume: 462.57589454767947, center: [9.439006999649743 8.897907706684077 54.90629575728393]
cid: 157, volume: 128.41989727302345, center: [10.250187052631668 17.19395703263106 9.658234376090151]
cid: 158, volume: 264.088188551854, center: [8.248289280443013 19.5622131811684 75.4921495325455]
cid: 159, volume: 242.55693482974294, center: [10.232076139826205 27.03979525136187 45.108317437717254]
cid: 160, volume: 341.55539948891743, center: [9.359993086219253 46.71643851727949 60.171394581313095]
cid: 161, volume: 338.9001718235957, center: [10.436151761697067 11.364878592402809 48.496533591103194]
cid: 162, volume: 260.31298334049615, center: [9.572381924000133 28.283828507009574 32.84296532321377]
cid: 163, volume: 517.8826508940722, center: [11.000957194349603 39.31164874967197 19.082218600379065]
cid: 164, volume: 296.20260088313825, center: [10.659158929287583 44.938909352451354 38.02641549519925]
cid: 165, volume: 473.41073350427655, center: [10.754999861660668 54.761888240935676 46.759672447581075]
cid: 166, volume: 181.72579485739652, center: [11.685793924327774 14.726213646561874 58.36537773852226]
cid: 167, volume: 150.55518382895173, center: [10.332457045139197 31.181610401036444 36.828097477432294]
cid: 168, volume: 357.18474906393897, center: [12.720103898873075 13.654586577437993 42.94481670849775]
cid: 169, volume: 253.53019797742314, center: [10.824114237744995 39.30985600407009 71.52192826872488]
cid: 170, volume: 231.3319913346389, center: [10.06373732433731 9.741590913126258 6.569718403089811]
cid: 171, volume: 458.83844138843517, center: [10.16173029834177 36.48813903817673 45.27554774214251]
cid: 172, volume: 18.775353917819793, center: [10.458292442259337 9.161609868632707 14.75767223458445]
cid: 173, volume: 425.45304330266043, center: [11.29563676496496 21.90569750202609 31.8146876822148]
cid: 174, volume: 162.77426469638004, center: [10.018445718817805 33.096848017935834 10.934476124313877]
cid: 175, volume: 373.01544291689964, center: [10.872692314678513 55.74112253444437 30.323093735847788]
cid: 176, volume: 203.3703047358483, center: [12.496631280948717 4.509258888558876 5.158273755831941]
cid: 177, volume: 192.08244115388828, center: [10.535499194509255 27.7771164533543 22.517472668107967]
cid: 178, volume: 371.6941210929244, center: [12.372851148414231 46.0252421732742 16.898141842028643]
cid: 179, volume: 470.5793295957581, center: [12.367280334282464 47.369380266185324 50.34531365872443]
cid: 180, volume: 43.79238045175126, center: [11.345193735655196 1.3747477201149425 56.7697698637931]
cid: 181, volume: 119.95085358221063, center: [14.324827215486058 7.511110323122115 32.5961447284935]
cid: 182, volume: 365.603456685267, center: [11.526418802389479 49.01585328592572 65.15786547344509]
cid: 183, volume: 368.44744461115664, center: [10.790410571064406 17.26655868888965 70.52725657775198]
cid: 184, volume: 458.15890445039076, center: [11.69824981828979 27.159788285981104 62.38223004438585]
cid: 185, volume: 238.16511276719663, center: [11.514383493740944 22.698119019444153 14.531460056218958]
cid: 186, volume: 208.94502443128675, center: [11.071163332720586 27.061520673090826 10.188106910503494]
cid: 187, volume: 366.05648131063, center: [14.702333130605457 35.72831369727388 34.30971720038503]
cid: 188, volume: 549.4559504783952, center: [11.798154095816786 38.23115614483659 30.012497691867257]
cid: 189, volume: 138.99047186482548, center: [13.229159170563888 1.8976098339520147 1.6516612566772295]
cid: 190, volume: 347.3943835491509, center: [16.752127339924726 3.287790808012751 32.319463549373324]
cid: 191, volume: 288.9793749120735, center: [13.091296392969143 37.99789521390002 63.106199043372236]
cid: 192, volume: 257.2298990845539, center: [11.913568672204157 53.84508833012084 60.26549936118586]
cid: 193, volume: 131.64140572004882, center: [13.07037317912145 1.1647532415639041 26.338812311251314]
cid: 194, volume: 78.7507807089251, center: [12.834686370694007 7.606975153723235 65.79606268136786]
cid: 195, volume: 255.99666538217696, center: [12.374121073132901 41.01536882328074 26.117356669616086]
cid: 196, volume: 84.04865202219732, center: [14.418922843294375 1.7353908408444378 66.34681762150024]
cid: 197, volume: 330.305287959071, center: [13.431254601941028 15.356167996266384 52.928255358427315]
cid: 198, volume: 356.4297080216674, center: [13.61699569523744 22.20837556192628 69.74476689542438]
cid: 199, volume: 174.59065700793016, center: [13.998470753438239 13.294079748306185 10.086041978232666]
cid: 200, volume: 309.5542433139739, center: [14.157742655927922 31.416384558884506 55.80092383544047]
cid: 201, volume: 301.53822424852405, center: [11.889148287017605 32.408213165178196 59.979456993573166]
cid: 202, volume: 163.0133610264327, center: [15.217738151560997 1.0998453396634245 13.285081549328392]
cid: 203, volume: 145.93684945372394, center: [17.072243188025794 1.2838447081141675 43.660522431145985]
cid: 204, volume: 5.083943017961928, center: [13.374110601410642 0.4648903069306931 68.96164170792079]
cid: 205, volume: 158.16851433852344, center: [10.884611761560548 7.3701939190070815 10.223383020606253]
cid: 206, volume: 70.31948907022587, center: [16.193527248421955 10.699312344667145 25.28687531317108]
cid: 207, volume: 170.57635546651963, center: [14.78939772555464 16.676125705643674 38.35413414769458]
cid: 208, volume: 313.90831332440666, center: [13.987368108900897 21.857658304429748 63.050422116255774]
cid: 209, volume: 345.5193649608432, center: [14.62536739022763 28.09628662934771 69.40185135593838]
cid: 210, volume: 251.55450725014586, center: [13.192278995612693 32.03569706713357 65.36409706623311]
cid: 211, volume: 458.17148846776195, center: [12.353161414609943 40.87382855953199 50.28727588162268]
cid: 212, volume: 198.86522651696123, center: [13.6025086681739 23.286084908814782 23.102793704233378]
cid: 213, volume: 504.3800002547822, center: [13.956136453183488 33.5783304965944 50.9289790981263]
cid: 214, volume: 243.41264801098407, center: [13.791204065502907 51.25015053135502 28.621214363128782]
cid: 215, volume: 66.29260351144414, center: [14.7889573233876 4.55172900493546 54.18626503910403]
cid: 216, volume: 243.6894963931503, center: [16.340794562043115 10.222534388949136 37.72867131897754]
cid: 217, volume: 297.8636911761357, center: [12.862775190345621 15.320543000422475 14.909188523869878]
cid: 218, volume: 562.8830970134579, center: [15.109030735836468 25.286257366599596 50.86432076861167]
cid: 219, volume: 137.6691500408502, center: [17.60694804744848 1.6508621104204755 57.69510937367459]
cid: 220, volume: 257.9220200399695, center: [14.877563997353779 47.100629323965656 34.336580263563626]
cid: 221, volume: 171.67116497781342, center: [15.14729969499314 16.269704020378246 29.00612237575136]
cid: 222, volume: 222.00723446258496, center: [15.563101558733997 26.137411738805127 58.762016763178785]
cid: 223, volume: 201.48270213016937, center: [14.70292335929737 49.27217010542753 42.54878980188621]
cid: 224, volume: 259.05458160337685, center: [15.991656831568676 17.5551618329933 43.36948474225202]
cid: 225, volume: 380.8427017217816, center: [16.05453433783539 43.68266721735396 42.087157106463124]
cid: 226, volume: 187.69061909134194, center: [13.93660022900834 3.067985815219578 18.194538365940332]
cid: 227, volume: 291.8862829248191, center: [15.399507665860785 17.604920456995043 34.567043158353094]
cid: 228, volume: 207.68662269416745, center: [14.394779645974294 26.664889173412508 74.79870899818226]
cid: 229, volume: 346.68967857636414, center: [17.971506912104942 6.454327939310345 43.06290224036298]
cid: 230, volume: 241.65088557901706, center: [14.752148251307355 22.734555720876948 55.82341719668802]
cid: 231, volume: 309.2899789491789, center: [15.786530261232683 52.90142666140451 35.416466531369515]
cid: 232, volume: 142.24973236396443, center: [14.366495289733935 9.808457202760085 15.292440184005663]
cid: 233, volume: 343.1787377298013, center: [16.402531653062873 33.41570957808661 28.590995718015474]
cid: 234, volume: 224.83863837110337, center: [15.237334637900945 52.55607237600045 22.959767650864723]
cid: 235, volume: 255.54364075681403, center: [16.058631075097964 5.752055872851726 13.459216175801448]
cid: 236, volume: 284.2729524152474, center: [16.284909058846164 15.46090560779106 21.251275016555997]
cid: 237, volume: 287.4315407754168, center: [15.8216092536897 27.02543753758592 25.79165506361368]
cid: 238, volume: 286.3870673336078, center: [15.996852437755638 12.819585609192373 59.070204203532825]
cid: 239, volume: 252.3976364140158, center: [16.63986198189413 26.388094413920328 14.478054938724634]
cid: 240, volume: 398.9259346841858, center: [16.868061332341302 34.071665721333716 69.2318983861708]
cid: 241, volume: 411.5225360727499, center: [17.34509012513579 41.464830070148615 66.20858330603633]
cid: 242, volume: 280.47257916914714, center: [16.196687503707278 51.05712077692032 56.451188644023695]
cid: 243, volume: 326.98310737307605, center: [17.512941089055044 59.4049153492149 45.99671030403325]
cid: 244, volume: 205.44666760209512, center: [16.7286617837722 5.017712617665074 61.24525203246356]
cid: 245, volume: 203.67232115275692, center: [15.564331944318141 13.18682444905777 68.14434981007105]
cid: 246, volume: 378.31331423017184, center: [16.567288347699012 47.86705570794665 23.731951238731998]
cid: 247, volume: 19.75690727277284, center: [16.373271973811512 0.4144999171974522 34.660588012738856]
cid: 248, volume: 131.27646921628423, center: [17.19492914555848 6.2893965699769945 1.170517998082822]
cid: 249, volume: 303.5264989931725, center: [16.754800961635297 20.53977657703151 10.1857517066335]
cid: 250, volume: 223.40406039078738, center: [16.99967912081747 22.51954343220864 19.932209573367885]
cid: 251, volume: 271.38691862714586, center: [16.550140630315163 24.177736052953726 29.48107229444496]
cid: 252, volume: 245.24991454717824, center: [17.726258700403324 3.538871823182308 8.577928991533685]
cid: 253, volume: 148.21455659790985, center: [17.413987014438064 28.771086726269317 28.62579142842588]
cid: 254, volume: 392.28157351219596, center: [18.49790218909621 31.475578309562767 44.79318839085106]
cid: 255, volume: 254.54950338448978, center: [17.383278745662423 10.443086246984379 63.38731514089381]
cid: 256, volume: 400.48635283821375, center: [18.69969032049718 34.28426152131972 38.170504649929306]
cid: 257, volume: 407.69699479190723, center: [19.48225390466717 39.41435772399531 59.0004904512007]
cid: 258, volume: 352.7551749492791, center: [17.787848357096316 45.19073425927511 53.820326087471464]
cid: 259, volume: 218.25719728596948, center: [17.84706451982505 43.443675303159594 27.661567117619928]
cid: 260, volume: 118.42818748029629, center: [17.025484897043093 7.792798163425779 4.672272696844119]
cid: 261, volume: 39.249550180750624, center: [20.016567201852837 9.114746014748317 33.09470029111895]
cid: 262, volume: 358.8584233743076, center: [18.785203077650603 18.739909282954027 65.16603066241188]
cid: 263, volume: 125.19838882599807, center: [17.443598515741236 34.93461210011056 15.36817480349784]
cid: 264, volume: 280.9130197771389, center: [19.32661250012488 15.504865888097479 48.47638877928594]
cid: 265, volume: 252.5234765877277, center: [17.409244107152414 34.868029084168036 19.14517170399163]
cid: 266, volume: 352.2014781849466, center: [18.67690077727223 37.2321168900243 55.73504994218951]
cid: 267, volume: 295.62373608406335, center: [17.38051682271783 58.93306412233952 39.26264758062319]
cid: 268, volume: 64.49308902736357, center: [19.339212555357612 2.993248601365854 46.04488803785366]
cid: 269, volume: 205.2830753762696, center: [19.72883550787926 21.481492420400908 44.506914853429784]
cid: 270, volume: 452.54643270283873, center: [19.547669042524056 37.51147217835493 44.77351846615873]
cid: 271, volume: 384.32847453360205, center: [18.8786949321428 54.14818414550932 50.6846508546544]
cid: 272, volume: 469.7362004318882, center: [20.012404801247268 25.017323377036004 47.89718148853408]
cid: 273, volume: 177.20813262113828, center: [16.917036539308377 34.781022061212894 73.53809345973583]
cid: 274, volume: 216.8226193056535, center: [19.858548405475712 1.971597927336042 24.690939249564714]
cid: 275, volume: 317.70868657050687, center: [17.924778442563547 13.947182518081357 72.94327711086466]
cid: 276, volume: 465.45763452568264, center: [18.69262394718836 26.25864924445766 40.04507433886666]
cid: 277, volume: 20.222515915506975, center: [20.67579243237699 0.5106990329807094 47.3073973739888]
cid: 278, volume: 131.10029297308753, center: [16.96212035647334 7.64475225359954 68.06219909809944]
cid: 279, volume: 233.48385830511288, center: [20.50606695039947 16.424979511480004 25.50646976026733]
cid: 280, volume: 208.0012231284473, center: [19.350883484323035 44.95928722439349 45.403632420594114]
cid: 281, volume: 55.91078918021001, center: [20.234004686017585 1.9524172419536352 1.1168778014854828]
cid: 282, volume: 352.4028224628857, center: [21.014750413506455 2.68010938923011 37.51113515419226]
cid: 283, volume: 451.3383670352042, center: [20.0011488170459 7.804946642000781 19.57255790748899]
cid: 284, volume: 413.4478907305424, center: [20.297508513774012 10.099060987551363 50.54528493367829]
cid: 285, volume: 366.61017807496245, center: [21.341079089226877 52.05384925472832 43.500868603370755]
cid: 286, volume: 202.17482308558496, center: [18.15315027825538 18.956998446159595 15.713479248972988]
cid: 287, volume: 299.22276505222453, center: [20.676796270138404 29.640142010598034 33.04532032147363]
cid: 288, volume: 288.62702242568014, center: [18.83665340721309 30.094577701168472 10.563988828304849]
cid: 289, volume: 91.8381587749657, center: [19.405819224157845 12.78515094464237 17.771721976705948]
cid: 290, volume: 252.29696427504626, center: [20.335312310308044 22.359479565564367 25.321182188837348]
cid: 291, volume: 267.49845725944726, center: [20.051500224141577 45.38386933922943 58.973847931128574]
cid: 292, volume: 246.97392492703167, center: [20.224343965657532 9.428410780087638 10.323864864465504]
cid: 293, volume: 222.91328371331085, center: [20.74779680682 19.008513354634754 30.396497657897708]
cid: 294, volume: 309.79333964402656, center: [19.823295001355437 18.860935041189375 54.14110688951174]
cid: 295, volume: 380.0750766621389, center: [20.604826767755508 35.39074264013509 23.994172621130353]
cid: 296, volume: 322.22634880676515, center: [19.309468866299905 44.035503859642276 20.044576673514023]
cid: 297, volume: 269.2098836219295, center: [20.475353377170627 47.821185470574484 61.811371945963636]
cid: 298, volume: 208.03897518056087, center: [21.196284871208544 3.0183254085410116 50.435388584684254]
cid: 299, volume: 142.40074057241875, center: [20.232366010436614 12.52840417727112 29.032644742311774]
cid: 300, volume: 252.46055650087177, center: [19.14071420717191 20.22672189283222 74.45203428591367]
cid: 301, volume: 261.3700407996763, center: [20.280215194285145 7.6357296791526235 58.422189982378434]
cid: 302, volume: 380.3770930790475, center: [20.921763064074515 29.52071559982797 20.249687797995172]
cid: 303, volume: 381.88717516359065, center: [21.60591379099328 44.52460407216529 34.37582472007118]
cid: 304, volume: 289.06746303367186, center: [20.796684788672316 57.46922689208132 54.363025880893304]
cid: 305, volume: 85.39514188091495, center: [20.52790893667059 0.8012784960212203 19.01072510167993]
cid: 306, volume: 181.18468211043523, center: [21.720515592499442 17.69564247687179 69.35078966981526]
cid: 307, volume: 232.60297708912938, center: [21.96029670332635 39.87725193388877 37.07605371640338]
cid: 308, volume: 366.2074895190843, center: [21.56411797702502 49.42604537596647 32.31714196247552]
cid: 309, volume: 139.40574443807483, center: [21.432868803861652 1.7889162588914966 62.178001603358005]
cid: 310, volume: 255.216456305163, center: [21.405502572504194 47.85792155041665 66.58717759932942]
cid: 311, volume: 335.5528232028584, center: [22.48905661479389 12.219833257678605 34.445969478117384]
cid: 312, volume: 171.1678042829657, center: [22.010865113120207 35.979822176885754 64.32012992780473]
cid: 313, volume: 195.31653361828484, center: [21.990439226132082 13.164580880613364 64.78662256800465]
cid: 314, volume: 314.2354977760577, center: [22.243123952996072 23.23534177549958 34.15135910704417]
cid: 315, volume: 260.9170161743134, center: [21.290318258780665 25.160262846725185 70.3906354409183]
cid: 316, volume: 241.4369572837068, center: [22.312213642698595 55.024384357552385 37.30166689346399]
cid: 317, volume: 210.2915142900044, center: [21.9963629894819 2.3167784648435163 4.7620594963796306]
cid: 318, volume: 85.39514188091495, center: [22.666926736137587 12.074878139994105 22.021268148541115]
cid: 319, volume: 313.5182087858997, center: [22.027464708439016 24.12217338115116 62.03009633113913]
cid: 320, volume: 86.3641112184968, center: [21.7369790048279 11.538714874836078 68.99885169896547]
cid: 321, volume: 184.89696723493714, center: [22.003285812521167 11.566885398352957 14.475982681412919]
cid: 322, volume: 123.12202595975124, center: [22.153413402313348 14.969047842600164 38.51637037755519]
cid: 323, volume: 138.32351894415226, center: [21.639080752433664 22.223409361899563 14.83549776073508]
cid: 324, volume: 231.54591962994917, center: [22.22720317193616 38.2056129752174 16.19774687826087]
cid: 325, volume: 462.8024068603609, center: [23.84011579240034 41.48098835402561 48.79430127150121]
cid: 326, volume: 134.03236902057546, center: [21.143803326419278 4.338577572058962 55.05242603924515]
cid: 327, volume: 308.3084255942258, center: [23.500205195232763 31.578319085714288 61.092769459755104]
cid: 328, volume: 154.63240545721823, center: [22.85975057721238 39.645603077799485 71.45716343001303]
cid: 329, volume: 16.1075422351269, center: [22.667494486430922 0.416657209375 39.953123740625]
cid: 330, volume: 95.51269184735403, center: [22.68063929068274 16.32506966455863 35.342120100395256]
cid: 331, volume: 245.24991454717824, center: [23.029171569858097 31.512309536559087 14.78666312884191]
cid: 332, volume: 127.28733570961609, center: [20.891538652105858 15.517479858428079 13.049885602372715]
cid: 333, volume: 305.5525257899346, center: [23.96895039043802 18.579701976195377 59.278868536057004]
cid: 334, volume: 328.7071177529295, center: [24.195128069729456 19.17300458795605 42.1800352364764]
cid: 335, volume: 165.1274759447931, center: [22.177790325037787 52.22343272793782 56.1245426959305]
cid: 336, volume: 158.68445905074233, center: [23.43304762886423 2.96726525297383 10.718065203489296]
cid: 337, volume: 184.41877457483182, center: [23.637158940784627 6.594697434186285 23.891366436028658]
cid: 338, volume: 300.3049905461471, center: [24.46136118889701 28.337531231226954 65.71290236967818]
cid: 339, volume: 197.8836731620082, center: [22.382263463379747 29.973817904737682 74.10009775287759]
cid: 340, volume: 190.52202299986035, center: [22.842040418652918 52.59408737014532 61.94734487186262]
cid: 341, volume: 231.57108766469156, center: [22.841773314954356 56.15610928670797 43.50178623997392]
cid: 342, volume: 251.8439396496833, center: [24.23256917821134 58.22212184949783 32.33024867526108]
cid: 343, volume: 193.66802734265858, center: [23.846335885645114 26.420090115269655 15.382166945289148]
cid: 344, volume: 211.36115576655578, center: [23.531323402264746 41.069368452131464 21.98688764658252]
cid: 345, volume: 72.63494826652536, center: [24.06099634440037 0.936824332986833 30.77941952702703]
cid: 346, volume: 225.07773470115603, center: [22.976294946745128 4.108145861791345 15.964446568712962]
cid: 347, volume: 225.56851137863256, center: [24.315883306467395 24.312711177684797 55.35610968892608]
cid: 348, volume: 203.7352412396129, center: [23.360398655268867 46.02893062433601 15.003919858925263]
cid: 349, volume: 228.8529399125139, center: [24.94136753827218 50.43138527559662 48.54955661266909]
cid: 350, volume: 556.1506477198698, center: [24.24961997726304 10.903825400339406 43.225069037357166]
cid: 351, volume: 284.5246327626712, center: [23.682019871110942 13.366044317735515 55.821452630959755]
cid: 352, volume: 370.1714549910101, center: [24.701645381517608 30.416749082880067 57.04655946212945]
cid: 353, volume: 361.6143231785989, center: [24.143406745211 53.08367170079343 29.942564839017262]
cid: 354, volume: 17.80638458023794, center: [23.907847056481824 0.4928379886925795 13.686691440282685]
cid: 355, volume: 167.8078716448572, center: [25.802325909969035 1.0126306630671167 76.21084421117361]
cid: 356, volume: 30.113553569264585, center: [22.389834246431505 10.394109551190974 25.050529861262017]
cid: 357, volume: 282.8383744349314, center: [24.605740304533 48.6799215527674 39.944282042890194]
cid: 358, volume: 106.42303490817827, center: [24.093302642399042 1.144089793070829 55.664351652122505]
cid: 359, volume: 166.12161331711735, center: [23.369367738290855 5.729481269449284 63.41176729278086]
cid: 360, volume: 126.5448786847157, center: [24.9680855021026 14.796449109188545 42.93036645584726]
cid: 361, volume: 301.38721604006975, center: [24.931115011328227 16.027771702379958 18.412444508726516]
cid: 362, volume: 175.43378617180008, center: [24.48611001509745 22.47311836539703 18.924684161968294]
cid: 363, volume: 192.14536124074425, center: [24.687374898300174 24.72649352452682 74.34954441626826]
cid: 364, volume: 317.0039815977201, center: [25.137430109267722 28.994253829304117 40.0260049056409]
cid: 365, volume: 218.49629361602214, center: [24.75295124135305 35.40431984875886 29.346199777803378]
cid: 366, volume: 456.96342280012743, center: [26.718410571151466 35.46214357855313 52.36916098411038]
cid: 367, volume: 284.05902411993713, center: [26.09071643447173 37.67835201160679 67.25928569662872]
cid: 368, volume: 131.37714135525377, center: [23.22659984785633 6.834219196934866 4.555281949616858]
cid: 369, volume: 438.0873967433381, center: [26.195678185054366 29.317583277913425 50.399272629592396]
cid: 370, volume: 255.15353621830704, center: [25.46731253954213 40.33658405000986 29.547690218780826]
cid: 371, volume: 236.4788544394568, center: [24.754990565417387 46.91466961792253 26.343388487654323]
cid: 372, volume: 245.22474651243584, center: [24.781428350173346 50.64214040632216 19.1012335269667]
cid: 373, volume: 195.44237379199677, center: [26.17847729715903 8.12619298203593 53.82847040911725]
cid: 374, volume: 178.9195589836205, center: [25.986981821058567 17.021574585033058 63.226713493881]
cid: 375, volume: 240.20372358132988, center: [26.621705411954984 47.77152125261945 44.52086082041073]
cid: 376, volume: 56.03662935392194, center: [25.85040206841545 10.454694325623176 23.85176005479452]
cid: 377, volume: 153.6256840675228, center: [24.415237607482467 22.37855890334207 22.528549502948888]
cid: 378, volume: 352.0127179243787, center: [26.501448969216217 44.067165481428525 53.23027596489472]
cid: 379, volume: 187.32568258757738, center: [25.10584684021179 4.508435379416902 27.885258845089346]
cid: 380, volume: 150.70619203740605, center: [25.33893924181517 41.69340635688043 61.25881751753507]
cid: 381, volume: 196.826615702828, center: [25.86308369625806 1.4832925958698293 69.47466908982803]
cid: 382, volume: 87.33308055607866, center: [26.0650102029152 3.611626162536023 42.44216918386167]
cid: 383, volume: 77.94540359716876, center: [25.740107079959735 1.3742642534711011 62.95435123280595]
cid: 384, volume: 180.14020866862623, center: [25.550182982259937 8.936665748096402 28.582753488368844]
cid: 385, volume: 195.41720575725438, center: [25.877855962601693 15.909209595595339 48.83989956429905]
cid: 386, volume: 167.40518308897902, center: [24.7697564652258 25.618372419454257 10.634968714726002]
cid: 387, volume: 380.26383692270673, center: [26.527480252613014 31.375476998543913 24.833267637567015]
cid: 388, volume: 155.9033912117087, center: [25.557044548088413 35.99636188053919 11.569244853821939]
cid: 389, volume: 79.27930943851521, center: [25.35681786300894 5.252704900634921 51.665676084761905]
cid: 390, volume: 138.3990230483794, center: [25.52488968200335 53.98138388688853 23.470401377705038]
cid: 391, volume: 308.4468497853089, center: [27.398668693746146 20.872771904614254 49.36431204838644]
cid: 392, volume: 190.8114553993978, center: [26.528542065205997 21.13152559730924 68.82156316203917]
cid: 393, volume: 291.0809058130627, center: [27.877385724930672 28.762688990618653 68.96689440223078]
cid: 394, volume: 178.56720649722712, center: [26.24766471437035 33.85794838421424 72.76265895658915]
cid: 395, volume: 218.01810095591682, center: [26.93806383131567 41.36591076051948 13.12094019867244]
cid: 396, volume: 386.0524849134555, center: [28.170347066545684 44.26244829532564 18.33785435634657]
cid: 397, volume: 193.40376297786352, center: [25.908672422017002 43.79331068436463 69.29554216474723]
cid: 398, volume: 187.01108215329754, center: [27.069113261357327 49.23323201803378 23.286077575937018]
cid: 399, volume: 40.87288842163451, center: [26.126644493810197 1.0516473688423644 0.987807960591133]
cid: 400, volume: 96.1041406638001, center: [26.427610243343928 4.922640311116932 1.1733075521801755]
cid: 401, volume: 170.07299477167192, center: [27.192370770931376 49.457867159896416 51.748841757750654]
cid: 402, volume: 343.9966988589288, center: [28.511091238554595 43.34890387313433 64.05782492756805]
cid: 403, volume: 42.873747183654174, center: [27.805687173257976 7.839348751981216 33.89908179806281]
cid: 404, volume: 207.28393413828928, center: [27.417532526056196 20.055653614011657 25.920757256435166]
cid: 405, volume: 302.1548410997125, center: [28.03115596864143 21.668570334679938 37.57535412585898]
cid: 406, volume: 286.3241472467518, center: [27.698779718021417 43.1832019994726 27.53116574447326]
cid: 407, volume: 75.65511243561166, center: [26.27689048991554 0.8174501660013307 24.33872624417831]
cid: 408, volume: 136.4359163384733, center: [27.4097163987231 1.19148630750784 49.38515047113079]
cid: 409, volume: 224.66246212790668, center: [27.42927444056822 13.780433035344199 24.43950194925223]
cid: 410, volume: 247.43953356976579, center: [28.22637810073297 26.907908113410976 28.05139872084626]
cid: 411, volume: 206.75540540869918, center: [27.858470375273725 35.59708814351796 19.83016492818016]
cid: 412, volume: 175.43378617180008, center: [27.425963260314482 5.90314532644717 38.62910037959974]
cid: 413, volume: 184.33068645323345, center: [28.61948386137014 8.866752736073185 49.1049369430639]
cid: 414, volume: 36.30489011589149, center: [25.328053681262993 8.768451963258233 67.59343074176776]
cid: 415, volume: 343.39266602511157, center: [28.23011998374562 35.59916536961302 39.897484856713575]
cid: 416, volume: 331.29942533139524, center: [28.230062670588286 39.22924472678239 34.92355306970031]
cid: 417, volume: 303.14897847203673, center: [26.765463395719333 5.450310945205479 46.159419218430884]
cid: 418, volume: 301.0851996231611, center: [27.50410383680492 11.010919970993898 60.28201455295494]
cid: 419, volume: 367.57914741254433, center: [28.670847212882453 31.866063146935982 33.16394044662787]
cid: 420, volume: 333.174443919703, center: [29.63789181358362 32.64457951737423 44.9539202585738]
cid: 421, volume: 495.9738766508254, center: [29.266903727713867 42.77282461685231 41.27080429299977]
cid: 422, volume: 321.87399632037176, center: [27.50343375638707 4.873046074908124 32.90437894839315]
cid: 423, volume: 57.64738357743463, center: [26.989989594822983 11.198642929491378 36.845780412573674]
cid: 424, volume: 308.8495383411871, center: [30.084191148436204 17.680954491300984 55.019638605142]
cid: 425, volume: 355.5739948404263, center: [29.357055064048545 25.63711314028879 43.869528421998865]
cid: 426, volume: 252.90099710886352, center: [28.917465591067312 26.490885577747925 34.00455241508683]
cid: 427, volume: 96.54458127179186, center: [27.38133269279064 8.150927336548488 64.53993702346195]
cid: 428, volume: 118.44077149766748, center: [29.095279757576186 21.397072946876328 30.09971756651084]
cid: 429, volume: 300.65734303254055, center: [29.598681710525884 23.72357809291813 59.40628209810816]
cid: 430, volume: 215.16152901265605, center: [28.925673027448727 37.19754865808867 60.042499008772964]
cid: 431, volume: 69.13659143733373, center: [29.15822005456995 3.375806537313433 54.466356440844564]
cid: 432, volume: 226.2102962645634, center: [28.517228438031722 56.49579204784157 54.97645246206053]
cid: 433, volume: 250.59812192993522, center: [28.96558738956487 59.21203788882193 46.59987940875766]
cid: 434, volume: 148.90667755332547, center: [30.018624464700174 1.2214230898335163 7.591563485506635]
cid: 435, volume: 264.2895328297931, center: [30.382762760223248 18.061927863727266 29.067071606608895]
cid: 436, volume: 184.7711270612252, center: [29.708878708629406 20.295928742355105 21.245984497990875]
cid: 437, volume: 157.76582578264527, center: [29.222640430812437 29.773641174762705 15.827407799154503]
cid: 438, volume: 55.583604728558996, center: [29.366527425229677 0.5583691378763868 18.569570360878426]
cid: 439, volume: 394.7354568995786, center: [30.74129547420454 45.736374029329255 34.44974692508289]
cid: 440, volume: 400.8764573767207, center: [30.40937531787067 53.614546489452536 51.17327612964591]
cid: 441, volume: 210.41735446371632, center: [29.335793300088962 58.93439765181509 36.324349440583696]
cid: 442, volume: 294.10106998214906, center: [29.53849373174765 49.8539623766206 56.75535662188182]
cid: 443, volume: 65.38655426071826, center: [29.058257214917838 1.081034262509623 34.111056401077754]
cid: 444, volume: 177.15779655165352, center: [29.456399022265014 5.625403937349056 58.08509385210968]
cid: 445, volume: 121.87620824000314, center: [28.400730034911845 19.5871561852349 72.88878086546205]
cid: 446, volume: 88.20137775469097, center: [26.700941777766197 0.9466032272792125 43.43179474218862]
cid: 447, volume: 147.52243564249426, center: [29.82203304724975 2.884325038641986 10.876438661264181]
cid: 448, volume: 252.47314051824296, center: [28.79595628875625 13.572283961122464 69.54905737706225]
cid: 449, volume: 276.9616383225843, center: [30.73083286556795 15.064954499795538 37.40625570575674]
cid: 450, volume: 261.9866576508648, center: [27.648699153074926 18.81528884009799 13.110827718814544]
cid: 451, volume: 246.50831628429754, center: [31.210384682825545 34.368563757414876 64.55011241941907]
cid: 452, volume: 241.09718881468459, center: [30.721473534129842 39.07518941249543 25.127153725977347]
cid: 453, volume: 215.7529778291021, center: [29.93081814063646 47.31898329063868 59.54815477013707]
cid: 454, volume: 258.62672501275625, center: [30.403009058541404 53.36246785782406 37.37258751848969]
cid: 455, volume: 249.18871198436162, center: [30.458534026324752 55.51898157297243 42.47861275770124]
cid: 456, volume: 182.50600393441047, center: [29.602496572102194 3.41469518623733 15.496351758808524]
cid: 457, volume: 327.18445165101514, center: [29.562060505195543 3.962387713461539 21.261399862538465]
cid: 458, volume: 171.2936444566776, center: [27.60495364992133 7.083909241845431 10.11486104672348]
cid: 459, volume: 379.55913194991996, center: [30.102530947062288 12.01650771434255 30.775060002784965]
cid: 460, volume: 163.93199429452977, center: [29.52666883562031 22.425550532279114 16.204887010670145]
cid: 461, volume: 193.1017465609549, center: [30.177129848627654 24.909189468491366 54.48530798005866]
cid: 462, volume: 220.59782451701136, center: [29.817858695752523 59.4438182508842 40.70064824677696]
cid: 463, volume: 151.6625773576167, center: [30.91357857178412 1.544903035180883 38.46117247178891]
cid: 464, volume: 240.83292444988953, center: [29.884930418651848 16.451349569233987 65.80381184251229]
cid: 465, volume: 198.91556258644601, center: [29.386013475962553 30.73918121212121 10.959401271588538]
cid: 466, volume: 67.13573267531407, center: [29.89245561570959 0.957093122774133 3.2714982579194003]
cid: 467, volume: 92.98330435574427, center: [29.85021956672725 1.5810617195831642 56.50786636107728]
cid: 468, volume: 171.24330838719285, center: [31.269694425998566 33.03281007921811 67.80588225440917]
cid: 469, volume: 155.79013505536798, center: [30.856939174820898 48.52732154894992 29.684195054927304]
cid: 470, volume: 331.4252655051071, center: [31.58837542542946 39.73956873053119 46.77261482302465]
cid: 471, volume: 224.68763016264904, center: [31.03023125801162 36.20239715620275 16.345010040436854]
cid: 472, volume: 319.59628917618585, center: [31.71090785458341 19.522611092254994 33.73343575808166]
cid: 473, volume: 207.87538295473536, center: [30.55672643798426 51.942152792784064 62.02521778013197]
cid: 474, volume: 73.66683769096318, center: [32.56509882387317 1.3135662070379228 44.40285577690468]
cid: 475, volume: 37.53812381826839, center: [32.44534419294826 3.977179371102917 48.42512547435468]
cid: 476, volume: 115.67228767600504, center: [31.837308383449116 1.556660679721497 65.39744136575283]
cid: 477, volume: 135.27818674032358, center: [32.24684587341725 42.352792515720935 52.59960112893023]
cid: 478, volume: 177.47239698593333, center: [31.954803876893415 9.663179001347231 36.31549074126073]
cid: 479, volume: 200.97934143532166, center: [32.10722522291326 28.49930289712604 23.88193290989919]
cid: 480, volume: 235.34629287604943, center: [33.41660601907418 46.39993241492889 47.9217178278259]
cid: 481, volume: 223.86966903352152, center: [31.706310562606227 2.4421402277684097 27.76179246430579]
cid: 482, volume: 196.09674269529881, center: [33.048100504484005 8.83552328075467 41.44635802682411]
cid: 483, volume: 131.38972537262495, center: [31.85651984723666 53.125176371995025 22.46207070069917]
cid: 484, volume: 287.65805308809826, center: [33.18324701026523 28.217559580646576 61.940760442889015]
cid: 485, volume: 131.60365366793525, center: [31.386444199443186 36.97672674698795 70.7797213048384]
cid: 486, volume: 216.55835494085844, center: [31.92363442817062 14.10699664117613 18.05544199139985]
cid: 487, volume: 191.07571976419285, center: [33.083934671935936 46.84637925842993 65.50783199631191]
cid: 488, volume: 255.0402800619663, center: [33.218436546656925 51.26096543227908 27.144452344599596]
cid: 489, volume: 212.82090178161417, center: [32.81903330232614 55.804047014782405 27.255241297776728]
cid: 490, volume: 209.86365769938382, center: [34.42825619197975 15.303322357378425 43.03984703747677]
cid: 491, volume: 205.24532332415603, center: [33.01451119636739 16.1030904619252 49.74707643813612]
cid: 492, volume: 199.56993148974806, center: [32.39090038695483 24.150218094331297 71.96478597086828]
cid: 493, volume: 267.9263138500678, center: [32.74660728813645 26.81510377971913 18.002471626227045]
cid: 494, volume: 266.6049920260926, center: [33.61240040184427 35.43536539299538 51.63647427999623]
cid: 495, volume: 201.4197820433134, center: [34.15535772482848 52.53813730813445 45.799393402349125]
cid: 496, volume: 226.24804831667697, center: [32.34105661891642 10.715903804660993 54.0148377246788]
cid: 497, volume: 204.01208962177913, center: [33.0491221517492 16.10271470120898 23.78901454700222]
cid: 498, volume: 240.79517239777596, center: [34.01435485801517 23.400341538855503 43.28228085058793]
cid: 499, volume: 166.97732649835845, center: [32.453199037274814 24.59733215962017 12.247342817092472]
cid: 500, volume: 243.67691237577912, center: [33.58151383154649 39.849364351063834 56.97195055690973]
cid: 501, volume: 263.4967397354079, center: [33.29461734542145 52.97395016457329 33.56673345642104]
cid: 502, volume: 61.74977324044351, center: [34.03738101155094 1.2006279714693298 74.27077341023029]
cid: 503, volume: 71.62822687682993, center: [32.96889570692728 2.1719342350667605 50.69120094940267]
cid: 504, volume: 189.5278856275361, center: [33.28425651796612 24.75336080021247 24.860124352167855]
cid: 505, volume: 330.4940482196389, center: [34.66058162574751 32.497694586680886 19.736161377755778]
cid: 506, volume: 129.61537892328676, center: [34.69198361390425 1.3284702333980585 70.46028982485437]
cid: 507, volume: 207.28393413828928, center: [33.68314482502736 11.690557063258865 65.5052809278776]
cid: 508, volume: 130.05581953127853, center: [34.41561752660092 25.068325589550074 30.31142319690373]
cid: 509, volume: 108.39872563545555, center: [33.98200692201832 57.327842615741815 31.21343260784769]
cid: 510, volume: 114.57747816471127, center: [32.08912358430248 7.804502299176277 15.344772915101593]
cid: 511, volume: 185.02280740864907, center: [34.905986224605066 12.757578549139632 56.54626820512821]
cid: 512, volume: 257.8590999531135, center: [35.06936469976862 31.973954575960178 46.945702823776294]
cid: 513, volume: 145.6600010715577, center: [33.157506760750465 40.22114703550756 68.76424694375811]
cid: 514, volume: 260.7030878790031, center: [34.086327755106126 45.173762700584064 22.695329845151324]
cid: 515, volume: 25.82240364568781, center: [34.07587327646764 0.5508891198830409 78.22717259844055]
cid: 516, volume: 109.00275846927282, center: [32.6800080477893 1.4255162909258834 60.808931835142005]
cid: 517, volume: 150.40417562049743, center: [34.32325916297484 10.925833501004016 49.14059216398929]
cid: 518, volume: 321.73557212928864, center: [34.40759400922114 22.166061915359645 63.903503490123995]
cid: 519, volume: 75.46635217504377, center: [32.69989129452229 23.75903099949975 67.67329381424045]
cid: 520, volume: 192.3970415881681, center: [32.91794276110897 30.534379256720516 71.98877550722742]
cid: 521, volume: 356.73172443857607, center: [35.606624953416194 33.14338455213772 38.43381693727952]
cid: 522, volume: 335.0620465253819, center: [35.09158368653784 24.68916557650417 49.69363273266732]
cid: 523, volume: 336.7986409226065, center: [35.6617738881051 27.769983986324917 37.8632314407413]
cid: 524, volume: 346.6645105416217, center: [34.92330908384454 29.95786614745172 54.82967393778133]
cid: 525, volume: 314.12224161971693, center: [35.022558886673266 34.81848273391555 27.553131566621264]
cid: 526, volume: 322.89330172743837, center: [35.36189944495762 38.0247683242527 40.1801941142679]
cid: 527, volume: 306.24464674535017, center: [35.40012461147465 47.0640177896121 39.78881922411243]
cid: 528, volume: 149.61138252611227, center: [34.386191134423555 5.936746684834722 51.97504013878375]
cid: 529, volume: 340.2592456996845, center: [34.87000605633397 40.69648738799512 19.526923570990053]
cid: 530, volume: 239.6500268169974, center: [35.11035563947988 44.78590602678009 58.92846987198068]
cid: 531, volume: 311.94520661450053, center: [34.67970706097598 16.26396032788737 61.264592221388526]
cid: 532, volume: 104.83744871940797, center: [35.13016910349465 1.235382304885368 33.99980933477374]
cid: 533, volume: 215.2118650821408, center: [31.98195036440689 8.782368218921762 20.704375275640274]
cid: 534, volume: 223.29080423444665, center: [34.6678249356324 18.813081223286744 70.04433941050496]
cid: 535, volume: 287.9600695050069, center: [35.709680032913916 34.71171029559061 58.37309353118035]
cid: 536, volume: 342.0084241142804, center: [36.34206890343384 37.507793290308335 32.14120136065936]
cid: 537, volume: 299.0843408611414, center: [34.20520211699938 39.483272666049565 13.34840418117558]
cid: 538, volume: 340.8381104987594, center: [36.56994506183762 19.473747718737307 44.24801654775706]
cid: 539, volume: 179.92628037331593, center: [35.430089806008155 20.325281818296265 19.446039112183524]
cid: 540, volume: 119.76209332164274, center: [34.49636510286698 1.564066061784176 12.63454765703478]
cid: 541, volume: 394.5970327084955, center: [37.397169416131426 19.24699584411774 37.95233878553433]
cid: 542, volume: 170.02265870218713, center: [34.92749680616448 57.74705634268374 48.29186965124713]
cid: 543, volume: 30.35264989931725, center: [34.47603940155 1.736692240464345 0.602055912106136]
cid: 544, volume: 237.51074386389462, center: [36.287262514019304 39.35414209642895 62.75994277725973]
cid: 545, volume: 234.02497105207416, center: [36.823505707168735 41.52405108608916 30.745535522611178]
cid: 546, volume: 238.69364149678674, center: [36.32156592128315 2.8227946125052723 18.40688660375369]
cid: 547, volume: 115.99947212765606, center: [36.52117534822071 1.8537570223475808 23.94896588804513]
cid: 548, volume: 148.5039889974473, center: [34.15686030849373 3.5778165453775106 3.082130778747564]
cid: 549, volume: 277.8299355211966, center: [36.852264587516764 48.60105388966392 53.900585179817014]
cid: 550, volume: 20.209931898135782, center: [35.87632077338221 0.5942569676214198 5.558171149439602]
cid: 551, volume: 260.1871431667842, center: [35.87395331066524 8.601676953956277 59.54826042329271]
cid: 552, volume: 239.77586699070932, center: [36.67488410395248 48.88356261866275 19.66648681116826]
cid: 553, volume: 197.27964032819094, center: [37.16649334077027 53.9732778063405 55.96366454640557]
cid: 554, volume: 187.91713140402342, center: [36.42982507942529 33.59428505846113 13.424106034554343]
cid: 555, volume: 205.77385205374614, center: [35.08858887165004 5.507538404109589 43.92444959087574]
cid: 556, volume: 160.94958217755706, center: [34.929334138788654 7.015361358248632 29.1635428511337]
cid: 557, volume: 350.56555592669156, center: [38.49895500328881 29.551470388326514 29.76574096037045]
cid: 558, volume: 187.13692232700947, center: [38.761437216794 36.34050334745478 22.08198045040683]
cid: 559, volume: 185.82818452040542, center: [37.436503487162675 46.65888276494887 26.096989758786485]
cid: 560, volume: 183.29879702879563, center: [36.93815584321117 6.448576524234519 12.889914246876288]
cid: 561, volume: 197.19155220659258, center: [36.86861687570835 14.56136064747926 30.030659463433313]
cid: 562, volume: 256.68878633759255, center: [38.04423510966725 19.56362894989705 49.99062534503383]
cid: 563, volume: 107.79469280163829, center: [36.687056802239624 1.2760601907541442 50.7454213329442]
cid: 564, volume: 26.250260236308367, center: [37.499738922885875 6.257408763183126 48.953448553211885]
cid: 565, volume: 316.3370286770469, center: [38.09625864818647 12.184808918052351 45.83663992863394]
cid: 566, volume: 125.43748515605073, center: [38.780406605652374 24.140841006219905 61.27231971187802]
cid: 567, volume: 322.76746155372643, center: [38.064946102553826 24.02457458099731 55.590808994346766]
cid: 568, volume: 168.77684098243904, center: [37.804994795037416 43.69177699388607 65.27888926453922]
cid: 569, volume: 245.06115428661033, center: [37.969504024143426 51.84961878371162 43.16769555889905]
cid: 570, volume: 236.6298626479111, center: [37.755727065257076 12.398199838544992 36.86958668932142]
cid: 571, volume: 249.23904805384637, center: [38.37597206240036 18.821640814803597 24.662145957285674]
cid: 572, volume: 191.95660098017635, center: [37.842939727004484 26.66346619771863 19.92917857506228]
cid: 573, volume: 256.2860977817144, center: [38.28969214150238 28.956349212314645 64.82909876932142]
cid: 574, volume: 138.48711116997777, center: [36.72802428422569 27.81467473802817 12.922448080872332]
cid: 575, volume: 255.95891333006338, center: [40.45479713562775 32.76974829380531 32.368818139331374]
cid: 576, volume: 344.36163536269345, center: [38.73800762833108 43.42088908510872 47.805892878055914]
cid: 577, volume: 293.6606293741573, center: [39.11269711719704 49.28857029353788 31.18834393914981]
cid: 578, volume: 113.49525267078867, center: [38.06202471411854 2.1589575403038035 28.39922163698858]
cid: 579, volume: 171.44465266513194, center: [37.91633809152179 28.559097066940694 69.86041820904286]
cid: 580, volume: 150.9830404195723, center: [38.64688224701857 33.021092265710955 63.21090508018004]
cid: 581, volume: 100.1813622920666, center: [37.857370387641836 1.2562576930033915 64.53291083280995]
cid: 582, volume: 140.9032425052468, center: [37.30155001016113 4.795001482718586 8.119041740108958]
cid: 583, volume: 250.59812192993522, center: [37.72221157226882 21.971462336145425 14.938508148036558]
cid: 584, volume: 185.55133613823915, center: [38.577948845447686 24.331739414716854 34.9769442442862]
cid: 585, volume: 323.98811123873213, center: [39.642520303159074 52.324180636681426 37.704157799425154]
cid: 586, volume: 307.1129439439625, center: [39.40170685136109 31.981887758983817 43.736990378692894]
cid: 587, volume: 283.97093599833875, center: [39.71872546877728 38.94380152166977 50.76525834742533]
cid: 588, volume: 179.07056719207483, center: [38.21185104337724 55.82107913380183 51.905072652565]
cid: 589, volume: 27.357653764973342, center: [38.451585526879946 0.7101878932842687 9.38768795400184]
cid: 590, volume: 155.23643829103548, center: [37.26901869048424 3.4207423193904023 40.207373245784694]
cid: 591, volume: 177.24588467325185, center: [38.37861735212063 4.697668814767484 33.156720377138804]
cid: 592, volume: 108.70074205236419, center: [38.5012402954369 34.742742544107436 68.64690982009725]
cid: 593, volume: 247.8170540909016, center: [39.16278265330697 49.671186655766014 60.688637281064345]
cid: 594, volume: 172.35070191585783, center: [39.10321963302101 51.34114121875 48.88271899050818]
cid: 595, volume: 89.64853975237816, center: [38.31181151178959 12.31691449241999 63.72231952919709]
cid: 596, volume: 228.27407511343904, center: [40.25699091656279 13.778757752480706 51.29579604233738]
cid: 597, volume: 156.00406335067825, center: [39.38680088238303 14.79066599532145 57.206745404856015]
cid: 598, volume: 266.957344512486, center: [40.74407700194675 41.89852790374281 36.01293592278684]
cid: 599, volume: 21.707429965307735, center: [39.74964412076129 0.46771433275362323 73.84237865507247]
cid: 600, volume: 233.43352223562812, center: [39.468260905020855 24.090280610026955 29.551322100269545]
cid: 601, volume: 259.72153452405007, center: [37.58930764155323 12.514091711323223 23.61486085633994]
cid: 602, volume: 260.79117600060147, center: [40.470289694379424 19.655970387087436 59.82316788120055]
cid: 603, volume: 222.72452345274297, center: [40.195677258695746 22.99544335103678 68.15570873247077]
cid: 604, volume: 157.23729705305516, center: [40.82614480958745 35.31151701240496 51.7515794002401]
cid: 605, volume: 269.8894205599739, center: [41.1554574815028 42.197295984613234 25.089533719028303]
cid: 606, volume: 58.503096758675746, center: [39.02662973498893 1.039898618627662 1.6808175861475587]
cid: 607, volume: 237.04513522116048, center: [40.437240514851304 16.994391914317568 65.84265306885385]
cid: 608, volume: 292.94334038399927, center: [40.21316607582752 57.05876028188496 37.386101157438034]
cid: 609, volume: 43.80496446912245, center: [40.347689614016915 1.123714438379776 31.82370107440391]
cid: 610, volume: 159.38916402352913, center: [41.031676238855404 29.53986322532765 54.33456652092216]
cid: 611, volume: 167.12833470681278, center: [39.24598140673177 17.064261323996686 18.78883772095475]
cid: 612, volume: 283.80734377251326, center: [42.168760006718685 42.41181841174124 40.668282423890396]
cid: 613, volume: 246.3698920932144, center: [41.01427588909322 44.08833095923996 56.54992275778936]
cid: 614, volume: 227.49386603642506, center: [40.85062542760376 56.85418926352473 44.766424748534135]
cid: 615, volume: 90.96986157635341, center: [40.12049014141091 1.560707766772721 13.86131320265597]
cid: 616, volume: 293.37119697461986, center: [37.58345939658552 7.197413813065672 36.78807170059624]
cid: 617, volume: 189.27620528011226, center: [39.361494366823464 10.104840123794961 30.4677276167808]
cid: 618, volume: 155.52587069057293, center: [41.71348423621346 24.07391076996521 49.99193211894166]
cid: 619, volume: 272.10420761730387, center: [42.75321394063597 31.33219837978079 49.03996263987421]
cid: 620, volume: 87.01848012179883, center: [41.98980750825661 1.4776670383224875 18.010553971366594]
cid: 621, volume: 147.4091794861535, center: [40.71608756889339 16.172815643332765 31.09132624790849]
cid: 622, volume: 148.29006070213703, center: [41.66662467275401 22.241291054650375 24.57086389952478]
cid: 623, volume: 85.6845742804524, center: [40.029987533963656 24.165103531796152 21.207383845498605]
cid: 624, volume: 191.26448002476073, center: [39.77556634468446 1.730010600565827 43.96152652187644]
cid: 625, volume: 155.28677436052027, center: [40.2338015001376 7.937286431442463 52.17116320032415]
cid: 626, volume: 130.01806747916493, center: [40.83370808580995 32.74574214711576 19.282089123886955]
cid: 627, volume: 140.9284105399892, center: [40.74631606893222 37.78339691740334 66.57943455701403]
cid: 628, volume: 152.59379464308498, center: [42.177932636092535 48.36179893897411 35.744564391555336]
cid: 629, volume: 259.2685098986871, center: [41.33138649086502 51.432651341843425 24.89678222404504]
cid: 630, volume: 219.9937916831941, center: [41.42673200769233 55.05336227983069 30.996575900469058]
cid: 631, volume: 36.11612985532359, center: [41.143530356485705 0.7426487972125436 35.02069635609757]
cid: 632, volume: 219.33942277989206, center: [41.068041085722186 6.893707386115893 18.96525026310958]
cid: 633, volume: 174.54032093844538, center: [42.047455185592824 13.559895788752703 42.91974573540015]
cid: 634, volume: 215.52646551642061, center: [41.40868300640783 38.621193794126235 60.13168096899632]
cid: 635, volume: 110.94069714443651, center: [42.098577708019256 1.8618537066696916 24.52130823162432]
cid: 636, volume: 62.756494630138945, center: [41.31194728643283 0.6728020148385803 59.95876014196912]
cid: 637, volume: 249.60398455761097, center: [43.0120934264949 23.152843403478702 39.84211656072599]
cid: 638, volume: 141.2681790090114, center: [41.15813509130311 32.783612496347764 14.569762982006058]
cid: 639, volume: 165.39174030958816, center: [41.56703865867111 38.54934107966218 23.703682618123718]
cid: 640, volume: 42.23196229772334, center: [41.83656418521957 0.6228992121573302 68.11110440703217]
cid: 641, volume: 291.7981948032207, center: [43.255103295088205 15.342280362601347 38.26645203234432]
cid: 642, volume: 111.24271356134516, center: [42.21392543127877 47.42658056719457 52.93978846877828]
cid: 643, volume: 261.2693686607068, center: [43.77732674467522 27.01038555158463 46.11724496175706]
cid: 644, volume: 155.0602620478388, center: [43.170745245835924 33.10865525401721 24.14379224947249]
cid: 645, volume: 89.92538813454439, center: [41.13700256645009 0.7726698404701932 53.31560228883291]
cid: 646, volume: 171.59566087358624, center: [42.14910768913441 1.8755284800528014 5.415132605162804]
cid: 647, volume: 250.6107059473064, center: [43.01769734657734 18.41989825819734 54.86492205895054]
cid: 648, volume: 239.05857800055134, center: [43.227981342585316 36.38919384260673 37.557546784229096]
cid: 649, volume: 179.71235207800567, center: [41.735935139112584 38.78759499404804 16.34113946866466]
cid: 650, volume: 87.91194535515353, center: [42.22185315973306 47.41004925107358 20.74863032636702]
cid: 651, volume: 26.99271726120875, center: [42.75325294824992 0.6716206610722611 10.757012702097903]
cid: 652, volume: 339.1896042231332, center: [42.93976560031285 28.233005703049642 23.552879477925355]
cid: 653, volume: 162.10731177570682, center: [43.3010991951382 46.84877542555504 31.84133205527092]
cid: 654, volume: 195.27878156617126, center: [43.363645739999086 49.17564106624565 47.61716403002965]
cid: 655, volume: 199.8216118371719, center: [43.91562080233644 26.910643109515714 41.59532817809686]
cid: 656, volume: 188.1436437167049, center: [43.25825481794255 27.409171502374424 60.222289250083605]
cid: 657, volume: 364.231798791807, center: [44.69533164001621 38.02635230873411 44.98695294409895]
cid: 658, volume: 186.44480137159385, center: [43.407850938376164 44.927310068169554 28.063820409962204]
cid: 659, volume: 133.70518456892447, center: [42.958352007351856 4.142788129505882 10.053807068423529]
cid: 660, volume: 189.5278856275361, center: [43.01020413265436 5.618322532766749 27.161088298386563]
cid: 661, volume: 259.74670255879244, center: [43.68259818333478 10.774894712174799 55.77648227682768]
cid: 662, volume: 285.682362360821, center: [44.37197073224864 21.223699488943705 29.55900331054533]
cid: 663, volume: 268.1276581280069, center: [44.04551908876898 33.477502191392496 58.87505720664571]
cid: 664, volume: 143.5207181184549, center: [42.848933291710836 2.1856823508987286 38.485892869267865]
cid: 665, volume: 92.70645597357802, center: [43.87545027073717 17.79807418433555 46.35057452124338]
cid: 666, volume: 129.67829901014272, center: [43.01175117903609 22.920169248908298 17.121797747307134]
cid: 667, volume: 225.36716710069348, center: [43.9570587803946 42.593108781059804 62.77813576737954]
cid: 668, volume: 102.35839729728296, center: [43.860891379520204 3.891161603393165 33.580355136218344]
cid: 669, volume: 271.3617505924035, center: [44.77738132794733 9.827189709886849 47.99923620552774]
cid: 670, volume: 165.6685886917544, center: [43.83712937131322 29.629024648537793 16.348182998404862]
cid: 671, volume: 125.19838882599807, center: [43.723680041609924 31.797980018695345 66.58457372439442]
cid: 672, volume: 244.9478981302696, center: [45.71212197817318 19.88648745461084 32.81844526997175]
cid: 673, volume: 281.2653722635323, center: [46.03091167221099 24.684179822200353 57.541013771374885]
cid: 674, volume: 165.26590013587622, center: [44.88689528667452 27.101152015990255 65.6761543811772]
cid: 675, volume: 309.50390724448914, center: [45.10902512098521 31.045035984712342 37.87080075844684]
cid: 676, volume: 194.1713880375063, center: [43.707421132932424 42.15906993441348 18.847782857420608]
cid: 677, volume: 49.01474766079631, center: [44.24689352266341 0.9469911620025675 29.190978398459563]
cid: 678, volume: 114.1747896088331, center: [44.085356055175346 5.418525858481208 14.911860568940815]
cid: 679, volume: 288.71511054727847, center: [44.41827927678396 49.074528073224954 42.0514978761278]
cid: 680, volume: 197.10346408499424, center: [44.86395142756514 48.937228756049294 57.78185407086765]
cid: 681, volume: 150.15249527307355, center: [45.36013091793384 16.281854199631244 51.36934911766678]
cid: 682, volume: 196.71335954648725, center: [45.4167914600488 26.98965456013306 34.77304539982088]
cid: 683, volume: 200.04812414985338, center: [46.58309795567216 45.199825082342585 49.24143286922061]
cid: 684, volume: 229.46955676370234, center: [44.93191354893694 14.77970798376748 60.39899359517412]
cid: 685, volume: 191.93143294543395, center: [46.28450862321991 42.90410299344348 51.95043307566221]
cid: 686, volume: 218.14394112962876, center: [45.73621519371372 37.67475365134122 27.462524548254976]
cid: 687, volume: 243.61399228892316, center: [45.92285995631739 39.39969998863578 55.68027566992097]
cid: 688, volume: 129.62796294065797, center: [47.16533534880975 33.31395271449374 25.74799612425978]
cid: 689, volume: 196.26033492112433, center: [47.23403622203785 33.0914313818928 43.84390859746089]
cid: 690, volume: 28.842567814774103, center: [45.579699394056675 0.4938205157068063 15.253190522687609]
cid: 691, volume: 69.86646444486293, center: [45.018177026467946 0.9782702748559079 21.0277451167147]
cid: 692, volume: 269.8516685078603, center: [45.18640710796783 16.97093177951875 23.7899480063421]
cid: 693, volume: 168.53774465238638, center: [45.23646018076924 52.67963303158367 51.658752549690135]
cid: 694, volume: 69.5518640105831, center: [44.41516208179653 0.7620710635064231 46.13008283336349]
cid: 695, volume: 130.92411672989084, center: [45.7335343187148 22.554146304113804 64.52697900519031]
cid: 696, volume: 17.466616111215732, center: [47.1025689802889 0.5195510893371759 24.022624796829973]
cid: 697, volume: 112.71504359377472, center: [46.15361893593275 34.38539126002009 64.25730609914035]
cid: 698, volume: 274.30641065726263, center: [46.71273375236076 10.259073610606478 44.04056945435361]
cid: 699, volume: 262.55293843256845, center: [45.84417598142488 13.294523315567485 30.42372152990798]
cid: 700, volume: 203.96175355229437, center: [47.9470531157612 18.413525294545906 37.79659544002961]
cid: 701, volume: 101.47751608129947, center: [46.79543632645604 24.4964657452877 26.614016461309525]
cid: 702, volume: 263.7861721349454, center: [47.374597664098665 32.859140805552904 55.7059892628566]
cid: 703, volume: 247.06201304863, center: [47.478394297067496 11.261556027912189 39.84422850201192]
cid: 704, volume: 251.3279949374644, center: [48.49057053035834 41.28008681914681 30.822776875826158]
cid: 705, volume: 175.9119788319054, center: [47.783548194640794 46.89597804578296 37.32923684440947]
cid: 706, volume: 200.11104423670935, center: [47.17207597155297 50.58034642824802 28.259314583700164]
cid: 707, volume: 194.24689214173344, center: [46.820025343825485 54.33163803174398 43.8547763793729]
cid: 708, volume: 116.17564837085276, center: [47.8178218958695 3.283131927642981 13.472231496317159]
cid: 709, volume: 111.06653731814845, center: [46.82303074060843 4.933424743938365 18.73600078721958]
cid: 710, volume: 193.54218716894664, center: [46.84843548882231 22.902598223407026 20.55328772158648]
cid: 711, volume: 140.03494530663448, center: [47.855747812871414 23.216603115025162 53.9672213887491]
cid: 712, volume: 186.21828905891238, center: [47.215232940193026 44.977521360183815 22.8222825925125]
cid: 713, volume: 291.78561078584954, center: [48.11540956013984 45.530145683443315 43.61328789632122]
cid: 714, volume: 156.25574369810212, center: [48.30369722631447 27.26435822968511 28.065526945477977]
cid: 715, volume: 165.73150877861036, center: [47.09629778106773 35.36757012088079 19.01412068959757]
cid: 716, volume: 253.47986190793839, center: [48.6883221167747 35.85286477188105 31.069242340664253]
cid: 717, volume: 185.77784845092063, center: [47.88462199863495 44.4406377713202 34.08324370168665]
cid: 718, volume: 148.83117344909832, center: [47.39899265718163 28.66458255398664 18.668981825145853]
cid: 719, volume: 3.0327481864574866, center: [48.34877814057658 0.32227443983402493 26.63061121161826]
cid: 720, volume: 233.2573459924314, center: [47.961765366945606 4.272072752050065 24.662841799525246]
cid: 721, volume: 226.58781678569918, center: [49.649277109062275 30.979614358880372 28.799187053870934]
cid: 722, volume: 86.67871165277663, center: [47.98081851522716 53.57883183478514 38.404220458768876]
cid: 723, volume: 167.88337574908434, center: [48.23802543128979 19.93091143377558 61.255778623191674]
cid: 724, volume: 238.65588944467316, center: [48.80444791818386 21.313097166780913 47.52402347735302]
cid: 725, volume: 213.18583828537876, center: [48.28574367332564 38.610882096688506 61.56483755398148]
cid: 726, volume: 197.06571203288067, center: [48.63451912897583 52.284884904725416 34.38762233882503]
cid: 727, volume: 129.30077848900694, center: [48.145805206297 1.4739709919221413 8.33916342540146]
cid: 728, volume: 177.86250152444032, center: [47.579255276668064 2.7584044189896706 32.58244597707655]
cid: 729, volume: 212.84606981635653, center: [48.40574886357277 16.3541527242521 45.46727218812818]
cid: 730, volume: 272.12937565204624, center: [49.59186820355672 21.02707418312139 42.57254544823122]
cid: 731, volume: 119.2839006615374, center: [48.71780802135158 49.70706831881001 52.54867041924254]
cid: 732, volume: 95.72662014266432, center: [48.82073985950468 1.0650978243722888 39.20488183515183]
cid: 733, volume: 330.19203180273024, center: [49.934285677829216 27.61348790251153 52.39829358367316]
cid: 734, volume: 214.63300028306594, center: [49.99411405081157 37.084160639423075 52.84987624507505]
cid: 735, volume: 130.609516295611, center: [49.49581358699836 43.85931138221409 57.86099214201754]
cid: 736, volume: 111.24271356134516, center: [49.00973482948731 12.517291586651584 52.59465885859729]
cid: 737, volume: 231.3068232998965, center: [49.3718194102016 12.991246862412273 36.346607009520696]
cid: 738, volume: 183.6763175499314, center: [49.85618433014475 20.785936209372434 51.87396098876405]
cid: 739, volume: 183.83990977575692, center: [50.13357201228699 17.967744288726127 27.426577544527348]
cid: 740, volume: 193.2779228041516, center: [49.920941528861576 38.38240146363696 22.169194286346766]
cid: 741, volume: 174.22572050416557, center: [50.88962873413955 36.07899594120621 39.02720125590466]
cid: 742, volume: 337.65435410384765, center: [51.31307488272869 38.02373745840787 35.26877172197377]
cid: 743, volume: 101.27617180336038, center: [50.31413802825521 21.94192801739563 35.42632128404573]
cid: 744, volume: 71.6911469636859, center: [50.45264675414875 31.292946846761453 53.28563783921362]
cid: 745, volume: 181.86421904847964, center: [51.379155880275874 39.669613699695546 48.56844886894548]
cid: 746, volume: 177.10746048216873, center: [52.030294333957464 41.738836562455596 45.48484827128038]
cid: 747, volume: 204.54061835136923, center: [51.64503937934537 42.07420278134613 39.7288763841516]
cid: 748, volume: 226.9150012373502, center: [52.1714850110778 26.850781927905945 33.0714536273292]
cid: 749, volume: 235.14494859811035, center: [50.285926944482696 27.86091574997324 61.65924905373007]
cid: 750, volume: 155.21127025629312, center: [50.99272699481228 30.392476561375066 21.892721035511595]
cid: 751, volume: 134.95100228867256, center: [50.87655852554735 23.734287295039167 23.602320896866843]
cid: 752, volume: 222.22116275789526, center: [51.315997658651966 43.96420533767484 26.357337117503825]
cid: 753, volume: 175.09401770277788, center: [52.92812246060146 30.810601771596954 48.784043427195634]
cid: 754, volume: 142.46366065927472, center: [52.13603121816958 1.5575498065541915 29.569060233724937]
cid: 755, volume: 206.2017086443667, center: [51.503581086053735 2.2303854701574517 15.916784963749544]
cid: 756, volume: 205.20757127204246, center: [52.14376406213476 25.869347075243763 43.731311858097754]
cid: 757, volume: 203.78557730909768, center: [51.994768482032164 16.692817744473263 54.49951824577004]
cid: 758, volume: 168.75167294769665, center: [52.611714485779956 34.09930238374348 59.50984030216257]
cid: 759, volume: 193.3156748562652, center: [51.90390956641466 34.54562723343315 49.97102916182789]
cid: 760, volume: 156.3186637849581, center: [51.48971050055304 45.40302508227339 54.46366388874578]
cid: 761, volume: 141.7589556864879, center: [52.187391611530806 2.4890283723035953 20.83947273058145]
cid: 762, volume: 183.99091798421125, center: [52.70945676527747 23.938472893098968 37.917379484576976]
cid: 763, volume: 161.37743876817763, center: [52.89263926838681 25.189931408452903 47.844937495789154]
cid: 764, volume: 211.90226851351707, center: [52.86900950034584 47.04774133226439 31.003604932121863]
cid: 765, volume: 55.65910883278615, center: [51.8917398147305 0.9699005801492201 34.148301344336424]
cid: 766, volume: 50.14730922420367, center: [52.5120164364147 0.9726752577164366 10.287182203764115]
cid: 767, volume: 240.10305144236034, center: [54.21809789238165 28.236582637002098 39.31942803071279]
cid: 768, volume: 225.6817675349733, center: [52.30821562159062 50.49880566198283 39.89213111486562]
cid: 769, volume: 215.27478516899677, center: [52.83233323487347 17.33613155819255 33.31657792295552]
cid: 770, volume: 149.27161405709006, center: [52.61700740293463 31.645293819423372 33.03010045000843]
cid: 771, volume: 172.52687815905452, center: [54.67996868648253 32.23333386345733 36.962724980160466]
cid: 772, volume: 172.2248617421459, center: [53.59717008760379 35.868827473038145 44.58680696916557]
cid: 773, volume: 237.03255120378927, center: [52.00469893323309 49.78720098821406 46.676466955086006]
cid: 774, volume: 128.70932967256087, center: [52.49502918559971 20.26135996441142 56.98855245932734]
cid: 775, volume: 158.11817826903865, center: [53.88738862907059 24.55386149287704 57.61432721337047]
cid: 776, volume: 317.3563340841135, center: [54.42516954643627 31.688338314921292 43.086276705182605]
cid: 777, volume: 121.5993598578369, center: [53.745529236242234 46.57036515761151 50.25247688792301]
cid: 778, volume: 86.21310301004249, center: [53.20381840430878 1.7162479877390162 25.055063201284486]
cid: 779, volume: 219.77986338788384, center: [53.82757199076797 15.709206550357859 47.866696327397655]
cid: 780, volume: 162.74909666163765, center: [54.0369624663187 39.39998105899637 56.61447245588804]
cid: 781, volume: 153.43692380695492, center: [55.18051025360198 38.98719843549578 40.744865028130896]
cid: 782, volume: 173.19383107972774, center: [53.63233668095582 21.730317017946668 28.29556199142629]
cid: 783, volume: 205.63542786266302, center: [54.09348782604118 36.52889819031883 25.700284156293986]
cid: 784, volume: 102.39614934939655, center: [53.93648060718334 29.950946960796365 58.206951873909304]
cid: 785, volume: 103.23927851326647, center: [54.165226566659136 29.171941320819116 24.342655649683085]
cid: 786, volume: 207.54819850308434, center: [55.13582244567561 17.09786752755715 40.497472975201596]
cid: 787, volume: 120.21511794700568, center: [55.95764149373615 40.421387620014656 29.22206209128023]
cid: 788, volume: 191.90626491069156, center: [55.25763282353054 46.33438157744263 34.88815808852459]
cid: 789, volume: 46.435024099701764, center: [56.536271559461824 0.9133038487804879 22.389179196205962]
cid: 790, volume: 192.44737765765288, center: [56.36305426781336 41.11073119505656 51.91217519008697]
cid: 791, volume: 225.90827984765477, center: [56.787988453315826 45.99492105659537 41.7654911235517]
cid: 792, volume: 24.538833873826135, center: [56.21333956300264 0.6300352615384616 13.819618277948718]
cid: 793, volume: 212.85865383372774, center: [56.16050875949728 26.11818443109666 28.508010815370973]
cid: 794, volume: 194.22172410699108, center: [57.03194252403852 19.923968134249062 48.05868846313334]
cid: 795, volume: 225.15323880538318, center: [57.15865884727669 33.84452512486027 28.57541040990387]
cid: 796, volume: 17.907056719207482, center: [57.04769641615438 0.5459710175685173 27.348665758257205]
cid: 797, volume: 190.82403941676898, center: [57.243926437739255 21.829827000131893 33.86529074070166]
cid: 798, volume: 159.2759078671884, center: [57.298790227971836 44.10380572347318 47.16615601090306]
cid: 799, volume: 36.72016268914086, center: [57.02087992379902 0.7197857409184373 17.619425765592872]
cid: 800, volume: 131.30163725102662, center: [57.27751700749559 31.138264911635037 54.75069047479394]
cid: 801, volume: 150.051823134104, center: [57.825447023862466 40.567654181650454 32.52000542619926]
cid: 802, volume: 195.2410295140577, center: [58.43215897857176 21.288954056590395 40.76194251988399]
cid: 803, volume: 170.1107468237855, center: [58.879696421032335 43.25471932919071 38.35015668057405]
cid: 804, volume: 260.5520796705488, center: [57.62759021668284 24.648933646462208 52.131188854479596]
cid: 805, volume: 103.32736663486482, center: [58.679574050674596 29.507231745950556 30.456517611740352]
cid: 806, volume: 198.6135461695374, center: [58.26577223057121 35.09995569574859 52.57793036913135]
cid: 807, volume: 160.1945411352855, center: [59.62168582500132 25.730841520031422 35.66272725860173]
cid: 808, volume: 154.98475794361164, center: [60.18638489209269 39.1905467888925 36.58183000276064]
cid: 809, volume: 258.61414099538507, center: [59.94351928054698 25.28212864522408 43.98149410364459]
cid: 810, volume: 161.40260680292002, center: [59.958942253984375 34.36426815764853 33.4434432864494]
cid: 811, volume: 143.48296606634133, center: [59.57234613387078 29.415353292931066 49.84949319487809]
cid: 812, volume: 253.93288653330134, center: [59.93180610348806 36.23040098488528 47.252232803706825]
cid: 813, volume: 212.06586073934258, center: [60.51809768730333 38.89242068383575 43.05198088428673]
cid: 814, volume: 132.83688737031216, center: [60.90972565628102 29.378145412277377 35.948036002463056]
cid: 815, volume: 116.49024880513258, center: [60.799726187544294 29.49027858291023 45.62650137150265]
cid: 816, volume: 214.1548076229606, center: [61.664435961437725 32.01716575614056 41.26536045963098]
cid: 817, volume: 113.92310926140924, center: [61.44554898071393 34.90486789152767 37.45740898442506]
cid: 818, volume: 27.647086164510778, center: [1.585988580033844 0.7293205571233501 5.917695002275831]
cid: 819, volume: 6.556273050391495, center: [0.454350881514455 2.0725959769673707 70.43935167754319]
cid: 820, volume: 81.46892846110278, center: [1.5395925954932588 6.398363917207291 72.72038697497683]
cid: 821, volume: 146.01235355795112, center: [2.3755819834005587 24.4370083583556 74.8428095039214]
cid: 822, volume: 200.41306065361798, center: [2.354987403730659 50.2268986675876 62.74709895315836]
cid: 823, volume: 184.00350200158243, center: [3.051596021125023 55.062053998085084 57.55591200177815]
cid: 824, volume: 107.05223577673792, center: [1.7753705950889853 56.878561440695904 40.10871602985777]
cid: 825, volume: 91.96399894867764, center: [1.38854304703665 56.89889148795841 47.39996756540777]
cid: 826, volume: 3.913629402440989, center: [7.7268868563664075 0.33525271382636657 68.58831593569131]
cid: 827, volume: 176.18882721407167, center: [2.995078025422175 28.024210363974003 10.08608461652739]
cid: 828, volume: 205.89969222745808, center: [3.6695317665352607 42.23661997873121 69.10937696883022]
cid: 829, volume: 160.24487720477026, center: [5.269403389431563 2.649505627297 71.19078620323543]
cid: 830, volume: 195.63113405256468, center: [6.754165801013109 58.01294620043742 42.77090414408851]
cid: 831, volume: 202.86694404100058, center: [9.317293287966283 9.975888480243162 72.5471143226847]
cid: 832, volume: 44.5977575635076, center: [1.6220864922013662 37.666245386568846 70.96535136004515]
cid: 833, volume: 37.80238818306344, center: [10.555112447672608 1.2396252583222371 69.55894435552598]
cid: 834, volume: 131.54073358107928, center: [2.2993336321318196 45.91322795121018 66.52804896527313]
cid: 835, volume: 158.68445905074233, center: [11.991188110212025 56.450327001903254 56.01748105598731]
cid: 836, volume: 137.15320532863132, center: [10.926140287392798 5.001427681989174 68.7368448411781]
cid: 837, volume: 212.07844475671376, center: [12.925733950329418 43.29155751889872 69.59805451551652]
cid: 838, volume: 199.2930831075818, center: [16.01786964517753 41.96950163730505 13.841865125339396]
cid: 839, volume: 206.7176533565856, center: [16.563837531614528 36.694127495464784 12.091486804042127]
cid: 840, volume: 82.08554531229122, center: [18.577086215029126 0.8618006791353672 69.43829530645408]
cid: 841, volume: 230.30010191020108, center: [20.29759992924223 56.057386079667786 27.85889730878094]
cid: 842, volume: 91.03278166320936, center: [27.21570573349193 9.045503537738458 16.20804547055571]
cid: 843, volume: 151.36056094070807, center: [30.004383321454746 5.428809737279681 5.70295054040572]
cid: 844, volume: 83.21810687569858, center: [31.131829715032147 8.865875000756088 25.529776607893545]
cid: 845, volume: 55.50810062433184, center: [34.49131944652943 1.2664832210383135 56.79341674767627]
cid: 846, volume: 12.445593180109768, center: [35.268470347689295 3.292156291203236 46.72796304145602]
cid: 847, volume: 211.77642833980514, center: [37.007714890283665 7.148091956028285 24.37427248986868]
cid: 848, volume: 14.169603559963194, center: [41.703035484369835 5.715269799289521 35.65694602131439]
cid: 849, volume: 26.149588097338825, center: [28.3850137698014 3.325139636188643 61.523011594802696]
cid: 850, volume: 104.2334158855907, center: [2.25187004266234 33.65957533550646 12.06039972860075]
cid: 851, volume: 108.02120511431977, center: [1.701989721637705 53.627543152609505 29.193440012581547]
cid: 852, volume: 50.0843891373477, center: [1.4450184568366762 56.194383582914575 52.91037072562814]
cid: 853, volume: 371.668953058182, center: [4.0289547111886925 51.06837488850516 23.921616588048078]