type:genetic
1,127:1
1,131:1
1,134:1
1,135:1
1,136:1
1,137:1
1,142:1
1,143:1
1,145:1
1,149:1
1,162:1
1,163:1
1,165:1
1,189:1
1,196:1
1,197:1
1,200:1
1,202:1
1,203:1
1,209:1
1,211:1
1,218:1
1,221:1
1,223:1
1,227:1
1,231:1
1,236:1
1,238:1
1,241:1
1,242:1
1,243:1
1,244:1
1,247:1
1,254:1
1,259:1
1,269:1
1,270:1
1,273:1
1,282:1
1,285:1
1,286:1
1,288:1
1,291:1
1,293:1
1,294:1
1,295:1
1,300:1
1,302:1
1,304:1
1,309:1
1,311:1
1,313:1
1,314:1
1,316:1
1,317:1
1,322:1
1,325:1
1,333:1
1,337:1
1,349:1
1,350:1
1,352:1
1,354:1
1,355:1
1,356:1
1,358:1
1,363:1
1,365:1
1,366:1
1,368:1
1,371:1
1,372:1
1,374:1
1,378:1
1,379:1
1,383:1
1,384:1
1,385:1
1,388:1
1,390:1
1,391:1
1,394:1
1,396:1
1,398:1
1,402:1
1,404:1
1,406:1
1,407:1
1,408:1
1,409:1
1,410:1
1,417:1
1,419:1
1,426:1
1,427:1
1,429:1
1,430:1
1,433:1
1,434:1
1,435:1
1,440:1
1,445:1
1,448:1
1,451:1
1,455:1
1,456:1
1,458:1
1,459:1
1,464:1
1,466:1
1,473:1
1,476:1
1,479:1
1,485:1
1,487:1
1,489:1
1,494:1
1,502:1
1,504:1
1,506:1
1,514:1
1,516:1
1,519:1
2,106:1
2,108:1
2,110:1
2,113:1
2,114:1
2,121:1
2,122:1
2,123:1
2,124:1
2,125:1
2,126:1
2,127:1
2,128:1
2,134:1
2,135:1
2,141:1
2,148:1
2,149:1
2,152:1
2,153:1
2,154:1
2,155:1
2,156:1
2,163:1
2,165:1
2,166:1
2,168:1
2,169:1
2,170:1
2,171:1
2,175:1
2,176:1
2,177:1
2,180:1
2,185:1
2,187:1
2,193:1
2,194:1
2,195:1
2,197:1
2,200:1
2,202:1
2,203:1
2,204:1
2,210:1
2,215:1
2,217:1
2,219:1
2,221:1
2,222:1
2,223:1
2,225:1
2,227:1
2,229:1
2,230:1
2,232:1
2,234:1
2,235:1
2,236:1
2,237:1
2,240:1
2,241:1
2,242:1
2,243:1
2,245:1
2,249:1
2,250:1
2,251:1
2,253:1
2,254:1
2,257:1
2,258:1
2,259:1
2,261:1
2,263:1
2,264:1
2,266:1
2,267:1
2,268:1
2,269:1
2,270:1
2,275:1
2,276:1
2,284:1
2,285:1
2,286:1
2,288:1
2,291:1
2,292:1
2,293:1
2,294:1
2,299:1
2,300:1
2,301:1
2,302:1
2,303:1
2,306:1
2,307:1
2,308:1
2,310:1
2,311:1
2,313:1
2,318:1
2,319:1
2,322:1
2,323:1
2,326:1
2,327:1
2,330:1
2,333:1
2,334:1
2,335:1
2,336:1
2,343:1
2,344:1
2,346:1
2,350:1
2,352:1
2,358:1
2,363:1
2,364:1
2,365:1
2,371:1
2,376:1
2,378:1
2,382:1
2,388:1
2,389:1
2,390:1
2,392:1
2,398:1
2,401:1
2,402:1
2,405:1
2,406:1
2,408:1
3,28:1
3,96:1
3,100:1
3,101:1
3,103:1
3,105:1
3,106:1
3,107:1
3,108:1
3,110:1
3,112:1
3,113:1
3,114:1
3,115:1
3,116:1
3,118:1
3,119:1
3,121:1
3,122:1
3,123:1
3,124:1
3,125:1
3,126:1
3,127:1
3,131:1
3,132:1
3,133:1
3,134:1
3,137:1
3,140:1
3,141:1
3,142:1
3,143:1
3,144:1
3,145:1
3,146:1
3,147:1
3,149:1
3,151:1
3,152:1
3,153:1
3,154:1
3,155:1
3,156:1
3,157:1
3,158:1
3,159:1
3,163:1
3,164:1
3,165:1
3,167:1
3,168:1
3,170:1
3,171:1
3,172:1
3,173:1
3,174:1
3,175:1
3,178:1
3,182:1
3,183:1
3,184:1
3,185:1
3,186:1
3,189:1
3,192:1
3,195:1
3,197:1
3,198:1
3,199:1
3,200:1
3,202:1
3,203:1
3,205:1
3,206:1
3,207:1
3,209:1
3,211:1
3,212:1
3,213:1
3,215:1
3,216:1
3,219:1
3,221:1
3,222:1
3,224:1
3,225:1
3,226:1
3,228:1
3,229:1
3,230:1
3,231:1
3,232:1
3,233:1
3,234:1
3,235:1
3,237:1
3,238:1
3,240:1
3,242:1
3,243:1
3,244:1
3,245:1
3,246:1
3,248:1
3,251:1
3,253:1
3,254:1
3,256:1
3,257:1
3,260:1
3,263:1
3,264:1
3,265:1
3,266:1
3,267:1
3,268:1
3,270:1
3,271:1
3,272:1
3,273:1
3,274:1
3,276:1
3,277:1
3,278:1
3,279:1
3,280:1
3,281:1
3,282:1
3,283:1
3,284:1
3,287:1
3,288:1
3,290:1
3,291:1
3,293:1
3,294:1
3,296:1
3,297:1
3,299:1
3,300:1
3,302:1
3,303:1
3,306:1
3,307:1
3,308:1
3,309:1
3,310:1
3,311:1
3,313:1
3,314:1
3,315:1
3,318:1
3,321:1
3,322:1
3,323:1
3,324:1
3,325:1
3,328:1
3,329:1
3,330:1
3,331:1
3,332:1
3,333:1
3,334:1
3,335:1
3,336:1
3,337:1
3,338:1
3,341:1
3,342:1
3,343:1
3,344:1
3,345:1
3,346:1
3,347:1
3,348:1
3,349:1
3,351:1
3,352:1
3,353:1
3,354:1
3,355:1
3,357:1
3,358:1
3,359:1
3,360:1
3,361:1
3,362:1
3,363:1
3,364:1
3,365:1
3,366:1
3,367:1
3,368:1
3,369:1
3,370:1
3,371:1
3,372:1
3,373:1
3,374:1
3,375:1
3,376:1
3,377:1
3,378:1
3,379:1
3,380:1
3,381:1
3,382:1
3,383:1
3,384:1
3,385:1
3,386:1
3,388:1
3,389:1
3,390:1
3,391:1
3,392:1
3,393:1
3,394:1
3,395:1
3,396:1
3,397:1
3,398:1
3,399:1
3,400:1
3,401:1
3,402:1
3,403:1
3,404:1
3,405:1
3,406:1
3,407:1
3,408:1
3,409:1
3,410:1
3,411:1
3,412:1
3,413:1
3,414:1
3,415:1
3,416:1
3,417:1
3,418:1
3,419:1
3,420:1
3,421:1
3,422:1
3,423:1
3,424:1
3,425:1
3,426:1
3,427:1
3,428:1
3,429:1
3,430:1
4,3:1
4,47:1
4,64:1
4,65:1
4,66:1
4,68:1
4,71:1
4,75:1
4,77:1
4,79:1
4,82:1
4,85:1
4,87:1
4,90:1
4,91:1
4,99:1
4,102:1
4,104:1
4,106:1
4,108:1
4,110:1
4,112:1
4,113:1
4,118:1
4,120:1
4,125:1
4,127:1
4,128:1
4,129:1
4,130:1
4,132:1
4,134:1
4,135:1
4,136:1
4,137:1
4,139:1
4,140:1
4,141:1
4,149:1
4,152:1
4,154:1
4,155:1
4,156:1
4,157:1
4,161:1
4,162:1
4,167:1
4,168:1
4,172:1
4,173:1
4,175:1
4,177:1
4,179:1
4,181:1
4,186:1
4,187:1
4,188:1
4,189:1
4,192:1
4,194:1
4,195:1
4,197:1
4,198:1
4,202:1
4,203:1
4,205:1
4,206:1
4,211:1
4,212:1
4,213:1
4,214:1
4,218:1
4,220:1
4,222:1
4,223:1
4,226:1
4,228:1
4,229:1
4,230:1
4,233:1
4,234:1
4,237:1
4,238:1
4,242:1
4,244:1
4,246:1
4,249:1
4,250:1
4,252:1
4,253:1
4,255:1
4,256:1
4,257:1
4,258:1
4,259:1
4,261:1
4,262:1
4,264:1
4,265:1
4,268:1
4,269:1
4,271:1
4,272:1
4,274:1
4,276:1
4,278:1
4,280:1
4,281:1
4,286:1
4,288:1
4,289:1
4,292:1
4,295:1
4,296:1
4,297:1
4,300:1
4,301:1
4,302:1
4,305:1
4,306:1
4,308:1
4,310:1
4,311:1
4,314:1
4,315:1
4,319:1
4,320:1
4,321:1
4,323:1
4,324:1
4,326:1
4,327:1
4,328:1
4,330:1
4,331:1
4,332:1
4,334:1
4,344:1
4,346:1
4,347:1
4,350:1
4,351:1
4,352:1
4,357:1
4,358:1
4,360:1
4,361:1
4,366:1
4,367:1
4,371:1
4,372:1
4,375:1
4,378:1
4,379:1
4,382:1
4,383:1
4,385:1
4,386:1
4,389:1
4,391:1
4,392:1
4,393:1
4,397:1
4,398:1
4,399:1
4,401:1
4,403:1
4,407:1
4,408:1
4,409:1
4,411:1
4,412:1
4,413:1
4,414:1
4,416:1
4,420:1
4,424:1
4,426:1
4,427:1
4,431:1
4,432:1
4,439:1
4,441:1
4,444:1
4,446:1
4,447:1
4,448:1
4,449:1
4,454:1
4,455:1
4,458:1
4,466:1
4,468:1
4,469:1
4,471:1
4,473:1
4,476:1
4,477:1
4,482:1
4,484:1
4,485:1
4,498:1
4,501:1
4,502:1
4,503:1
4,504:1
4,505:1
4,506:1
4,511:1
4,515:1
4,516:1
4,518:1
4,523:1
4,525:1
4,526:1
4,532:1
4,536:1
4,538:1
4,539:1
4,543:1
4,544:1
4,545:1
4,546:1
4,561:1
4,562:1
4,566:1
4,570:1
4,577:1
4,578:1
4,582:1
4,597:1
4,600:1
4,601:1
4,602:1
4,603:1
4,609:1
4,610:1
4,611:1
4,617:1
4,619:1
4,620:1
4,624:1
4,632:1
4,638:1
4,658:1
4,659:1
4,664:1
4,669:1
4,674:1
4,682:1
4,684:1
4,691:1
4,710:1
4,718:1
4,719:1
4,720:1
4,724:1
4,725:1
4,729:1
4,731:1
4,733:1
4,735:1
4,736:1
4,745:1
4,749:1
4,752:1
4,753:1
4,764:1
4,766:1
4,780:1
4,781:1
4,791:1
4,792:1
4,793:1
4,795:1
4,797:1
4,798:1
4,799:1
4,809:1
4,814:1
4,828:1
4,832:1
4,833:1
4,836:1
4,842:1
4,844:1
4,848:1
4,851:1
4,854:1
4,858:1
4,861:1
4,870:1
4,871:1
4,872:1
4,874:1
4,876:1
4,881:1
4,886:1
4,889:1
4,895:1
4,896:1
4,897:1
4,898:1
4,900:1
4,905:1
4,909:1
4,913:1
4,914:1
4,917:1
4,919:1
4,921:1
4,923:1
4,924:1
4,925:1
4,926:1
4,929:1
4,930:1
4,931:1
4,932:1
4,933:1
4,934:1
4,935:1
4,942:1
4,946:1
5,52:1
5,53:1
5,54:1
5,55:1
5,56:1
5,57:1
5,59:1
5,61:1
5,63:1
5,64:1
5,65:1
5,66:1
5,69:1
5,71:1
5,72:1
5,73:1
5,74:1
5,75:1
5,76:1
5,77:1
5,78:1
5,79:1
5,80:1
5,81:1
5,82:1
5,83:1
5,84:1
5,86:1
5,87:1
5,88:1
5,89:1
5,91:1
5,93:1
5,94:1
5,95:1
5,97:1
5,98:1
5,100:1
5,101:1
5,103:1
5,104:1
5,105:1
5,106:1
5,107:1
5,108:1
5,109:1
5,110:1
5,112:1
5,113:1
5,114:1
5,115:1
5,116:1
5,118:1
5,120:1
5,121:1
5,122:1
5,123:1
5,124:1
5,126:1
5,127:1
5,129:1
5,131:1
5,132:1
5,136:1
5,137:1
5,140:1
5,141:1
5,142:1
5,143:1
5,145:1
5,146:1
5,148:1
5,150:1
5,151:1
5,152:1
5,156:1
5,161:1
5,162:1
5,164:1
5,165:1
5,166:1
5,167:1
5,168:1
5,169:1
5,171:1
5,177:1
5,178:1
5,180:1
5,181:1
5,182:1
5,183:1
5,184:1
5,185:1
5,186:1
5,190:1
5,191:1
5,192:1
5,195:1
5,197:1
5,198:1
5,199:1
5,200:1
5,201:1
5,202:1
5,203:1
5,206:1
5,208:1
5,209:1
5,211:1
5,213:1
5,216:1
5,217:1
5,219:1
5,220:1
5,221:1
5,222:1
5,224:1
5,225:1
5,226:1
5,227:1
5,228:1
5,231:1
5,232:1
5,234:1
5,237:1
5,241:1
5,242:1
5,243:1
5,245:1
5,246:1
5,248:1
5,249:1
5,250:1
5,251:1
5,252:1
5,253:1
5,255:1
5,256:1
5,258:1
5,259:1
5,262:1
5,265:1
5,266:1
5,268:1
5,270:1
5,272:1
5,274:1
5,276:1
5,277:1
5,278:1
5,281:1
5,282:1
5,283:1
5,284:1
5,285:1
5,286:1
5,288:1
5,289:1
5,290:1
5,291:1
5,297:1
5,304:1
5,305:1
5,306:1
5,307:1
5,308:1
5,309:1
5,310:1
5,311:1
5,312:1
5,313:1
5,315:1
5,317:1
5,321:1
5,322:1
5,323:1
5,324:1
5,325:1
5,326:1
5,327:1
5,330:1
5,335:1
5,339:1
5,340:1
5,343:1
5,345:1
5,347:1
5,348:1
5,349:1
5,350:1
5,352:1
5,356:1
5,359:1
5,360:1
5,361:1
5,362:1
5,363:1
5,364:1
5,372:1
5,374:1
5,377:1
5,378:1
5,380:1
5,382:1
5,383:1
5,384:1
5,385:1
5,387:1
5,388:1
5,389:1
5,390:1
5,392:1
5,394:1
5,395:1
5,396:1
5,397:1
5,401:1
5,403:1
5,408:1
5,409:1
5,414:1
5,416:1
5,419:1
5,420:1
5,427:1
5,428:1
5,429:1
5,435:1
5,436:1
5,440:1
5,444:1
5,446:1
5,447:1
5,449:1
5,450:1
5,451:1
5,454:1
5,455:1
5,456:1
5,458:1
5,459:1
5,464:1
5,467:1
5,475:1
5,476:1
5,477:1
5,478:1
5,480:1
5,482:1
5,483:1
5,485:1
5,487:1
5,488:1
5,492:1
5,493:1
5,494:1
5,497:1
5,498:1
5,500:1
5,503:1
5,507:1
5,508:1
5,512:1
5,516:1
5,517:1
5,520:1
5,521:1
5,526:1
5,527:1
5,529:1
5,530:1
5,531:1
5,532:1
5,535:1
5,536:1
5,539:1
5,541:1
5,542:1
5,544:1
5,546:1
5,549:1
5,550:1
5,553:1
5,561:1
5,562:1
5,567:1
5,572:1
5,574:1
5,575:1
5,577:1
5,580:1
5,585:1
5,586:1
5,587:1
5,588:1
5,593:1
5,599:1
5,602:1
5,606:1
5,610:1
5,613:1
5,614:1
5,616:1
5,618:1
5,624:1
5,628:1
5,630:1
5,635:1
5,638:1
5,645:1
5,647:1
5,649:1
5,651:1
5,653:1
5,654:1
5,658:1
5,663:1
5,664:1
5,668:1
5,675:1
5,677:1
5,683:1
5,684:1
5,689:1
5,701:1
5,702:1
5,703:1
5,704:1
5,716:1
5,719:1
5,721:1
5,727:1
5,728:1
5,733:1
5,736:1
5,746:1
5,748:1
5,753:1
5,754:1
5,756:1
5,757:1
5,760:1
5,761:1
5,764:1
5,769:1
5,772:1
5,773:1
5,783:1
5,785:1
5,790:1
5,791:1
5,799:1
5,800:1
5,801:1
5,805:1
5,808:1
5,815:1
5,819:1
5,820:1
5,822:1
5,825:1
5,837:1
5,838:1
5,841:1
5,842:1
5,847:1
5,848:1
5,849:1
5,851:1
5,853:1
5,863:1
5,869:1
5,873:1
5,875:1
5,879:1
5,886:1
5,888:1
5,889:1
5,894:1
5,898:1
5,901:1
5,905:1
5,906:1
5,909:1
5,921:1
5,922:1
5,923:1
5,927:1
5,929:1
5,933:1
5,934:1
5,937:1
5,938:1
5,942:1
5,948:1
5,950:1
5,952:1
5,958:1
5,966:1
5,969:1
5,976:1
5,978:1
5,985:1
5,991:1
5,999:1
5,1003:1
5,1006:1
5,1012:1
5,1014:1
5,1017:1
5,1020:1
5,1022:1
5,1024:1
5,1025:1
5,1031:1
5,1032:1
5,1040:1
5,1049:1
5,1056:1
5,1061:1
5,1062:1
5,1066:1
5,1069:1
5,1072:1
5,1083:1
5,1084:1
5,1085:1
5,1099:1
5,1104:1
5,1109:1
5,1117:1
5,1119:1
5,1134:1
5,1135:1
5,1138:1
5,1140:1
5,1150:1
5,1152:1
5,1154:1
5,1159:1
5,1164:1
5,1171:1
5,1174:1
5,1175:1
5,1180:1
5,1184:1
5,1187:1
5,1190:1
5,1196:1
5,1205:1
5,1209:1
5,1212:1
5,1216:1
5,1217:1
5,1223:1
5,1227:1
5,1230:1
5,1238:1
5,1245:1
5,1246:1
5,1250:1
5,1251:1
5,1252:1
5,1253:1
5,1259:1
5,1267:1
5,1270:1
5,1272:1
5,1277:1
5,1278:1
5,1280:1
5,1285:1
5,1287:1
5,1289:1
5,1290:1
5,1291:1
5,1293:1
5,1295:1
5,1297:1
5,1298:1
5,1299:1
5,1305:1
5,1306:1
5,1307:1
5,1310:1
5,1312:1
5,1320:1
5,1321:1
5,1326:1
5,1335:1
5,1338:1
5,1341:1
5,1342:1
5,1343:1
5,1345:1
5,1347:1
5,1348:1
5,1349:1
5,1350:1
5,1351:1
5,1352:1
5,1353:1
5,1354:1
5,1355:1
5,1356:1
5,1357:1
5,1358:1
5,1359:1
5,1360:1
5,1361:1
5,1363:1
5,1364:1
5,1365:1
5,1366:1
5,1367:1
5,1368:1
5,1369:1
5,1371:1
5,1372:1
5,1373:1
5,1374:1
5,1375:1
5,1376:1
5,1377:1
5,1378:1
5,1379:1
5,1380:1
5,1381:1
5,1382:1
5,1383:1
5,1384:1
5,1385:1
5,1386:1
5,1387:1
5,1388:1
5,1389:1
5,1390:1
5,1391:1
5,1392:1
5,1393:1
5,1394:1
5,1395:1
5,1396:1
5,1397:1
5,1398:1
5,1399:1
5,1400:1
5,1401:1
5,1402:1
5,1403:1
5,1404:1
5,1405:1
5,1406:1
5,1407:1
5,1408:1
5,1409:1
5,1410:1
5,1411:1
5,1412:1
5,1413:1
5,1414:1
5,1422:1
5,1423:1
5,1424:1
5,1430:1
5,1432:1
5,1435:1
5,1436:1
5,1437:1
5,1439:1
5,1440:1
5,1441:1
5,1443:1
5,1445:1
5,1450:1
