cid: 2, volume: 411.01597626538825, center: [12.565488804471332 49.432084321000275 12.561588614872218]
cid: 3, volume: 466.6087389798219, center: [14.89649342778961 43.70146637671379 10.438159391048606]
cid: 4, volume: 25.684262985091863, center: [8.545901962691504 35.16612287651715 14.043240053562005]
cid: 5, volume: 71.13433961306444, center: [8.826229205128048 28.280751385169893 15.25463181495713]
cid: 6, volume: 703.9114502009213, center: [16.10873161693243 57.37452813136934 13.620309525040916]
cid: 7, volume: 118.91113487557041, center: [9.690302020481287 40.26976243041413 18.079662397473406]
cid: 8, volume: 557.6557239942571, center: [15.037994025177694 44.28688833450671 16.177878775674962]
cid: 9, volume: 51.696073739122895, center: [8.714382669829114 54.54317079536814 16.754680081538126]
cid: 10, volume: 150.08464667805657, center: [9.330734654192662 19.32440198794401 19.20313449857014]
cid: 11, volume: 538.9516169127653, center: [12.360747447568125 34.56546037076932 20.434233864878344]
cid: 12, volume: 427.4159542136527, center: [11.10204153209675 61.65574930512129 20.263728908355795]
cid: 13, volume: 169.07112252587515, center: [9.82931633741702 49.2461997805331 20.904319149669316]
cid: 14, volume: 29.174340936891944, center: [8.743207924577575 29.914951821370497 20.500909930778164]
cid: 15, volume: 332.14473245496765, center: [10.759496154262763 14.560108012847282 23.138678589723536]
cid: 16, volume: 703.3467126682676, center: [14.510837738185126 53.02206541358877 19.896138534236897]
cid: 17, volume: 537.7769628448456, center: [13.278943712674812 23.76654435440321 23.59141931095709]
cid: 18, volume: 512.8042691508974, center: [17.04405080496428 28.597706630919344 19.737786048517684]
cid: 19, volume: 86.08858947773534, center: [9.411075487502814 7.992803070716347 21.969970116294935]
cid: 20, volume: 422.468853427606, center: [13.749260870856066 43.82351756877339 22.17651410149182]
cid: 21, volume: 6.4380078722525775, center: [8.633159793603692 27.850358996842104 22.876324672280703]
cid: 22, volume: 30.936322038771596, center: [8.660194838696851 40.88976751748813 23.960054462504562]
cid: 23, volume: 19.506034377860004, center: [8.980941987008745 48.023862165489284 23.621799361436015]
cid: 24, volume: 174.492602839351, center: [10.660911895186702 58.147111180879016 25.53245846478089]
cid: 25, volume: 199.82672855419756, center: [11.047907562668863 29.467816654465295 25.676616567578566]
cid: 26, volume: 259.23711698937046, center: [10.552096100983418 38.63587389738585 27.09423403648484]
cid: 27, volume: 768.0317496584264, center: [16.187327090487397 67.91571559682347 25.938128372114296]
cid: 28, volume: 322.55548915050724, center: [14.117248541159041 7.690557882925975 26.337169139694655]
cid: 29, volume: 156.02568552157388, center: [9.667675860504426 46.4780972403938 27.77912308074417]
cid: 30, volume: 98.00455141672916, center: [9.419647313646296 12.541112917114209 28.127701857093466]
cid: 31, volume: 77.67400024119469, center: [9.241002165405716 18.68196731711502 28.723176670670348]
cid: 32, volume: 619.2572940561264, center: [13.7925270094611 54.92305698098747 29.117726491075565]
cid: 33, volume: 422.0283581521361, center: [15.30848927106571 61.574794116975774 29.18872398724475]
cid: 34, volume: 450.750909062905, center: [13.588707383878502 24.89449942110354 30.64229159749925]
cid: 35, volume: 383.42290041992675, center: [12.789462737773558 31.373037576663624 28.851020590644236]
cid: 36, volume: 320.3530127731577, center: [11.877515356065496 7.749711615633042 31.286170145774424]
cid: 37, volume: 394.54822981320535, center: [13.162932302533221 70.48611904568877 33.98538176200046]
cid: 38, volume: 337.19348599689204, center: [12.672212033772643 41.50300421982984 32.463697945796206]
cid: 39, volume: 47.607374002709854, center: [9.250351279315758 16.541035301115063 32.07926978415184]
cid: 40, volume: 253.52197315891468, center: [11.157765287715643 22.233680909623093 34.24979941295554]
cid: 41, volume: 235.23577185158672, center: [11.781790797897733 50.2545591684256 33.45816801203246]
cid: 42, volume: 25.96663175141873, center: [8.980733232005601 36.03450405454546 31.87357569430187]
cid: 43, volume: 228.48151096104806, center: [14.787091090951224 46.569273818864005 30.78191001915072]
cid: 44, volume: 212.36390177911048, center: [10.884081097388982 10.562459571971067 36.43321656907776]
cid: 45, volume: 26.452306029500942, center: [8.737967420416938 59.7603891350128 33.65952715029889]
cid: 46, volume: 143.92900757213087, center: [9.169080268892472 30.298970416589498 35.613994590143605]
cid: 47, volume: 105.76404511539147, center: [11.75088949589065 5.039654094959419 35.247101892204185]
cid: 48, volume: 102.96294695342894, center: [10.404408643370935 36.27512912220272 35.555310207196136]
cid: 49, volume: 300.05634584958244, center: [11.750476120833444 65.91782809462471 37.417035590190466]
cid: 50, volume: 602.8121371052497, center: [15.662493324355511 15.826683148743697 37.01392741567893]
cid: 51, volume: 269.605698088893, center: [13.880293196063954 46.23799598986175 34.86804804651027]
cid: 52, volume: 355.7281718185876, center: [11.822863695957212 53.497226819520556 38.34007296657247]
cid: 53, volume: 192.1350033594537, center: [11.169669536732897 39.88166199450943 38.21578837693257]
cid: 54, volume: 52.99497006422648, center: [9.400196875409748 20.759607039130433 38.94648182463768]
cid: 55, volume: 334.58439859603175, center: [12.254047941920565 25.456678918765824 39.61297671314181]
cid: 56, volume: 416.55040408539486, center: [12.945339321262932 6.7984263937093266 40.75459748213665]
cid: 57, volume: 255.690565284305, center: [10.546150091512224 14.72099362598286 40.63416716258503]
cid: 58, volume: 169.4890283000389, center: [10.654560773870987 48.09113517771558 39.79171834288951]
cid: 59, volume: 125.85740652721135, center: [9.175743597945504 33.716788004935836 43.058737280624605]
cid: 60, volume: 85.07206191895862, center: [9.169998497900933 61.93992102851831 41.79051499776952]
cid: 61, volume: 234.84045557872912, center: [11.120528788545423 67.3968400415352 42.180937194276645]
cid: 62, volume: 82.53074302201682, center: [10.503498338435515 29.37536267937594 41.38183245887505]
cid: 63, volume: 534.8516224256992, center: [13.911438878738124 58.66935454781856 37.42355984299531]
cid: 64, volume: 64.57208948362805, center: [10.216650152223245 39.15285410498513 41.69774223561308]
cid: 65, volume: 437.1520292766031, center: [14.235874704373233 43.86832381501137 40.77743276397788]
cid: 66, volume: 232.77351620921644, center: [10.432187272711719 49.54835977112912 46.005085755466055]
cid: 67, volume: 325.5937770761843, center: [14.492537558490513 24.337415757227596 46.65391208045235]
cid: 68, volume: 144.42597660086616, center: [12.540018688472875 55.28682874921404 44.24126203705326]
cid: 69, volume: 246.55311200596756, center: [10.590682054774895 19.244499259682073 47.922529495854135]
cid: 70, volume: 260.3440025533718, center: [11.450107822000508 60.080359880850324 48.11112293621692]
cid: 71, volume: 136.8246094113469, center: [13.372769928673636 4.335874731253096 44.850249976423974]
cid: 72, volume: 36.075433585920585, center: [8.67644922804433 15.091665548215405 46.535857587100814]
cid: 73, volume: 494.9698578696925, center: [13.925281249445074 28.977789570896558 47.007981602856944]
cid: 74, volume: 413.73801117277924, center: [11.733519971630347 38.43102426243345 47.45431823421692]
cid: 75, volume: 351.4700508223784, center: [12.222751471646323 44.165597295250336 48.296838211658844]
cid: 76, volume: 73.58530050478166, center: [9.481764053518088 6.640901672847275 47.529330271465845]
cid: 77, volume: 178.0730387963757, center: [9.327498432545081 11.444004671825446 49.683915599467205]
cid: 78, volume: 306.91225949599874, center: [11.046473025203671 68.83679125813123 48.10668400326059]
cid: 79, volume: 208.9528870818819, center: [11.446956313458585 53.923032397491895 48.27210275438919]
cid: 80, volume: 187.7526401060607, center: [11.185187936919675 32.97483625250557 50.97355084038982]
cid: 81, volume: 157.34717134798362, center: [9.853024501227328 63.799565032086704 52.67667121447132]
cid: 82, volume: 163.66093696305236, center: [9.218319643337843 26.171398969082126 53.14570198499655]
cid: 83, volume: 229.73522828353936, center: [11.162256238704135 55.30965649360865 52.18803538823009]
cid: 84, volume: 245.05091016910865, center: [10.599778139547926 6.741713668676253 53.58597830150258]
cid: 85, volume: 189.24354719226656, center: [12.149105951437676 49.18501993455088 51.97330566746643]
cid: 86, volume: 352.5995258876859, center: [11.974830980591477 17.26949755861362 55.004744794259715]
cid: 87, volume: 116.24557372144479, center: [10.005193017183286 69.59782658579479 53.18233098037311]
cid: 88, volume: 112.10040023176637, center: [11.154063265758817 73.9469620309723 52.57019632169269]
cid: 89, volume: 62.10983384125776, center: [10.046308331539331 41.79163000367339 53.35452654028005]
cid: 90, volume: 702.3640693614501, center: [15.045965777146964 45.40457418258744 56.37339897099301]
cid: 91, volume: 162.64440940427565, center: [11.648184501895823 60.73776797747222 54.589351641638885]
cid: 92, volume: 282.27840832164287, center: [12.039619953017844 33.82164272041453 55.80100112458387]
cid: 93, volume: 940.0846863567133, center: [14.735753558569376 39.4931274995915 58.90808493848039]
cid: 94, volume: 366.367826933784, center: [11.385051434538417 50.78436371702685 59.03292571538675]
cid: 95, volume: 411.4903557928174, center: [13.145716665916105 11.134202613954765 58.463730726185766]
cid: 96, volume: 265.30239809007156, center: [10.86787929281505 71.1054159424241 57.706631734258586]
cid: 97, volume: 296.64533115235383, center: [14.409181315697932 55.966807441516906 55.95327714773073]
cid: 98, volume: 163.08490467974556, center: [9.99626730273687 15.02755129159914 60.14308073113096]
cid: 99, volume: 568.6342216290457, center: [14.915665439344718 23.760517085442444 58.80631654234185]
cid: 100, volume: 210.69227868245542, center: [11.099125491821553 4.978295519995711 60.78508825311461]
cid: 101, volume: 243.50352932963742, center: [9.988083042929933 29.80131234312352 60.092081848870535]
cid: 102, volume: 392.89919621785646, center: [11.8284972751906 63.65164167298912 60.67316557128155]
cid: 103, volume: 264.36493378586636, center: [11.375759565847124 19.781179573707597 61.211472635136296]
cid: 104, volume: 228.1539631921089, center: [15.851513537014974 76.81273801194058 61.20501788865346]
cid: 105, volume: 57.10625930194567, center: [9.506095581043349 57.35091459030854 59.12612485585442]
cid: 106, volume: 127.07723959774343, center: [9.962163034786856 73.98799582257577 61.9428720508577]
cid: 107, volume: 12.028909445524553, center: [8.844620715045954 78.21866611492958 62.37320610384976]
cid: 108, volume: 82.4516797674453, center: [9.95028005042116 56.599060144164376 62.50396177706849]
cid: 109, volume: 14.152322568302596, center: [8.744432964857817 7.871496218196329 62.68048472003192]
cid: 110, volume: 64.61726848624035, center: [10.856053193094027 68.50934037860513 62.913358411012055]
cid: 111, volume: 63.5216776728921, center: [10.671621727147892 11.744769207041251 63.022619251635845]
cid: 112, volume: 49.87761888397787, center: [11.022205351276247 25.23955882201087 62.963735693206516]
cid: 113, volume: 83.31008081707897, center: [10.92590788514602 50.13794856263558 63.12648196298806]
cid: 114, volume: 3.9079837259638452, center: [8.786809705524687 64.9654117965318 63.55797157687861]
cid: 115, volume: 559.8017266183413, center: [16.145215593059042 37.554486436603916 12.369424489110829]
cid: 116, volume: 478.46822716555033, center: [15.88998007629388 31.483995970516027 13.942191625456777]
cid: 117, volume: 462.22637572642896, center: [15.407627306819265 64.52301626858078 32.824474137058935]
cid: 118, volume: 312.10784479641313, center: [14.740943198258648 20.65045744410668 42.746248849838956]
cid: 119, volume: 21.13247847190276, center: [12.852997416203749 60.45892552741849 63.385024924746126]
cid: 120, volume: 438.73329436803357, center: [16.038454322020705 13.711127461054474 43.84576382992483]
cid: 121, volume: 287.1916248557303, center: [14.917923862246756 12.849534255067448 30.99617073543084]
cid: 122, volume: 484.5560977675576, center: [15.628327885657557 33.652127955851846 40.75950781590639]
cid: 123, volume: 581.8490798931431, center: [20.668723506415702 34.208856361735414 47.35775434862079]
cid: 124, volume: 268.72470753795324, center: [16.63308815237384 67.1018571178043 56.70807567732851]
cid: 125, volume: 313.0904881032306, center: [16.783504960669354 72.06922968262626 41.510638587424246]
cid: 126, volume: 341.81303901399957, center: [17.569496160735792 25.109201596530415 15.982408003291146]
cid: 127, volume: 197.57907317423567, center: [15.246942403129726 33.988608938775506 33.16225212964042]
cid: 128, volume: 418.1655534287845, center: [16.38256147347902 14.556333102968424 50.72992325188126]
cid: 129, volume: 226.053139570637, center: [15.025095699315258 30.91740452058559 62.43494672962925]
cid: 130, volume: 248.5522828715618, center: [14.684128707787297 60.380512158684 44.53320197640643]
cid: 131, volume: 337.7582235295458, center: [16.890224950153463 65.85056017648475 47.238501240041465]
cid: 132, volume: 234.32089704868767, center: [15.428512566467539 24.338871872891158 51.4176649870722]
cid: 133, volume: 83.84093409777348, center: [17.113450255896225 8.605397924181597 62.98192997496968]
cid: 134, volume: 557.2265234694402, center: [19.76714468752078 50.89740781372656 24.388452308738216]
cid: 135, volume: 294.8946448011273, center: [17.168485114621397 38.681385915577 30.55278853799839]
cid: 136, volume: 290.4219235425097, center: [15.916448280487034 30.053161755026643 34.71836035673006]
cid: 137, volume: 215.59420046588983, center: [17.733025863165135 71.95615012568105 47.917750685352054]
cid: 138, volume: 340.35601617975294, center: [17.36252394033276 59.81614373639743 23.73531615119798]
cid: 139, volume: 296.23872012884317, center: [18.39536555776056 19.306145992054294 27.300302625964616]
cid: 140, volume: 310.5039902036765, center: [17.2194341413465 17.455003358066275 30.669493531904987]
cid: 141, volume: 236.35395216624113, center: [17.455290000864448 66.51518453802925 52.36620810120424]
cid: 142, volume: 382.7452153807423, center: [16.811650729653067 19.170817880774337 20.64961065364889]
cid: 143, volume: 333.7824712996635, center: [15.666222399937398 8.814053528871142 48.45264337827558]
cid: 144, volume: 351.7185353367461, center: [17.582355867408502 57.289973893153494 59.935024621470774]
cid: 145, volume: 372.02649701097437, center: [17.078823130688445 29.56471369558564 56.356826846900226]
cid: 146, volume: 193.50166818847572, center: [15.693327830519138 5.63160050721457 59.12617157417698]
cid: 147, volume: 180.02703065935762, center: [19.59817714205652 74.63670132555367 59.214756632674565]
cid: 148, volume: 58.777882398600724, center: [15.283407012386986 74.50535730015373 63.24758959250576]
cid: 149, volume: 366.81961695990697, center: [19.05240062871917 46.598163202531026 61.998976005277584]
cid: 150, volume: 285.66683351756524, center: [17.935094416683004 12.834191921279455 25.81366545365333]
cid: 151, volume: 524.9461261029527, center: [23.90859442995969 41.6837117237171 51.931511380024524]
cid: 152, volume: 368.333113547419, center: [18.24216530089959 38.598598310993225 24.491996916733616]
cid: 153, volume: 422.93193820438205, center: [20.749087447247945 61.73058890715983 41.820399077735345]
cid: 154, volume: 512.9962799119997, center: [18.142822954057483 49.82189448524626 43.831609148558975]
cid: 155, volume: 99.73264826664958, center: [17.552138216794127 4.220836580860702 50.15180114056625]
cid: 156, volume: 282.58336658927584, center: [17.45656093517726 70.494156693409 60.79638333832686]
cid: 157, volume: 445.48755525857223, center: [21.649785473919305 45.412526020810304 25.341565397226304]
cid: 158, volume: 225.52228628994249, center: [18.1477984076393 18.8777123279411 55.007799723403615]
cid: 159, volume: 7.827262202580766, center: [14.516741720605916 14.604228248773447 63.45739439076479]
cid: 160, volume: 26.644316790603213, center: [14.315209007501695 56.08799479889784 63.086243221110635]
cid: 161, volume: 295.4254980818218, center: [19.519872928342274 10.87578085802875 56.73353700765408]
cid: 162, volume: 205.5644618859595, center: [17.937357736285986 72.39869236383515 54.30575970417582]
cid: 163, volume: 294.72522354133116, center: [20.762441694086274 61.652924861914606 58.08722153849161]
cid: 164, volume: 48.91756507846652, center: [16.990059870405865 20.31812385264373 63.16653748510737]
cid: 165, volume: 216.83662303772806, center: [19.064137359135906 65.27955814044171 20.174793223460778]
cid: 166, volume: 303.467360546811, center: [20.09527466098321 67.63577070191306 38.23806177012059]
cid: 167, volume: 235.50684586726052, center: [21.211180170147703 51.21405501578821 54.88039482555273]
cid: 168, volume: 490.38418910454413, center: [23.603688836933955 39.364875547264894 39.663171234894165]
cid: 169, volume: 229.83688103941702, center: [19.47291574663951 15.959662457142857 61.481294588638264]
cid: 170, volume: 287.4514041207511, center: [20.880979708695406 39.16853738716699 17.45010692125737]
cid: 171, volume: 294.7929920452496, center: [21.42575277057614 28.63430325544061 40.26551107180843]
cid: 172, volume: 269.19908706538234, center: [19.423878563748126 20.161249578744652 49.13050541383737]
cid: 173, volume: 160.36286977235457, center: [18.464079506597198 61.231277969530915 52.64557845173968]
cid: 174, volume: 285.8249600267083, center: [19.94124693617291 50.466743911191024 59.2693576268711]
cid: 175, volume: 110.81279865731585, center: [17.61532962739316 5.326363328977679 34.15171325716033]
cid: 176, volume: 267.9227802415849, center: [20.309997269055334 8.443448936629991 36.93346910850301]
cid: 177, volume: 354.22596998172867, center: [20.984183685180664 39.529272958835534 34.242562529405006]
cid: 178, volume: 180.33198892699062, center: [19.366147077676455 54.09497166424902 51.6164456013654]
cid: 179, volume: 288.2081524145071, center: [21.22947369923634 35.82218525423051 55.00348909313791]
cid: 180, volume: 247.09526003731517, center: [19.292063590609416 38.58197581707729 44.94122632097637]
cid: 181, volume: 278.4043088476382, center: [19.169084068175657 53.464559200738364 36.39079958501359]
cid: 182, volume: 225.48840203798326, center: [22.263174254901156 25.571236682658782 43.05635196276297]
cid: 183, volume: 446.0748822925321, center: [21.872533999078545 5.967849617592545 55.205810962318324]
cid: 184, volume: 340.7852167045698, center: [23.229424153357723 63.65970267142383 16.86770749355694]
cid: 185, volume: 205.31597737159186, center: [21.30089087495975 21.16998258852459 40.35854085081967]
cid: 186, volume: 112.85714852552238, center: [17.931951068811294 55.33278551657325 44.29780610136108]
cid: 187, volume: 334.8441778610525, center: [21.25118586613511 35.61021495003036 60.40850843093166]
cid: 188, volume: 217.76279259128017, center: [20.226423706808646 21.740929290311204 34.69720445198133]
cid: 189, volume: 217.37877106907564, center: [21.34893619336307 68.05268580253559 43.23986059715265]
cid: 190, volume: 104.39738028636943, center: [19.88100369464989 55.06870417591691 62.76129719679757]
cid: 191, volume: 482.5795164032695, center: [21.479563868512205 32.110319282390115 25.8953561737256]
cid: 192, volume: 34.14403122424481, center: [20.409485507619173 11.314160400793913 63.12388951974859]
cid: 193, volume: 5.907154591558067, center: [17.26641879927137 67.32942309024857 63.50261512237093]
cid: 194, volume: 339.7460996444869, center: [21.242267614073864 46.81499455394947 38.02498184439495]
cid: 195, volume: 319.5172012248301, center: [21.5898354104597 58.68828804781363 49.40033187411361]
cid: 196, volume: 336.1091899341969, center: [21.863926818878323 30.81911484636064 50.68027632537133]
cid: 197, volume: 48.34153279515971, center: [19.28381133535166 60.946155894345786 62.92314369275701]
cid: 198, volume: 334.618282847991, center: [22.926975535577792 46.293299432761756 19.116440671801797]
cid: 199, volume: 181.96972777168645, center: [22.3254244233764 48.848698756476935 50.53960959626342]
cid: 200, volume: 334.00836631272495, center: [22.28328583010546 23.543993417651834 57.56203249292574]
cid: 201, volume: 230.6049240838261, center: [21.244646060677415 53.19074787926727 10.315876148376352]
cid: 202, volume: 166.59757213285178, center: [20.889692089966235 56.36384542870508 19.029147868705085]
cid: 203, volume: 361.34166289316573, center: [23.698015774165313 24.72144990120655 34.88569306247812]
cid: 204, volume: 273.4685028122446, center: [21.9436080755575 7.581660416082935 46.68716213987279]
cid: 205, volume: 453.11151194939765, center: [25.64437406548003 47.75969436574519 7.54785600423262]
cid: 206, volume: 367.429533495173, center: [23.875761817933366 35.37587711234822 17.62513726293689]
cid: 207, volume: 329.06126552667826, center: [22.10735313609046 44.40992551017368 46.86277397914464]
cid: 208, volume: 333.47751303203046, center: [22.883964806156644 52.46391461203048 29.80373751751397]
cid: 209, volume: 80.90429892797405, center: [21.21273033830987 64.24519275222671 62.54753548560658]
cid: 210, volume: 152.19676505018154, center: [21.92011451056907 5.158839647584415 41.80888040963265]
cid: 211, volume: 283.5885993973995, center: [26.076103239224146 63.681627675896124 36.34335371816951]
cid: 212, volume: 183.92371963466837, center: [25.06608426998592 10.690163411778432 40.38931554340457]
cid: 213, volume: 185.44851097283347, center: [24.84504673473377 4.838095997770875 62.04926620528656]
cid: 214, volume: 320.7483290460153, center: [23.19718260497437 72.00045537327276 32.70254180800056]
cid: 215, volume: 288.7615951965077, center: [23.875099198780514 7.443870820949698 32.27053025277321]
cid: 216, volume: 291.1786718362657, center: [22.50104414775294 58.504469571442975 34.9194048123429]
cid: 217, volume: 113.27505429968615, center: [21.913752073680907 53.72002311755907 47.39849833959517]
cid: 218, volume: 260.05033903639185, center: [22.345243006412954 24.102805264219946 24.023318549252952]
cid: 219, volume: 442.31373032505826, center: [25.716278334853587 46.41945117589438 29.548242331298994]
cid: 220, volume: 141.77171019739362, center: [22.186868671457656 13.915693934703633 45.816630358508604]
cid: 221, volume: 148.79704510360608, center: [23.204802242968363 58.61468865143464 55.294033824032184]
cid: 222, volume: 407.2096452953021, center: [25.20852152276231 26.638097420192494 28.735421560707845]
cid: 223, volume: 307.6238287871425, center: [22.682914346642306 32.76682507490821 33.67774466279189]
cid: 224, volume: 201.84848892109792, center: [23.026914629436323 29.70940015271669 61.358406382217]
cid: 225, volume: 131.84362437334096, center: [22.946409974396136 17.628902978977127 36.301225973802794]
cid: 226, volume: 129.11029471529687, center: [24.272616572986923 69.62928170193334 62.72276366111451]
cid: 227, volume: 320.09323350813696, center: [25.65353274754473 62.65861900352858 23.132425562378263]
cid: 228, volume: 234.9421083346068, center: [23.483212904125114 12.863250643805586 34.02177153852218]
cid: 229, volume: 374.9179531781615, center: [27.34135510092266 49.65390535726336 12.816148308519612]
cid: 230, volume: 104.66845430204323, center: [23.611199829997016 36.79785680362577 51.57954738853998]
cid: 231, volume: 230.67269258774456, center: [24.312906341078047 11.004408460559173 52.61517501168291]
cid: 232, volume: 284.3453476911555, center: [25.27655407203283 16.11171060186693 60.504483903968215]
cid: 233, volume: 180.6595366959298, center: [24.106251952311457 66.66809479582369 59.02108577550485]
cid: 234, volume: 137.64912620902135, center: [23.972649262849455 70.4793533515057 51.43262735332731]
cid: 235, volume: 347.6637198522923, center: [25.48296098978574 54.7913539085085 15.874902820584127]
cid: 236, volume: 80.70099341621872, center: [24.25535246609531 22.850696976599018 63.12881087210637]
cid: 237, volume: 373.2350353308534, center: [26.786968294030395 44.40247955950976 12.50336804738387]
cid: 238, volume: 186.25043826920177, center: [25.018255487241152 20.941739310927836 45.54610206061856]
cid: 239, volume: 188.45291464655133, center: [25.444940938498444 17.5507143740006 23.64404940969733]
cid: 240, volume: 76.92854669809176, center: [23.558674814611585 66.4633843967112 54.12598158957568]
cid: 241, volume: 167.535036437057, center: [24.79177655011114 64.12088919460662 27.55768690360682]
cid: 242, volume: 423.835518256628, center: [28.16014708330909 56.108106786217185 40.18972774236909]
cid: 243, volume: 280.45995346649784, center: [26.299837741993915 24.929217582191615 51.8254732979582]
cid: 244, volume: 275.08365215563424, center: [25.727406369265122 29.422271222623692 56.47626178679532]
cid: 245, volume: 221.29804954569255, center: [26.402285762526756 45.57047737235747 60.89354838757719]
cid: 246, volume: 192.86916215190354, center: [26.532069362672598 40.456933922967906 62.30396110965096]
cid: 247, volume: 367.1810489808054, center: [27.495053897270985 40.2357360100403 25.45704994736842]
cid: 248, volume: 244.4861726364549, center: [24.893221311917884 66.8263211284117 31.672120766035295]
cid: 249, volume: 227.8038259218636, center: [26.423690244842124 16.413692910426892 40.7790598479052]
cid: 250, volume: 206.75041070453233, center: [25.76400227033712 56.83703800715651 27.96600441386506]
cid: 251, volume: 226.25644508239233, center: [25.96558394495301 58.15385306085263 47.07693023264776]
cid: 252, volume: 176.97744798302745, center: [24.3861994220529 65.70777572189674 47.59903266018252]
cid: 253, volume: 78.60016979474682, center: [25.70076976739502 49.19039562273315 48.84170529601954]
cid: 254, volume: 111.04998842103043, center: [25.803986648674996 64.31331080176973 51.96528720657038]
cid: 255, volume: 227.566636158149, center: [25.57553362641201 19.82189721024419 51.14388946999206]
cid: 256, volume: 136.7229566554692, center: [25.127756823884788 71.11612494260223 56.85810351892606]
cid: 257, volume: 357.5579214243857, center: [27.741414506061044 73.00019985058597 38.01890514449253]
cid: 258, volume: 204.64958708306045, center: [26.423763696136895 40.0736398013025 47.05782314646503]
cid: 259, volume: 179.25898761494852, center: [27.96415364903287 53.520649511032694 56.84982671217944]
cid: 260, volume: 156.34193853985997, center: [26.132928919356456 46.281167874989166 57.51831870288975]
cid: 261, volume: 297.6392692098244, center: [27.94227289911095 9.409061153051 60.520643877838495]
cid: 262, volume: 308.5161140887354, center: [27.43511057119586 40.09341802602233 8.630675404327292]
cid: 263, volume: 277.79439231237217, center: [27.328550536416863 26.618567347696686 21.062692253897133]
cid: 264, volume: 175.8366781670669, center: [24.887353274109916 58.86182220733556 21.145215503301646]
cid: 265, volume: 283.88226291437945, center: [28.07293891458394 27.54796736147052 47.92213871198376]
cid: 266, volume: 342.8747455753886, center: [27.38109461526134 15.97067424016207 54.11256399238396]
cid: 267, volume: 415.11597075245436, center: [28.060846953796425 33.38158029628602 11.433893273430739]
cid: 268, volume: 258.26576843320606, center: [27.292023444569118 25.96517729994752 15.234814594970699]
cid: 269, volume: 268.70211803664705, center: [27.98076627567644 20.773174439411516 20.186320864850774]
cid: 270, volume: 190.94905454088084, center: [26.08017682665475 13.575439998639535 27.915466361918842]
cid: 271, volume: 256.75227184569405, center: [26.962500551165014 33.42999555364244 38.07136420027274]
cid: 272, volume: 245.08479442106787, center: [26.66591540579891 51.5251850397622 44.643583403299694]
cid: 273, volume: 213.74186135878557, center: [27.958282771877084 3.1513036134749526 51.51044848576411]
cid: 274, volume: 363.6006130237807, center: [28.19858030930658 52.685011885785286 33.16189512390656]
cid: 275, volume: 337.97282379195417, center: [28.650010078207984 45.77588890349898 43.70834102406176]
cid: 276, volume: 104.8604650631455, center: [26.71688534965141 58.74554990262817 62.70953720400689]
cid: 277, volume: 246.66605951249832, center: [27.164534420950996 17.968225268144145 31.318014134127022]
cid: 278, volume: 202.05179443285326, center: [27.637008948307585 11.731246315244004 49.15184276621387]
cid: 279, volume: 241.84320098363543, center: [27.832924721824902 34.65659616685036 22.4798000473286]
cid: 280, volume: 254.58367972030368, center: [27.672214888242717 71.40612182519963 26.951657886033715]
cid: 281, volume: 208.17354928681976, center: [28.759701403718875 36.77000148229613 44.22396542878845]
cid: 282, volume: 322.69102615834413, center: [29.670666297543406 40.64681607023451 19.902370815743787]
cid: 283, volume: 306.8670804933865, center: [29.30586835803491 20.77482829851669 28.20676163528286]
cid: 284, volume: 165.8860028417081, center: [27.29667473704265 6.569099239586028 43.62843980742153]
cid: 285, volume: 167.06065690962785, center: [28.20442925384743 71.77854079872895 44.38416110872828]
cid: 286, volume: 135.5708920888556, center: [28.44027465977559 52.61175211225527 52.00093850320753]
cid: 287, volume: 310.3684531958396, center: [28.12486608012597 55.763260937908946 9.51783268305979]
cid: 288, volume: 281.43130202266224, center: [30.14915843580227 46.441163593426175 31.844753828013]
cid: 289, volume: 263.3709957283958, center: [27.911227453725008 33.96036538375504 30.64840878983618]
cid: 290, volume: 197.55648367292955, center: [28.989649899552937 41.887419725687494 31.676590668732487]
cid: 291, volume: 61.46603305403251, center: [27.66569465615304 74.18022158283719 62.9393234278574]
cid: 292, volume: 271.5935742038342, center: [29.255883976557243 30.09073416613158 18.083453455976045]
cid: 293, volume: 274.63186212951126, center: [29.27163865915609 68.6113037450216 21.92940179870039]
cid: 294, volume: 448.9211594571069, center: [31.248648109052922 49.0318989867408 38.011975943455944]
cid: 295, volume: 266.8949579321551, center: [28.752126028796024 16.071231115107913 45.2994279647482]
cid: 296, volume: 263.43876423231427, center: [28.59372828409168 21.212117451603497 58.4902375526239]
cid: 297, volume: 332.8675964967644, center: [29.38031734848566 52.89693028081843 61.54201388261003]
cid: 298, volume: 310.6282324608603, center: [29.832373351160506 67.69348048996436 40.57528273420842]
cid: 299, volume: 149.94910967021968, center: [28.517785510499603 63.29769576346791 55.743664793989154]
cid: 300, volume: 337.97282379195417, center: [29.165119270560165 39.8088993051833 56.87309319658456]
cid: 301, volume: 195.15070178382462, center: [27.982660007915605 27.40600085474013 37.29970035479801]
cid: 302, volume: 109.10729130870158, center: [27.982464589858917 67.61324963958592 45.50112050140787]
cid: 303, volume: 307.8836080521632, center: [34.42097591537633 53.71102757574379 54.43601319214938]
cid: 304, volume: 139.82901308506476, center: [29.410905537317646 70.835063300937 60.36400631483038]
cid: 305, volume: 255.6453862816927, center: [28.92425639284353 64.31012658440399 60.99137313056463]
cid: 306, volume: 301.33265267337987, center: [29.559805062836904 61.80120502064545 12.878084592271074]
cid: 307, volume: 196.30276635043825, center: [29.836068270739204 6.461828946271576 38.263522601288834]
cid: 308, volume: 130.18329602733897, center: [30.33575629808004 53.131785877286134 49.2362341920354]
cid: 309, volume: 283.9500314182979, center: [29.050942089743096 59.513664562537784 33.20851102858393]
cid: 310, volume: 354.64387575589245, center: [30.673570663171464 42.23461665175961 37.3061186597726]
cid: 311, volume: 88.64120312533022, center: [29.188269820911415 63.82758554357798 50.1282045898318]
cid: 312, volume: 174.6281398471879, center: [29.260244035498488 26.23762467140547 61.68470161355669]
cid: 313, volume: 167.64798394358775, center: [30.731150108562698 21.31463815980597 42.3271143861214]
cid: 314, volume: 187.797819108673, center: [29.600065725031097 31.099070491321342 43.08496168945691]
cid: 315, volume: 169.11630152848744, center: [30.466386884718187 10.443851496961196 42.82339509257998]
cid: 316, volume: 372.1733287694644, center: [31.779948500708105 37.744919479821554 29.689859544566172]
cid: 317, volume: 254.14318444483376, center: [30.400666168235627 33.13559400613306 54.501459025109995]
cid: 318, volume: 291.7547041195725, center: [30.270805345204636 33.92817478360884 61.488120293600716]
cid: 319, volume: 196.96915663896965, center: [30.34333518952139 21.412750200022938 37.703340424622965]
cid: 320, volume: 161.94413486378502, center: [30.606384059441915 3.0144180086065 42.73852754706375]
cid: 321, volume: 451.28176234359955, center: [35.127510212112625 58.35601549124765 46.129333989373045]
cid: 322, volume: 195.04904902794695, center: [30.97306311169233 34.87113252152412 51.14867784790086]
cid: 323, volume: 131.4708976017895, center: [31.715024224250225 12.558648643780067 62.52605637281787]
cid: 324, volume: 157.34717134798362, center: [30.03556180217831 15.858414756758307 35.08244674151173]
cid: 325, volume: 330.63123586745564, center: [31.786146684739393 68.81617546766644 34.43937692502989]
cid: 326, volume: 96.87507635142168, center: [30.182517385606225 13.383843664101667 37.558060423714586]
cid: 327, volume: 319.4381379702586, center: [32.59320124577915 8.681735283332154 53.253825532112295]
cid: 328, volume: 110.94833566515275, center: [30.478208638384334 61.006992778031155 53.08014372315993]
cid: 329, volume: 268.83765504448394, center: [32.13115780428221 47.50158046269221 54.37088397086799]
cid: 330, volume: 183.76559312552533, center: [32.53519081102981 12.688170177688997 57.9974068614751]
cid: 331, volume: 240.43135715200108, center: [30.722229155868092 5.3355149839714375 57.64053585649457]
cid: 332, volume: 260.1632865429226, center: [31.613694703873744 57.65323708582096 25.287457476530346]
cid: 333, volume: 211.1892477111907, center: [30.704958964325424 10.579362263322281 34.15315774450743]
cid: 334, volume: 90.95662700921054, center: [29.791601554974143 68.75623557558673 49.98287974849124]
cid: 335, volume: 90.91144800659823, center: [29.585265499455332 68.45385956243011 53.97425530791403]
cid: 336, volume: 353.7741799556057, center: [32.08562145045228 40.27728419050507 13.292493000964178]
cid: 337, volume: 186.6457545420594, center: [30.33504598056779 52.44054513462027 17.719371315062027]
cid: 338, volume: 226.61787710329074, center: [30.538512591604746 47.60158282980463 21.984070640081736]
cid: 339, volume: 240.35229389742958, center: [31.667199970084877 53.33377723614662 24.521862086024434]
cid: 340, volume: 317.6987463696851, center: [32.239722971805 28.391542130510523 33.72856232419653]
cid: 341, volume: 170.46037685620334, center: [30.970512054881684 25.965324065783197 41.995638024317515]
cid: 342, volume: 146.3799684638481, center: [31.742914777505522 64.3352054311111 45.98259108714506]
cid: 343, volume: 199.35234902676842, center: [31.83126837287816 6.426350850334278 47.54740017420963]
cid: 344, volume: 256.3230713208772, center: [32.40210685248568 59.06946756012161 59.192456396254514]
cid: 345, volume: 238.68067080077452, center: [31.247528320939296 59.32381808579405 18.26960239091425]
cid: 346, volume: 452.3321741543355, center: [31.69681710787811 65.79486802360667 29.049281557246303]
cid: 347, volume: 110.73373540274433, center: [31.82669139975441 58.13887859822522 55.59250237399021]
cid: 348, volume: 278.7205618659243, center: [32.3079752822334 62.7975682228715 40.41415679544515]
cid: 349, volume: 131.01910757566648, center: [31.663737276760102 41.42755481505172 44.57887544406896]
cid: 350, volume: 195.0716385292531, center: [31.904024156355614 23.679529084326326 24.496795968502113]
cid: 351, volume: 108.50866952408862, center: [31.679964865777947 67.42123070673468 56.762661006162176]
cid: 352, volume: 283.38529388564416, center: [33.38834970737915 45.68077662250299 18.388233683746513]
cid: 353, volume: 123.6097511472495, center: [34.090841250839915 19.532585418092104 62.98060286767178]
cid: 354, volume: 345.5628962308204, center: [33.88163305180493 32.157021791658764 24.765728636130085]
cid: 355, volume: 153.42789287136668, center: [31.950306206859597 16.279081043551237 49.661562743183154]
cid: 356, volume: 336.48191670574835, center: [32.70513567522126 27.214902203766236 55.108310753556445]
cid: 357, volume: 129.731506001216, center: [32.61308145193433 35.14606208121191 41.53005012477799]
cid: 358, volume: 151.75626977471163, center: [33.065539778594015 61.43259185412325 48.713806702217916]
cid: 359, volume: 75.25692360143671, center: [31.617207865777473 43.67712398517184 49.538187940447244]
cid: 360, volume: 250.19002171625763, center: [34.92112157920671 64.63443777482732 25.01194857943208]
cid: 361, volume: 163.48022095260316, center: [32.38903709236943 52.647675480599695 42.99215861110957]
cid: 362, volume: 235.427782612689, center: [33.3419511503844 48.58051233507964 48.91534764128766]
cid: 363, volume: 252.8894671223425, center: [33.39313459826528 22.141284654435015 47.52504792448414]
cid: 364, volume: 183.3815716033208, center: [34.26282055380504 15.833442177642278 59.44889559616901]
cid: 365, volume: 59.828294209336676, center: [32.837172333882364 62.693345450481395 62.96185894400603]
cid: 366, volume: 231.1357773645206, center: [33.39460533982549 35.81807162288897 34.94461724774237]
cid: 367, volume: 250.6079274904214, center: [33.841996609308296 20.167551287326482 54.69336964788173]
cid: 368, volume: 293.6183379773298, center: [33.74848024845267 33.819325958962914 16.256905605562395]
cid: 369, volume: 185.7986482430788, center: [34.186411109141865 66.75981957072341 17.431050886164133]
cid: 370, volume: 206.26473642645013, center: [34.96939481680523 37.747054669346184 50.51996795932538]
cid: 371, volume: 205.39504062616336, center: [33.83076139550942 62.90001984844652 20.066564454880396]
cid: 372, volume: 192.95952015712814, center: [34.2271048580086 14.27168759346757 30.24424557399906]
cid: 373, volume: 141.8620682026182, center: [33.26781433129455 52.86075881299363 33.19148978853503]
cid: 374, volume: 74.92937583249754, center: [33.06222139500594 69.06143393599638 47.73829507533916]
cid: 375, volume: 188.10277737630602, center: [35.207919217791726 57.58644083324127 51.763356609367115]
cid: 376, volume: 198.60689548366548, center: [33.56427971508685 46.082290921690166 58.451468587534116]
cid: 377, volume: 63.10377189872833, center: [33.075688662490236 44.16422029017362 62.73228679545373]
cid: 378, volume: 342.1631762842449, center: [34.86594787434069 27.399037562401794 29.500611858473626]
cid: 379, volume: 239.65201935693892, center: [35.42842021292516 27.53790197293807 61.6137581091149]
cid: 380, volume: 155.82238000981852, center: [34.89150010133709 14.102054403073355 42.04250772650043]
cid: 381, volume: 104.95082306837008, center: [33.27607755362638 54.10422837675419 8.112225381532502]
cid: 382, volume: 174.68461360045328, center: [34.1788610089726 17.70899375589034 24.7373220564464]
cid: 383, volume: 126.89652358729423, center: [34.79770879138 18.71173773935024 34.976215601050285]
cid: 384, volume: 258.48036869561446, center: [36.03879645451341 10.640880574402447 46.82172830925934]
cid: 385, volume: 200.4705293414228, center: [35.48052787034111 43.0475933243563 7.098880135838638]
cid: 386, volume: 199.13774876436, center: [36.09098255340249 57.50574648511145 14.588456989336962]
cid: 387, volume: 168.8226380115075, center: [36.03120356466758 61.168921211895366 44.07935334249013]
cid: 388, volume: 222.45011411230618, center: [35.0133226103124 2.708420056613354 53.397123737385115]
cid: 389, volume: 115.91802595250562, center: [34.95804260570098 5.373122609568353 62.437505758413714]
cid: 390, volume: 123.85823566161713, center: [34.8334753080569 53.95485756596754 12.804006401787342]
cid: 391, volume: 419.09172298233665, center: [36.70704760024517 31.200878843832367 38.26852153871446]
cid: 392, volume: 243.5600030829028, center: [35.468483965549275 70.93131400813392 42.953337445056576]
cid: 393, volume: 247.05008103470286, center: [36.31785627039068 26.485872322251176 46.157472259799746]
cid: 394, volume: 59.34261993125446, center: [34.28694639129957 65.84938288248954 52.62019536372288]
cid: 395, volume: 163.17526268497016, center: [34.52362476033607 39.71445107051983 61.269486542742435]
cid: 396, volume: 77.71917924380699, center: [35.190037919895374 58.789898762360124 62.79304312759773]
cid: 397, volume: 242.0352117447377, center: [36.71125661194352 45.49556931504969 11.885376595557421]
cid: 398, volume: 131.36924484591182, center: [36.00026308751761 49.21598053912819 14.13602693364285]
cid: 399, volume: 313.3163831162921, center: [36.3640488321149 37.203596876286944 22.052639032746935]
cid: 400, volume: 187.01848131361083, center: [35.72077900621603 71.22333680841889 26.460713577002053]
cid: 401, volume: 133.9218584935067, center: [35.130742683979214 17.158231126962974 39.43269572210509]
cid: 402, volume: 186.32950152377327, center: [35.961867801509236 14.255890164308662 52.09465192368309]
cid: 403, volume: 254.78698523205904, center: [37.71576391275234 29.777709522058693 12.868721897996275]
cid: 404, volume: 224.8107169987988, center: [35.56913189575162 53.09651209455385 18.651000540424032]
cid: 405, volume: 314.90894295837563, center: [38.245766107599515 71.68624076055379 31.57429768937269]
cid: 406, volume: 274.71092538408277, center: [37.475441252711335 56.77609744303923 31.115022783011266]
cid: 407, volume: 124.87476322039386, center: [35.86505684417515 18.599343100253257 31.166247497449348]
cid: 408, volume: 440.38232796338247, center: [36.99640802848579 55.97858028758143 38.07896130357528]
cid: 409, volume: 174.48130808869794, center: [35.640884486683284 25.810310680359915 39.49424442953133]
cid: 410, volume: 183.76559312552533, center: [36.22215579517415 32.37954372618316 47.16134725904118]
cid: 411, volume: 128.05988290456094, center: [34.03500400954896 21.004118784706296 59.89787414506968]
cid: 412, volume: 102.04807215052989, center: [35.89617937790109 46.67370718813503 61.68858471710016]
cid: 413, volume: 300.03375634827626, center: [36.793230094487214 26.793831894631833 21.66597585155097]
cid: 414, volume: 367.1019857262338, center: [36.5392464156001 49.87018121900806 25.126139496449447]
cid: 415, volume: 170.53944011077485, center: [36.05715013491958 49.90551936851447 45.580412323001525]
cid: 416, volume: 141.79429969869975, center: [36.714724809373436 1.794771051840051 47.964415902389675]
cid: 417, volume: 170.0311763313865, center: [35.06701173416871 67.03441185437757 60.855352964966116]
cid: 418, volume: 232.76222145856337, center: [37.791671278720145 57.03858432626164 8.8292791816382]
cid: 419, volume: 161.04055481153904, center: [36.000293696643965 25.22860858283069 16.325171178468228]
cid: 420, volume: 183.0201395824224, center: [36.4645888479983 62.03922947248827 30.328517184608735]
cid: 421, volume: 236.02640439730195, center: [38.50204266965087 22.563863198794085 34.27389783486625]
cid: 422, volume: 141.21826741539294, center: [36.42934173385987 10.483962446820764 39.168674737519]
cid: 423, volume: 113.68166532319684, center: [35.57080978621523 6.089145869170392 42.58400708311972]
cid: 424, volume: 200.60606634925972, center: [37.37431664185576 39.12202703869151 47.6154508879455]
cid: 425, volume: 293.3020849590437, center: [37.29473464914623 34.01004661179144 58.63474202838879]
cid: 426, volume: 138.45105350538964, center: [37.29076986888078 55.46588491163322 61.964748954462394]
cid: 427, volume: 275.6370949376349, center: [37.06149245141926 49.15160759239468 6.819929640706441]
cid: 428, volume: 213.09806057156032, center: [37.43169105055588 61.06527245058568 34.8593342531722]
cid: 429, volume: 179.5752406332346, center: [37.63497541241521 64.30635538337002 50.506598817963386]
cid: 430, volume: 82.11283724785305, center: [35.14862924285677 30.36832228877579 51.251969347097656]
cid: 431, volume: 309.3067466344506, center: [37.53861142036448 43.17194599197371 23.573990669439475]
cid: 432, volume: 168.39343748669066, center: [35.93421896640939 44.02264895621436 35.812467130444695]
cid: 433, volume: 208.817350074045, center: [37.47521092911857 66.34471203157723 39.4592386011575]
cid: 434, volume: 167.46726793313854, center: [37.59605057559233 54.315414616321576 58.44483592732177]
cid: 435, volume: 237.29141647044634, center: [37.075937072320656 36.773843653900705 9.137632165957445]
cid: 436, volume: 164.8920647842375, center: [36.933613024832134 21.168801515103773 20.643283393657097]
cid: 437, volume: 379.5375061952691, center: [38.914655971999665 39.99251142257536 37.29682516133083]
cid: 438, volume: 195.15070178382462, center: [37.53840518799562 15.603705675355943 46.69869583617317]
cid: 439, volume: 87.52302281067583, center: [36.193469347258194 43.961890460678795 51.63219495003226]
cid: 440, volume: 149.6328566519336, center: [36.390891344748276 41.62749725270229 55.59605889726751]
cid: 441, volume: 159.09785769921018, center: [37.103198618352764 63.306542727076526 57.25534462308675]
cid: 442, volume: 329.174213033209, center: [39.11842689747866 44.315303427696946 45.3949616854241]
cid: 443, volume: 200.35758183489207, center: [36.62575350197328 62.132184868617166 12.711598403968656]
cid: 444, volume: 283.96132616895096, center: [38.56598617722111 23.338785194614374 26.706491502485978]
cid: 445, volume: 256.0181130532442, center: [39.228237125730686 45.70605778784135 40.02605818554727]
cid: 446, volume: 287.2142143570365, center: [38.44972368769185 20.546974001864015 53.39107950428251]
cid: 447, volume: 140.8342458931884, center: [37.67079883080361 36.73433026759163 56.09032954216056]
cid: 448, volume: 98.04973041934146, center: [36.50166040123968 25.33902239368736 57.70381156857505]
cid: 449, volume: 192.20277186337213, center: [38.52045407550607 49.93211038001998 59.48464821898102]
cid: 450, volume: 446.32336680689974, center: [39.14802068725911 43.00196697222391 30.3080859133971]
cid: 451, volume: 327.4348214326355, center: [39.80387895971212 71.22341952541565 36.960926699475685]
cid: 452, volume: 320.65797104079064, center: [40.2947832957713 39.07690381077844 42.64842585221557]
cid: 453, volume: 123.95988841749481, center: [38.53062089077272 53.17988582235991 51.146543948337126]
cid: 454, volume: 140.93589864906608, center: [38.11689001421205 5.790585335422343 49.97599329209809]
cid: 455, volume: 251.3194967815651, center: [38.24537444234024 7.969201541575659 60.31027355683789]
cid: 456, volume: 123.27090862765725, center: [37.6784579574927 35.48443039501558 13.868622557009344]
cid: 457, volume: 299.1866500492957, center: [40.40847216266452 30.877212682615426 19.418254029967155]
cid: 458, volume: 316.8968190733168, center: [39.64566502100775 34.06610137405282 29.48095496427273]
cid: 459, volume: 229.79170203680474, center: [39.09746539409479 14.932902183661833 34.38787430939297]
cid: 460, volume: 282.52689283601046, center: [40.43511591895991 54.003024519708966 28.408203126577117]
cid: 461, volume: 170.20059759118263, center: [39.334510373979484 19.00031001798394 44.217868451921156]
cid: 462, volume: 173.34053827273738, center: [39.91813042084888 54.89545077281553 48.41669878252427]
cid: 463, volume: 463.8415250698186, center: [40.6936889598573 50.42560805827549 34.19664019849027]
cid: 464, volume: 238.8726815618768, center: [40.01433010223779 1.900392178798052 58.50928763552887]
cid: 465, volume: 128.09376715652016, center: [38.282060632098485 57.73464027733004 20.646886100114628]
cid: 466, volume: 165.19702305187053, center: [38.74620160442686 59.337184767906464 24.76264003917681]
cid: 467, volume: 213.49337684441792, center: [40.36317969926431 35.200323652290756 39.93072087811872]
cid: 468, volume: 143.04801702119104, center: [39.13085629995402 60.58104732 54.86922308]
cid: 469, volume: 137.37805219334754, center: [38.33738626461167 40.637479746181036 15.977193991992106]
cid: 470, volume: 202.616531965507, center: [40.06766507122966 68.30146961191817 23.095616484073805]
cid: 471, volume: 151.91439628385467, center: [40.25349015895036 22.01522177277323 38.6164484045948]
cid: 472, volume: 132.44224615795392, center: [40.59103061295401 49.53645741338905 11.13498055684803]
cid: 473, volume: 100.09408028754797, center: [39.14877414940302 20.94488274773189 41.30055390990747]
cid: 474, volume: 118.62876610924356, center: [38.933546598837616 67.54541065752642 45.9935851272208]
cid: 475, volume: 152.76150258283528, center: [39.982528473538515 13.674919329567466 55.351101054831794]
cid: 476, volume: 54.71177216349383, center: [39.877524361091616 1.2424690253096615 62.65092435681255]
cid: 477, volume: 8.324231231316052, center: [37.14037121823604 15.27944643256445 63.374164945725916]
cid: 478, volume: 355.09566578201543, center: [41.3385373210959 51.061812709004734 42.13905271279621]
cid: 479, volume: 99.0549632274651, center: [39.65969260868544 10.301212371584949 42.20336519144812]
cid: 480, volume: 82.85829079095598, center: [39.163635430849475 32.89434071515812 44.98766540387132]
cid: 481, volume: 179.0556821031932, center: [39.099557314033795 31.74649637631994 50.940933459357844]
cid: 482, volume: 194.77797501227317, center: [39.22844662407767 27.5874519904784 53.541276674711504]
cid: 483, volume: 297.7522167163552, center: [43.134598382143096 33.6056449155451 62.416305726485085]
cid: 484, volume: 190.7344542784724, center: [40.53011141349949 65.04436143076923 30.83106548205128]
cid: 485, volume: 104.1037167693895, center: [39.27615064675027 63.51592323296083 62.42508404851905]
cid: 486, volume: 214.47602015123545, center: [42.186006083142246 64.110352294718 35.11198814180841]
cid: 487, volume: 351.6507668328276, center: [42.292326223265626 61.27955376655746 41.0834599379585]
cid: 488, volume: 150.33313119242422, center: [40.5462652126323 5.572149578933133 45.4267260466867]
cid: 489, volume: 145.89429418576586, center: [40.77243454499452 11.371639453820547 57.53841532894634]
cid: 490, volume: 141.69264694282208, center: [39.31202881313518 41.134334860916695 61.74111608937426]
cid: 491, volume: 150.4347839483019, center: [41.09812516800718 13.184261843021247 62.10650266068023]
cid: 492, volume: 120.97807424508309, center: [41.156055118590565 50.08603549050508 62.78519530478946]
cid: 493, volume: 209.85646713412788, center: [41.30913458897537 18.59612242868676 26.844483372055976]
cid: 494, volume: 159.09785769921018, center: [42.12040334212312 19.48570318388471 48.53253171754934]
cid: 495, volume: 184.19479365034218, center: [41.25655304605714 9.040546298221733 51.33989410463576]
cid: 496, volume: 178.43447081727408, center: [41.15719721925243 48.638850098658054 53.24094841692619]
cid: 497, volume: 167.7496366994654, center: [41.29726559179447 4.756159183086453 54.8192304451791]
cid: 498, volume: 213.22230282874415, center: [41.40856358997945 40.6236980764064 12.555544075919059]
cid: 499, volume: 172.77580074008364, center: [42.07863099075474 23.761553318546117 30.90240470548473]
cid: 500, volume: 252.4376770962195, center: [42.21587489842086 26.434597462666662 36.53612720666666]
cid: 501, volume: 162.61052515231643, center: [41.14239498150571 17.742750396457595 60.79486876281169]
cid: 502, volume: 146.67363198082802, center: [41.5692800340449 59.87766927471122 18.764821616063454]
cid: 503, volume: 240.35229389742958, center: [43.4059570387754 50.28693038028195 16.407221251954887]
cid: 504, volume: 271.15307892836427, center: [41.94322701818362 48.63419273909276 23.62472632680468]
cid: 505, volume: 230.16442880835618, center: [42.26352846236785 62.23856147093925 23.180450904818922]
cid: 506, volume: 230.90988235145912, center: [43.067102634652215 34.901141440099785 35.28603691073175]
cid: 507, volume: 165.77305533517733, center: [40.49264411387225 65.44015444229747 17.826449314723718]
cid: 508, volume: 193.6372051963126, center: [41.99966928018401 21.4175433589944 60.17090396754549]
cid: 509, volume: 88.53955036945256, center: [42.186335443492766 59.27412093103712 60.8872220585789]
cid: 510, volume: 217.02863379883033, center: [41.598819850180824 54.84505523964611 14.405956777069997]
cid: 511, volume: 122.86429760414656, center: [41.00173461065589 45.700892739713176 16.62303813678985]
cid: 512, volume: 266.1720938903583, center: [44.5104536240211 53.78855989297292 19.493262638071798]
cid: 513, volume: 296.76957340953766, center: [45.993468338804334 54.54958880814462 23.236473658694578]
cid: 514, volume: 162.3168616353365, center: [42.094665954628866 15.603313665228585 40.986053224563356]
cid: 515, volume: 134.21552201048664, center: [42.07168815902535 65.14902662260371 46.432026519313304]
cid: 516, volume: 90.58390023765908, center: [41.51267826998804 58.54648741461346 58.37321663369077]
cid: 517, volume: 211.08759495531302, center: [41.73346452708179 26.638480710535607 57.83153781056237]
cid: 518, volume: 253.5558574108739, center: [41.829749329740054 37.79217617160675 23.717914332816605]
cid: 519, volume: 104.1037167693895, center: [42.18847574265695 22.990087316914398 47.62613160985136]
cid: 520, volume: 171.29618840453085, center: [42.64523690425783 14.651136857668469 49.90065961161809]
cid: 521, volume: 154.93009470822562, center: [42.33837759750711 42.98817989706204 52.77298982111249]
cid: 522, volume: 125.78963802329291, center: [41.53318467895365 45.686535536895036 57.36575775804974]
cid: 523, volume: 297.1648896823953, center: [43.399847239012466 35.885693802835426 16.495239663884455]
cid: 524, volume: 280.71973273151855, center: [44.45737878018831 29.141110932010946 39.95252734883721]
cid: 525, volume: 174.6733188498002, center: [43.25713983861818 51.453666257639824 7.6793385705399295]
cid: 526, volume: 302.36047498280965, center: [44.533972113718924 29.66309894137467 24.243273283361972]
cid: 527, volume: 78.14837976862384, center: [42.319739890507066 25.251161207862406 42.5804274078624]
cid: 528, volume: 196.86750388309198, center: [43.88006184894202 45.06925610501434 49.360715219690185]
cid: 529, volume: 128.36484117219393, center: [41.90600318188121 26.586782997448303 62.20556791903211]
cid: 530, volume: 166.58627738219872, center: [43.43200241004613 18.35935103476846 37.49965391170927]
cid: 531, volume: 135.5708920888556, center: [42.92084940910491 49.962553907989665 49.1829866602516]
cid: 532, volume: 178.97661884862165, center: [44.168434902711006 68.02579405494131 28.48576846965796]
cid: 533, volume: 225.21732802230946, center: [44.19169297452329 67.67149626875627 40.894124393119355]
cid: 534, volume: 98.27562543240295, center: [42.38172276473181 1.302104472152626 51.13598141273417]
cid: 535, volume: 186.3182067731202, center: [43.59945116480518 37.24095986578564 53.74235515437682]
cid: 536, volume: 134.61083828334424, center: [43.39281971543049 61.91938036277899 15.172444159607316]
cid: 537, volume: 294.0023594995344, center: [45.651080137319305 55.41716243262389 44.51698430058394]
cid: 538, volume: 216.18152749984972, center: [45.06499534013548 23.407780860721005 52.04486142582027]
cid: 539, volume: 293.75387498516676, center: [45.799778153383066 28.47990094979237 32.93027160339895]
cid: 540, volume: 107.05164668984199, center: [43.051348011657176 24.413865853492297 45.26380391399029]
cid: 541, volume: 184.6691731777713, center: [45.23642880060919 13.853471423009173 45.35741058056269]
cid: 542, volume: 128.34225167088778, center: [43.92723609456386 38.003685762439495 50.23330298678166]
cid: 543, volume: 156.92926557381986, center: [42.99427885190476 41.27763112247013 56.60067494450842]
cid: 544, volume: 167.5689206890162, center: [43.73096158625647 44.61983978566999 60.93703794778916]
cid: 545, volume: 154.16205166381656, center: [44.56374156969478 59.1913293957799 12.787664566034142]
cid: 546, volume: 237.99169101093696, center: [46.24353692387173 45.23734364639552 33.7948949964501]
cid: 547, volume: 124.49074169818932, center: [43.347910595721345 60.14302485470876 50.78775898610053]
cid: 548, volume: 214.73579941625616, center: [45.284838590026766 27.63552913902798 27.758384275489163]
cid: 549, volume: 61.353085547501756, center: [43.44567809044449 55.88891069705449 56.24936499064801]
cid: 550, volume: 6.9801559036001635, center: [42.049897059340175 46.15032549514563 63.520410703236244]
cid: 551, volume: 233.3269589912171, center: [44.795957220692365 26.659628667363734 17.991300315432277]
cid: 552, volume: 252.14401357923956, center: [45.048661543413026 23.011904717013078 22.774476723759182]
cid: 553, volume: 182.07138052756412, center: [45.15932119895099 19.51376779475186 31.805465788387096]
cid: 554, volume: 66.42442859073229, center: [44.17708823561126 29.96727435215099 44.49345297728277]
cid: 555, volume: 141.87336295327128, center: [44.633483779613115 27.983007050712523 50.80460068395828]
cid: 556, volume: 58.179260613987765, center: [43.17054784067092 56.96625396963696 53.722432897689764]
cid: 557, volume: 206.8068844577977, center: [44.490386600796946 44.57112089652649 8.636108199847078]
cid: 558, volume: 208.98677133384112, center: [44.812108993600155 61.25283520765281 28.53098926745933]
cid: 559, volume: 228.76387972737493, center: [46.06638549096578 59.477545084921495 37.514288500612224]
cid: 560, volume: 228.78646922868109, center: [47.61867989454276 32.657704670645735 40.91455058083531]
cid: 561, volume: 194.3148902354971, center: [44.8013839063815 32.65321398596838 55.8556820027668]
cid: 562, volume: 42.24236744249937, center: [43.54461241858264 59.79253739363636 63.158213328181816]
cid: 563, volume: 227.25038313986292, center: [44.56650726299202 36.86379785335984 10.58512590246521]
cid: 564, volume: 198.57301123170626, center: [43.88140255578994 43.8926585745862 23.809036471110858]
cid: 565, volume: 82.41779551548606, center: [44.68339935063832 29.480341570727695 46.33493877497602]
cid: 566, volume: 150.35572069373038, center: [44.82068197850978 8.5173344691256 46.456429340054086]
cid: 567, volume: 117.51058579458916, center: [45.65238555587312 18.68230997712418 52.331952518627446]
cid: 568, volume: 7.488419682988525, center: [42.54720996763716 9.210711605128203 63.44667951282051]
cid: 569, volume: 153.93615665075507, center: [44.90050118278352 42.53608318915548 18.68619755243965]
cid: 570, volume: 162.1700298768465, center: [44.57191867084452 37.29896903575707 29.141984701490454]
cid: 571, volume: 267.5387587193804, center: [46.389348134776114 35.63749772923544 45.582091510119476]
cid: 572, volume: 44.00434854437902, center: [44.23040928996159 34.244477661498976 49.05552082176591]
cid: 573, volume: 62.81010838174839, center: [44.967304387875984 28.828214294119757 48.38876862841215]
cid: 574, volume: 168.291784730813, center: [46.869419975758504 16.943962016 55.214964054]
cid: 575, volume: 194.2245322302725, center: [46.26097104723069 36.68292323429868 59.684519872214466]
cid: 576, volume: 106.58856191306592, center: [44.95256960474896 51.344345954074385 57.26747144291618]
cid: 577, volume: 148.23230757095234, center: [45.27835083991408 5.008190624870466 57.99317801683938]
cid: 578, volume: 162.1700298768465, center: [45.42950921714472 46.56229095791893 14.133147581961275]
cid: 579, volume: 293.88941199300365, center: [45.90058626694909 44.56159287039969 29.24690297295926]
cid: 580, volume: 122.59322358847277, center: [45.1607212446413 40.54952415233094 47.73703893243044]
cid: 581, volume: 106.06900338302448, center: [45.33887996084571 32.81458144189117 51.07563360715579]
cid: 582, volume: 127.94693539803018, center: [45.80928759100859 8.346362902189265 53.93610948358051]
cid: 583, volume: 194.00993196786408, center: [47.23376535551608 55.915729677836644 39.83449276574489]
cid: 584, volume: 86.2015369842661, center: [45.329413940970504 52.636674607966455 54.015737317845904]
cid: 585, volume: 129.4604319855422, center: [45.469520011568896 40.103378814639676 62.24533065021811]
cid: 586, volume: 106.81445692612742, center: [45.10995543558035 53.73196797411441 60.23351327482288]
cid: 587, volume: 275.6032106856757, center: [47.72653701619031 31.72305199770501 15.714715120945863]
cid: 588, volume: 101.72052438159072, center: [46.63896315501671 50.51055558756384 46.414683168532086]
cid: 589, volume: 215.31183169956296, center: [46.358840618419144 53.306016658668625 10.613900386539369]
cid: 590, volume: 247.46798680886664, center: [47.3448929898265 3.457353250397079 51.52638632575993]
cid: 591, volume: 89.48830942431083, center: [46.14163605039099 12.88599026303168 52.00529628138331]
cid: 592, volume: 71.14563436371752, center: [45.90185758548403 55.160877606604224 62.90843212522623]
cid: 593, volume: 160.55488053345684, center: [46.15289056681549 64.22955327745339 20.499453210805488]
cid: 594, volume: 332.2915642134576, center: [47.02446609014561 57.581698374867436 33.11746556618627]
cid: 595, volume: 39.36220602596532, center: [47.04299245870086 21.937101811707315 63.33196433268292]
cid: 596, volume: 175.22676163180085, center: [48.05295283851906 47.046747894753125 45.35787381837051]
cid: 597, volume: 133.40229996346525, center: [47.21813882136106 54.31511595465244 51.16591724165608]
cid: 598, volume: 191.0620020474116, center: [47.62307447758567 21.954855155107587 56.2845453672263]
cid: 599, volume: 222.4839983642654, center: [47.15753083310686 8.562615798456696 59.97630677224083]
cid: 600, volume: 198.61819023431855, center: [47.89064075159672 66.27984805266989 32.65983793195337]
cid: 601, volume: 237.53990098481395, center: [46.36921484318993 47.393216963149634 38.7187325274024]
cid: 602, volume: 192.9821096584343, center: [47.11538982980327 62.94256770151001 45.406127392965]
cid: 603, volume: 162.99454667452096, center: [47.17137055914963 27.77672294129305 56.087969965255354]
cid: 604, volume: 248.07790334413266, center: [48.44406214580237 57.42489387136223 27.198599474148605]
cid: 605, volume: 250.3368534747476, center: [48.488688640353544 37.76256799318715 20.968473859474823]
cid: 606, volume: 290.98666107516345, center: [47.00079791851199 40.45880628194698 36.394126597484764]
cid: 607, volume: 89.38665666843316, center: [47.25105159077302 21.398528011448064 43.612704491508715]
cid: 608, volume: 137.42323119595986, center: [47.767964937404905 58.03841040461905 48.80320724005917]
cid: 609, volume: 147.5659172824209, center: [47.92061151682457 31.56791279736701 59.696164330853414]
cid: 610, volume: 241.93355898886003, center: [49.04522730982502 47.528588375873014 20.65793376825397]
cid: 611, volume: 273.5927450694284, center: [49.262107342460936 34.546738978830035 24.01789058637658]
cid: 612, volume: 9.54406430184812, center: [44.718898107633855 13.06567743408284 63.363771986508866]
cid: 613, volume: 218.0564561082601, center: [49.53952805018088 23.2408146106081 28.22121154366518]
cid: 614, volume: 142.95765901596644, center: [48.74855302069154 41.85106617070396 45.55784384152643]
cid: 615, volume: 99.15661598334277, center: [47.45079928852873 11.615868793416105 55.486554260667496]
cid: 616, volume: 132.01304563313707, center: [48.563956005501566 13.100754235198494 58.081715182631754]
cid: 617, volume: 92.19904958104875, center: [47.24480075017547 48.816797929486704 59.910960415362]
cid: 618, volume: 40.68369185237506, center: [47.73732944463951 18.247499655968905 63.20665292365352]
cid: 619, volume: 243.75201384400506, center: [49.17879696812082 63.95690179751633 25.12991051186692]
cid: 620, volume: 346.9860348131078, center: [49.12081045786329 32.8861333717392 30.0536465931773]
cid: 621, volume: 141.20697266473988, center: [47.611456517150636 22.733447917421213 40.37790716806911]
cid: 622, volume: 94.86461073517438, center: [47.280232272694725 19.074413026526965 45.19932892418145]
cid: 623, volume: 100.31997530060947, center: [48.79632927292154 15.20562979981986 61.41284902290024]
cid: 624, volume: 104.29572753049176, center: [48.0097381704088 26.942905662594757 62.176034820922666]
cid: 625, volume: 96.32163356942102, center: [47.64819487782862 47.191455934615384 54.50452294631801]
cid: 626, volume: 135.04003880816109, center: [48.935213463718675 17.80273118718635 59.75777258312144]
cid: 627, volume: 123.90341466422943, center: [48.819023530366636 23.276682037593435 36.73167356960802]
cid: 628, volume: 184.3642149101383, center: [49.09643081845131 23.37154352350671 60.454918297714876]
cid: 629, volume: 42.36660969968319, center: [48.59557875846295 30.096697181498264 62.89808597856571]
cid: 630, volume: 209.09971884037188, center: [49.222776435419725 42.422765300091825 17.21225878494031]
cid: 631, volume: 95.51970627305272, center: [48.553904499623584 1.1962353527492018 56.885596317937804]
cid: 632, volume: 175.3058248863724, center: [48.81977201691144 59.07616055312157 17.842066819496164]
cid: 633, volume: 5.082637793883614, center: [46.73807563018192 15.080117557333333 63.540642733333335]
cid: 634, volume: 170.13282908726418, center: [48.57062099161151 49.716921841293235 25.814275799761003]
cid: 635, volume: 182.60223380825863, center: [48.85416465933729 51.16348707507886 30.933710228601466]
cid: 636, volume: 217.17546555732028, center: [49.939292863596656 64.56439992990431 37.49510209563137]
cid: 637, volume: 199.44270703199302, center: [50.43902741774854 38.191860089341944 41.60757085432098]
cid: 638, volume: 73.79990076719008, center: [48.91318076446002 12.063168271349863 47.86592655096418]
cid: 639, volume: 129.2232422218276, center: [49.163992364391106 8.048922348291233 49.98221144249628]
cid: 640, volume: 187.5267450929992, center: [49.86334075186265 48.605225487478165 51.07918722726013]
cid: 641, volume: 55.53628896116829, center: [48.29147939838493 46.53173617575757 56.8684984969697]
cid: 642, volume: 258.08505242275686, center: [51.49935893476864 43.78702324784245 41.8600249742407]
cid: 643, volume: 190.7909280317378, center: [50.32979335404743 45.136750133696424 12.399208735129054]
cid: 644, volume: 191.1410653019831, center: [49.97439068250256 53.09297408564675 14.178423359971635]
cid: 645, volume: 210.09365689784246, center: [51.151082977430065 43.19194116155045 24.107682840793505]
cid: 646, volume: 149.79098316107664, center: [49.24912359710343 41.908372197270396 57.350751117191976]
cid: 647, volume: 213.50467159507102, center: [52.26313519014839 39.201581786510076 26.716870255758344]
cid: 648, volume: 162.11355612358113, center: [49.956036690220245 20.044791359869016 48.950549685668506]
cid: 649, volume: 124.80699471647542, center: [49.59634886883328 41.07582995046154 53.481238116]
cid: 650, volume: 227.3972148983529, center: [51.19800299961669 39.59180030629315 14.154619618904286]
cid: 651, volume: 153.16811360634597, center: [50.811744735805156 33.45391661032372 35.08213995596195]
cid: 652, volume: 81.02854118515788, center: [49.61822414267806 26.37769900805687 44.437138648815164]
cid: 653, volume: 113.35411755425767, center: [50.09044404323632 25.44937350571941 47.69923995310881]
cid: 654, volume: 98.27562543240295, center: [50.787958252952066 24.018431173198483 34.07767919783932]
cid: 655, volume: 220.93661752479417, center: [51.33343346506066 50.56076739090025 41.46942331872604]
cid: 656, volume: 230.7856400942753, center: [52.18882857522412 52.355949974511816 37.13123254554886]
cid: 657, volume: 108.30536401233327, center: [50.42807580795353 41.31997286766086 50.322244037230156]
cid: 658, volume: 94.92108448843976, center: [50.8377837797191 31.276209482651115 47.59544838269871]
cid: 659, volume: 113.7381390764622, center: [50.58535044252478 35.13105567682224 54.15260086476663]
cid: 660, volume: 186.9507128096924, center: [51.124435792597005 41.65656572373127 60.497335981452395]
cid: 661, volume: 133.820205737629, center: [51.22610233529817 28.228468030013502 42.13810016725186]
cid: 662, volume: 209.11101359102494, center: [52.20579387564348 57.331472616193146 20.93003266226639]
cid: 663, volume: 201.38540414432185, center: [52.618163574043 36.91542028439709 36.39416562213124]
cid: 664, volume: 199.82672855419756, center: [51.39428496521269 60.17354431207325 43.953168243251184]
cid: 665, volume: 178.8297870901317, center: [51.90001715742311 15.74887312201099 51.33368757799532]
cid: 666, volume: 104.83787556183934, center: [51.05781524783493 35.70850521794872 50.308324196337]
cid: 667, volume: 93.81419892443844, center: [51.34021813066206 30.663663994654463 50.58257235629665]
cid: 668, volume: 228.74129022606877, center: [51.92729523835213 28.38847585296267 22.21666023254987]
cid: 669, volume: 296.19354112623085, center: [53.90454098319803 41.346184925 31.82064941590909]
cid: 670, volume: 169.47773354938585, center: [52.55235645272357 54.49083117583472 46.992069067430855]
cid: 671, volume: 122.17531781430901, center: [52.94947619407499 32.71302724528057 44.196692995044835]
cid: 672, volume: 104.13760102134871, center: [51.78571075622845 30.15360838373102 54.20209901255966]
cid: 673, volume: 124.76181571386311, center: [51.893511718599285 25.40449684626109 51.31818736894803]
cid: 674, volume: 92.4023550928041, center: [52.167268959356655 35.46490894042293 57.195032623835715]
cid: 675, volume: 286.6607715750358, center: [54.05722186891859 35.770178612695034 19.240176869464143]
cid: 676, volume: 126.09459629092592, center: [52.254038993118265 10.825771138713723 52.34467747149767]
cid: 677, volume: 119.28386164712188, center: [51.855062632455414 5.662343271394755 55.5553070757504]
cid: 678, volume: 134.12516400526204, center: [53.38518697904017 44.13412435951158 27.780395403789473]
cid: 679, volume: 233.89169652387085, center: [54.18264780899596 29.148253447382654 37.676100412970825]
cid: 680, volume: 220.62036450650808, center: [53.30187090335531 49.270863637249775 17.19813216884247]
cid: 681, volume: 275.5128526804511, center: [53.83415859724345 47.19794257778871 35.88480661962038]
cid: 682, volume: 243.30022381788206, center: [54.000687647141056 49.539995286551225 30.436946172536096]
cid: 683, volume: 261.2701721069239, center: [54.13865162810671 60.83309938137644 30.44493192721771]
cid: 684, volume: 174.78626635633094, center: [52.03816046749213 56.2705133547399 33.11795315751858]
cid: 685, volume: 71.87979315616738, center: [52.81613906419827 43.79900371951603 49.04963116008799]
cid: 686, volume: 136.29375613065238, center: [53.42652674220877 26.006960423667852 55.85716330347228]
cid: 687, volume: 192.33830887120902, center: [53.077564378977506 51.418297883821715 25.637244823078277]
cid: 688, volume: 285.7233072708306, center: [54.86016609096879 28.080937409511012 32.00857536802783]
cid: 689, volume: 196.3705348543567, center: [55.30417260855341 52.106561683596 45.02180689707811]
cid: 690, volume: 191.88651884508604, center: [54.45906097302315 41.86028306411207 36.83979258604979]
cid: 691, volume: 109.2315335658854, center: [53.925028109493155 37.99319738194602 46.70944341482783]
cid: 692, volume: 181.7325380079719, center: [54.26429709196588 20.64456827869484 54.89083343991298]
cid: 693, volume: 75.4828186144982, center: [53.73211844979794 30.976912223881488 57.43478461708813]
cid: 694, volume: 208.5575708090243, center: [55.0454472890987 29.628853466298402 26.10647683542919]
cid: 695, volume: 215.8765692322167, center: [54.54404393851921 60.255371472526555 36.74975949431277]
cid: 696, volume: 172.7193269868183, center: [54.772807072507646 15.078008516910803 56.64602472467957]
cid: 697, volume: 74.80513357531372, center: [53.883722837581075 7.043594524686698 58.24173154117469]
cid: 698, volume: 125.36043749847607, center: [54.38700156731636 34.337371552175874 60.63985207663753]
cid: 699, volume: 143.48851229666096, center: [54.28116012847457 34.89659017618073 30.26971878438287]
cid: 700, volume: 74.13874328678232, center: [54.22983866009406 10.58271053583181 55.71043146578305]
cid: 701, volume: 15.247913381650841, center: [52.978617113881356 17.323904120444446 63.3074735162963]
cid: 702, volume: 252.32472958968876, center: [56.196980577965064 46.89350335726947 45.6550449598478]
cid: 703, volume: 115.43235167442342, center: [55.305453117467884 23.570210245812135 58.66260747645793]
cid: 704, volume: 223.07132539822527, center: [55.87574020175414 56.76553365796456 40.36727749478481]
cid: 705, volume: 108.6555012825786, center: [54.87093772462656 10.709015872827443 60.014857537234924]
cid: 706, volume: 252.50544560013793, center: [56.429028277217554 50.422416360842725 22.300836671542314]
cid: 707, volume: 151.16894274075176, center: [55.224330620071534 57.545168805020914 25.74282771167065]
cid: 708, volume: 192.92563590516892, center: [55.76614522642837 19.188240401686084 60.822237830232424]
cid: 709, volume: 191.1410653019831, center: [56.47722914214377 35.56918548981859 41.91316653720971]
cid: 710, volume: 276.83433850686083, center: [56.443664083680645 42.950489932892694 20.26375626980008]
cid: 711, volume: 170.20059759118263, center: [57.11764763424181 41.3201299330148 44.64089172274205]
cid: 712, volume: 151.7336802734055, center: [57.57224673767493 35.942577262021736 24.43453868200089]
cid: 713, volume: 193.35483642998574, center: [58.19801785088363 53.7508873980139 28.690293454617674]
cid: 714, volume: 249.99801095515537, center: [58.72438997140865 53.53951668878648 34.58811868494624]
cid: 715, volume: 243.76330859465813, center: [58.795312961725365 34.91945048376425 36.54964219639515]
cid: 716, volume: 238.03687001354925, center: [59.12236724487917 49.57668427639383 40.012528069845786]
cid: 717, volume: 186.08101700940566, center: [58.87809085185137 34.24715164451593 28.996278467823974]
cid: 718, volume: 220.5638907532427, center: [59.644998069439126 47.43876400230438 27.563664515014338]
cid: 719, volume: 128.74886269439847, center: [59.851097045840504 40.123041363681025 39.38231670032459]
cid: 720, volume: 221.8966713303055, center: [59.852514787324715 41.32602248805863 27.084580760724826]
cid: 721, volume: 201.17080388191343, center: [60.460890652187224 38.521451461321654 32.91599817684577]
cid: 722, volume: 224.65259048965575, center: [60.47354353961443 43.898601997264954 38.2344505391453]
cid: 723, volume: 220.81237526761035, center: [60.69324093658216 46.12481903008696 32.74185014365217]