cid: 2, volume: 3.5870493789366953, center: [0.48867530185433405 0.3876453552631579 36.6606784618421]
cid: 3, volume: 19.901830984012804, center: [1.3681478820774664 0.6743329837944665 53.81219554980237]
cid: 4, volume: 34.04550375446934, center: [1.3997787410776261 0.9034853096118299 63.0713193431146]
cid: 5, volume: 166.54607335712217, center: [1.8858036245781047 2.4826813124220672 12.404171996599283]
cid: 6, volume: 47.16655279847462, center: [0.8190733316567583 3.387332521981321 43.85790256821215]
cid: 7, volume: 204.446081926677, center: [2.6699799101897117 3.841879638445556 33.87763809781455]
cid: 8, volume: 117.71185725089629, center: [1.9715659654336455 2.2349401830392943 49.939807297834804]
cid: 9, volume: 9.596930355927123, center: [0.4235522372313298 3.699973816229508 28.023997717868852]
cid: 10, volume: 55.237413901082185, center: [1.456514262863469 3.6406564540586728 54.96585702902307]
cid: 11, volume: 307.58948424382163, center: [1.8284966403536496 7.949308605692804 6.887696645220194]
cid: 12, volume: 151.0651234059217, center: [1.7368427823737442 7.92454244284524 16.23049250595709]
cid: 13, volume: 137.84967832562862, center: [2.5687908767935284 8.719469761081944 44.80015866560146]
cid: 14, volume: 67.0998491279167, center: [1.520116660236506 9.458054210504104 1.229935130644783]
cid: 15, volume: 109.57806545743018, center: [1.2925633132674017 9.350743666432162 33.75190439155779]
cid: 16, volume: 127.37171829768195, center: [1.905346614067299 8.680813151420455 49.098083982361665]
cid: 17, volume: 191.41942891895954, center: [2.391124419490755 11.52909427527739 20.625176302210896]
cid: 18, volume: 104.90546166118371, center: [1.5518318632799986 11.44280593429814 39.969629107918415]
cid: 19, volume: 118.95473839535244, center: [2.2326014526509104 13.610400827152493 27.707361803385798]
cid: 20, volume: 301.4380092123995, center: [2.124973618805732 14.223649792813154 12.745677017426932]
cid: 21, volume: 47.27668150747706, center: [1.3324553819938036 15.482401861797005 32.267489135640595]
cid: 22, volume: 103.66258051672757, center: [2.4478112450963287 13.698437731188346 45.76081563373805]
cid: 23, volume: 34.076969099898605, center: [0.8168552963238527 14.97275547797784 50.6149838700831]
cid: 24, volume: 195.2267357159011, center: [3.043390087023809 16.5636399651785 39.670853030759936]
cid: 25, volume: 189.5000428477741, center: [2.444532297926491 17.394703134968868 5.2654992526774596]
cid: 26, volume: 119.64697599479635, center: [1.8400660218361193 17.20242701913215 24.55319684295858]
cid: 27, volume: 85.22388809517578, center: [1.6746487103444179 17.855954592449695 61.74123146101163]
cid: 28, volume: 24.385642707683676, center: [1.126773286431118 17.051466510580646 46.49039612632259]
cid: 29, volume: 39.01702833229388, center: [0.5329285307071704 18.162173901290323 17.713670498830645]
cid: 30, volume: 47.48120625276731, center: [0.6582708223081558 16.86036604473161 55.31564936769384]
cid: 31, volume: 115.43061970727427, center: [1.2148912133751308 21.677580528035982 2.854188365176503]
cid: 32, volume: 304.60027642804107, center: [3.243488716195341 21.12724940465885 37.420915017390634]
cid: 33, volume: 344.07355226905935, center: [2.324401810795948 23.654439594650206 11.818022787599451]
cid: 34, volume: 8.4956432659027, center: [0.7802344637962091 21.98617428388889 50.11453048777778]
cid: 35, volume: 32.83408795544247, center: [0.6246660114569881 22.14897862884523 21.842908161907044]
cid: 36, volume: 40.653226294615884, center: [1.5391913948285945 23.16554132263932 31.985095045820433]
cid: 37, volume: 55.0643545012212, center: [1.3727972120364569 24.401016525000003 34.891444923]
cid: 38, volume: 18.265633021690803, center: [0.5748588969727164 22.59925980232558 54.62162545271318]
cid: 39, volume: 288.1281680958186, center: [3.2576734959019795 23.778300095746424 26.46821796334498]
cid: 40, volume: 99.80807570164208, center: [1.0427698984076146 26.22051758691677 44.09978969612232]
cid: 41, volume: 10.304900628085681, center: [0.5133249570395332 27.02279268687023 0.7188413688549619]
cid: 42, volume: 137.86541099834326, center: [2.1085949287972237 29.469146319924683 21.407694536323177]
cid: 43, volume: 8.369781884185622, center: [0.7960899953999317 27.414581585526317 65.38016493157895]
cid: 44, volume: 154.25885596699254, center: [1.6235768776768262 29.055986626384495 6.403608706415094]
cid: 45, volume: 58.52554249844082, center: [1.2515183008431359 28.712569373870966 26.967801502419356]
cid: 46, volume: 116.24871868843528, center: [2.453407756336759 29.807276556151034 32.18988830389769]
cid: 47, volume: 109.34207536671067, center: [1.631128010690379 29.977549829223022 15.953397802748201]
cid: 48, volume: 53.4281565388992, center: [1.8219100403501889 30.817614805565373 35.65018551969965]
cid: 49, volume: 31.9845236288522, center: [0.5110431021158247 32.22060766497786 13.03094398317757]
cid: 50, volume: 17.43180136781517, center: [0.7233030680208149 29.42551390261733 58.68569012761733]
cid: 51, volume: 45.53035483615262, center: [1.6140293534402699 32.170789590186594 0.9393404129232896]
cid: 52, volume: 20.232217111020134, center: [0.73558017219463 31.68572467604977 56.042633828771386]
cid: 53, volume: 182.48327081704707, center: [1.9595883817440114 30.769405749668074 51.06074256807483]
cid: 54, volume: 160.25300427126834, center: [2.08177351299777 34.199830352886316 40.87738019502258]
cid: 55, volume: 21.774019037054327, center: [0.6421328251870899 33.55180549010115 34.04411305426301]
cid: 56, volume: 32.25197906500099, center: [0.6278093345996937 37.226351880439026 48.22583954795122]
cid: 57, volume: 43.15472125624279, center: [1.0633707327845683 36.93434788600073 1.7698304375501275]
cid: 58, volume: 64.45676011185807, center: [1.0622650505510012 36.635456182230904 60.78655917737369]
cid: 59, volume: 166.16848921197095, center: [2.5399079638903266 39.321300518452944 33.93484982669949]
cid: 60, volume: 20.987385401322594, center: [0.4883060941040516 39.86998785944528 3.735935413493253]
cid: 61, volume: 21.31777152832992, center: [0.7301718007955333 39.41474981667897 19.09463256885609]
cid: 62, volume: 54.088928792913855, center: [1.2474445877941305 38.94431326064573 27.487940546945897]
cid: 63, volume: 62.80482947682144, center: [1.3847470956724242 39.57140849278557 39.10807730636272]
cid: 64, volume: 50.659206141123505, center: [2.5264121152284176 40.39315820934783 65.09743553999999]
cid: 65, volume: 188.61901317575456, center: [2.0632699718359517 41.61848998338477 44.59515505485862]
cid: 66, volume: 15.575345987488282, center: [0.5908528649693312 42.39306691454546 28.69138052878788]
cid: 67, volume: 102.90741222642511, center: [1.6730996579873112 43.98876502712123 50.375561002308515]
cid: 68, volume: 102.8130161901373, center: [1.7676356812676162 42.316407747773525 61.188486013772]
cid: 69, volume: 71.42633412444121, center: [1.2729644968956904 44.00639183253304 20.662376119030835]
cid: 70, volume: 146.7071730639679, center: [1.6740331664928174 45.01745634595174 3.1852683737694374]
cid: 71, volume: 156.9176776557658, center: [1.4846003801089325 45.86631262889513 38.520169920643674]
cid: 72, volume: 75.3280369576706, center: [0.9369025073890791 48.25177801973685 16.112901517982458]
cid: 73, volume: 162.03079628802203, center: [1.7876862505626938 48.777928074046024 45.16671401826391]
cid: 74, volume: 66.3761461830435, center: [1.397213555872141 48.97330112396302 9.94644406710121]
cid: 75, volume: 12.995187662288204, center: [0.8935040921257036 48.910007171186436 5.996292561864407]
cid: 76, volume: 21.632424982622616, center: [0.8552944149288335 49.78965638945455 1.2353187442909093]
cid: 77, volume: 8.46417792047343, center: [0.43213069311885466 50.18981577379182 33.6865516795539]
cid: 78, volume: 46.50578054445996, center: [1.0519668803670972 51.0028746864682 28.148727511907985]
cid: 79, volume: 77.93966062829995, center: [1.2986939280147707 51.74383588631409 5.386829234557934]
cid: 80, volume: 38.34052340556459, center: [0.7463588052363517 52.16397797369717 40.72420737525646]
cid: 81, volume: 4.027564214946465, center: [0.3349872801558669 54.316713002343754 17.020659575390624]
cid: 82, volume: 5.585098813695293, center: [0.623382114573546 53.112119020563384 0.5311287346478873]
cid: 83, volume: 110.33323374773265, center: [1.0586978178290447 55.220511250463424 13.37943147510338]
cid: 84, volume: 47.968919106920985, center: [1.0746217529973894 54.310960092554936 25.878006041325026]
cid: 85, volume: 10.289167955371047, center: [1.142913499446357 55.92643708027523 0.5364744449541284]
cid: 86, volume: 42.21076089336471, center: [0.5952803221270286 54.9126644172568 34.634723494819234]
cid: 87, volume: 29.23130590379114, center: [1.2401756825689003 56.92261174666308 23.67680474063509]
cid: 88, volume: 10.43076200980276, center: [0.40921137348068604 59.315958264705884 31.61134390361991]
cid: 89, volume: 84.02820496886355, center: [1.1466503896608446 59.95930578558322 2.5477479786369592]
cid: 90, volume: 100.09126381050551, center: [1.9781118059129261 61.20549142973908 8.324044501886199]
cid: 91, volume: 19.71303891143719, center: [1.0012360597029308 61.91372727150838 14.765578362569833]
cid: 92, volume: 77.07436362899504, center: [2.3892688047112935 40.19449219216167 21.71634900753215]
cid: 93, volume: 174.44387505986876, center: [2.1989045588380374 44.49488150549242 9.99042248806818]
cid: 94, volume: 89.75489783699055, center: [1.5345949683242477 60.719473723435584 24.020788041349693]
cid: 95, volume: 267.9903470210863, center: [2.965326994901554 3.7907981088939766 23.57346019855583]
cid: 96, volume: 168.76438020988567, center: [2.6235171228019114 3.0358633073925607 39.33409433120164]
cid: 97, volume: 169.58247919104667, center: [2.6332431169501147 9.693876878931254 53.69233513434455]
cid: 98, volume: 129.87321325930887, center: [3.7537148736440233 15.588448136111449 1.7350562980738946]
cid: 99, volume: 38.05733529670117, center: [1.9432944941936208 28.546734826953287 55.675388967011166]
cid: 100, volume: 122.68338182872084, center: [3.0312537668418846 31.685308307989228 64.60771406741472]
cid: 101, volume: 36.29527595266209, center: [1.092925817681528 61.25464456280884 18.61628897321196]
cid: 102, volume: 112.17395645534491, center: [2.551664788853547 3.0667586372230016 1.5636930568863956]
cid: 103, volume: 170.98268706264915, center: [2.7997857769723247 7.841476552613176 58.61072088723776]
cid: 104, volume: 52.78311695759918, center: [1.5660776964213208 24.644938165126675 52.73531404470939]
cid: 105, volume: 121.58209473869641, center: [1.7264031814697258 34.81514036766304 6.8446127415760865]
cid: 106, volume: 175.12037998659807, center: [3.498212753856072 15.54964652498428 64.26385022482256]
cid: 107, volume: 123.58014417345501, center: [2.978543283580373 18.8994295755697 57.27717843907066]
cid: 108, volume: 118.1681047596207, center: [2.2267019428150294 38.65262551537745 14.692690296738117]
cid: 109, volume: 162.80169725103914, center: [2.9472821509601324 2.0216746689891765 18.943866298898335]
cid: 110, volume: 36.767256134101125, center: [3.377462408898363 2.0085358451861364 65.2125495521181]
cid: 111, volume: 252.54086241531508, center: [3.0550931837339816 7.997356478806379 63.80155696749315]
cid: 112, volume: 245.60275374816118, center: [1.977902350911575 24.49483415882391 60.90322292559733]
cid: 113, volume: 128.9292528964308, center: [3.162881182953953 28.15079924884686 37.50502891592434]
cid: 114, volume: 194.73902286174743, center: [3.5012714998247656 32.2939232015269 44.352855657198255]
cid: 115, volume: 59.09191871616767, center: [2.5596291316455857 34.083214023881794 54.4380479172524]
cid: 116, volume: 114.26640192639131, center: [2.132056137405346 59.391004509871955 28.760668161214376]
cid: 117, volume: 42.54114702037204, center: [2.144113261675312 22.611928054992603 65.14472988195267]
cid: 118, volume: 127.57624304297221, center: [2.3193887516011067 39.51814392867185 9.074830829522751]
cid: 119, volume: 5.474970104692851, center: [1.89137775159057 41.10462537155172 0.40558964913793105]
cid: 120, volume: 140.82315346869456, center: [2.480908288375486 52.10324444344766 21.009229425628423]
cid: 121, volume: 252.4621990517419, center: [3.4593810061502164 8.38255470547766 26.31869888399701]
cid: 122, volume: 41.12520647605492, center: [2.3582236110022987 31.918217582019896 57.49299654032135]
cid: 123, volume: 156.93341032848042, center: [2.4570528214315535 33.32380710631579 26.367965976210524]
cid: 124, volume: 92.7283729800565, center: [2.341891276693151 43.87812030071259 24.589754623396676]
cid: 125, volume: 215.69494291764076, center: [4.147162537792568 2.856223208555799 58.36565313881838]
cid: 126, volume: 269.0444360929668, center: [4.098348065628842 19.866954798198936 29.998738397953336]
cid: 127, volume: 254.57037719550294, center: [3.6899641764920683 20.582197084086275 43.754548389926455]
cid: 128, volume: 117.19267905131335, center: [2.1095878826981815 35.57196977080145 22.464951703181637]
cid: 129, volume: 85.4598781858953, center: [2.4566045115834707 56.3016030943299 20.13061429291237]
cid: 130, volume: 125.01181739048675, center: [3.4050292357140948 1.3629349203624466 5.307848862006042]
cid: 131, volume: 20.232217111020134, center: [1.985878860429926 0.5616884190513219 45.28391597939346]
cid: 132, volume: 194.23557733487914, center: [4.290656491755796 8.687913205451158 38.08533322958043]
cid: 133, volume: 24.464306071256846, center: [2.5344576572609068 26.09382414790997 55.64960120257235]
cid: 134, volume: 155.48600443873403, center: [3.649704757604544 36.128880866427195 36.27359400191238]
cid: 135, volume: 157.23233111005848, center: [3.2960454890049298 47.785296192415444 29.530268427766657]
cid: 136, volume: 117.14548103316945, center: [3.625164771382348 48.633783896454474 19.794502894601127]
cid: 137, volume: 166.89219215684415, center: [2.6030367173527127 55.322578583936654 5.109909128082579]
cid: 138, volume: 239.12089258973174, center: [3.4229483724076166 13.06604104150931 58.829951685156914]
cid: 139, volume: 142.80547023073854, center: [3.9826270458707262 26.48219042746502 2.6138354778230695]
cid: 140, volume: 157.43685585534874, center: [3.564919297226777 33.727020094673726 12.147874397681624]
cid: 141, volume: 178.12532047509328, center: [3.5480483084473877 34.952366448410174 18.178101386036037]
cid: 142, volume: 263.9155847879959, center: [4.27189595848331 42.30001242205663 31.029136273055144]
cid: 143, volume: 16.503573677651726, center: [2.1855310796645564 51.24189853412774 13.457256827073403]
cid: 144, volume: 362.60664072689895, center: [4.437007516595672 19.422516655879036 19.190840117572023]
cid: 145, volume: 163.90298434106356, center: [4.319165663396639 27.414393993213668 42.62748552514878]
cid: 146, volume: 177.8263996935152, center: [3.6147867119208756 42.266732177952754 14.679720829133858]
cid: 147, volume: 86.04198707633678, center: [2.8952409073015586 54.5957633177729 29.996065764399344]
cid: 148, volume: 53.0191070483187, center: [4.076743362613292 3.5271398082195846 48.539598235014836]
cid: 149, volume: 278.73576248518174, center: [4.663883396632323 25.34506872955354 20.272200151363098]
cid: 150, volume: 245.9174072024539, center: [4.635355173788326 38.23287965441111 47.3370681335871]
cid: 151, volume: 7.598880921168526, center: [2.9175447485630084 49.845895669565216 6.673512152173913]
cid: 152, volume: 372.8643433368407, center: [3.2393814765189535 59.24598470505063 34.85007934640506]
cid: 153, volume: 166.98658819313195, center: [5.113118508137438 3.1142855574053137 28.966723969756924]
cid: 154, volume: 118.45129286848412, center: [4.422860465114277 30.96353585175986 4.7018719717359545]
cid: 155, volume: 138.90376739750914, center: [3.2754676698834975 48.62275537682637 25.152324511314983]
cid: 156, volume: 255.95485239439077, center: [4.028202165590167 59.363337213664025 11.883819110566106]
cid: 157, volume: 5.427772086548947, center: [3.1830980822532258 62.28274940086956 21.45261061391304]
cid: 158, volume: 88.57494738339297, center: [4.898426385567119 1.483898658277087 44.194329648596806]
cid: 159, volume: 68.90910649009967, center: [5.7677416598871085 12.143479132054795 1.2112171419178084]
cid: 160, volume: 248.0255853462149, center: [3.8655758806494736 17.87191392226451 51.135145903311134]
cid: 161, volume: 189.57870621134728, center: [5.14453095663034 19.54666565785892 9.457029426547718]
cid: 162, volume: 130.67557956775522, center: [5.583272206662851 23.26367008822538 3.035101142571635]
cid: 163, volume: 218.54255667898963, center: [4.847813439720043 35.53148685560435 29.580085817925276]
cid: 164, volume: 86.21504647619777, center: [3.032752093348315 35.84961737102189 56.75928757516423]
cid: 165, volume: 218.96733884228476, center: [4.682636295446375 39.23785491584998 3.4175645828854724]
cid: 166, volume: 66.92678972805571, center: [4.282335973022131 55.45217019703808 26.51676811177715]
cid: 167, volume: 168.74864753717102, center: [5.346799135838788 9.756459217378334 29.578705411560694]
cid: 168, volume: 25.45546445227883, center: [4.2339001662047115 17.97127177601978 47.732590375401735]
cid: 169, volume: 101.72746177282751, center: [5.991391094506316 27.387888290952674 57.47103616108877]
cid: 170, volume: 6.513326503858736, center: [4.068669408112772 45.86322938115942 0.41144545217391304]
cid: 171, volume: 173.38978598798823, center: [5.856646059526297 29.863942874993196 10.735586960393794]
cid: 172, volume: 241.8426449693635, center: [4.919127715989271 31.74672957090164 60.21298797090164]
cid: 173, volume: 143.96968801162149, center: [6.642284614486658 10.330170875445306 49.99264063021528]
cid: 174, volume: 97.68416488516641, center: [6.366550325992869 15.939996986922209 29.515742687485908]
cid: 175, volume: 78.66336357317314, center: [4.408949395412308 49.72317668472 14.87118660804]
cid: 176, volume: 221.35870509490923, center: [6.804100671206676 6.755901385223881 15.609386677611939]
cid: 177, volume: 75.04484884880718, center: [4.472425672037736 48.83228899742138 1.6628899713207548]
cid: 178, volume: 72.40175983274857, center: [3.6253723434096927 53.47672968487614 16.873785279204693]
cid: 179, volume: 101.1296202096714, center: [5.903566698746513 14.723981970924083 43.45608596975731]
cid: 180, volume: 234.16510068462182, center: [5.70206713093355 47.67719938228299 33.33080097714324]
cid: 181, volume: 98.7697193024762, center: [4.679016400344932 52.724258979929914 8.778929557406817]
cid: 182, volume: 275.79375268754507, center: [5.771032500332572 59.115379124512266 3.5128513361380493]
cid: 183, volume: 182.42034012618853, center: [4.934841523510123 59.97748989829236 18.79607638049159]
cid: 184, volume: 224.9772198192752, center: [6.719572239256951 13.265206313643356 7.41616774220979]
cid: 185, volume: 208.55230950519663, center: [5.784957074734195 52.674895712779126 30.76515130930899]
cid: 186, volume: 28.476137613488678, center: [5.16726458923539 0.4998463925966851 34.44279019110497]
cid: 187, volume: 152.05628178694369, center: [5.435104231690679 26.7031006117434 33.009923363776515]
cid: 188, volume: 263.58519866098857, center: [6.932054091065969 30.82051955959174 27.433475892831563]
cid: 189, volume: 412.7938666865834, center: [5.690574355681377 52.099296136771095 38.646563302446836]
cid: 190, volume: 134.71887645541634, center: [5.6376159717875645 55.29830358519211 14.038074889664838]
cid: 191, volume: 277.603010049728, center: [7.240590611081987 9.036927047265515 11.224189127044488]
cid: 192, volume: 152.90584611353395, center: [6.713870655667674 15.658482134612614 14.379914195843194]
cid: 193, volume: 145.11817311978982, center: [6.620176064943352 28.22594434660668 15.322769987088032]
cid: 194, volume: 198.68792371312074, center: [6.560159332873904 31.905894631570195 47.95562171685011]
cid: 195, volume: 237.8465460998463, center: [5.226701452995431 37.292429573832514 63.365025674513824]
cid: 196, volume: 247.1130903287661, center: [6.302846704006644 40.32980096966958 23.569792483249508]
cid: 197, volume: 173.70443944228094, center: [6.525312297808244 45.45128975447876 37.2762015530115]
cid: 198, volume: 256.94601077541273, center: [7.583276067943338 8.554349830271859 3.5371229652461427]
cid: 199, volume: 274.2676834342255, center: [8.105866317534323 14.634134410927551 21.29446068793667]
cid: 200, volume: 121.92821353841838, center: [6.471354862781134 14.743448346425806 48.290993113819354]
cid: 201, volume: 182.8608549621983, center: [8.066535615377711 17.387140168071927 54.92756010596232]
cid: 202, volume: 101.11388753695675, center: [6.073681121692263 44.73764396830558 4.078215346631399]
cid: 203, volume: 155.8793212565999, center: [5.538375752125989 48.49968231467501 7.183583311192976]
cid: 204, volume: 258.141693901725, center: [8.874470923687841 2.012233516894198 12.31289208225256]
cid: 205, volume: 50.863730886413755, center: [6.811814098151299 2.4661190229817507 48.56247217256418]
cid: 206, volume: 189.21685473891068, center: [6.9201434048800134 4.682163539635819 53.395138606435516]
cid: 207, volume: 51.85488926743574, center: [7.451585055820849 6.59826367345267 49.27525877894418]
cid: 208, volume: 329.835483462315, center: [6.340785932816259 13.586714622370616 34.50981312611018]
cid: 209, volume: 157.02780636476822, center: [7.380219645471578 34.92810239951909 6.287658434655847]
cid: 210, volume: 187.911042903596, center: [7.284239625562543 45.464424783556595 20.151253896299394]
cid: 211, volume: 117.52306517832068, center: [6.803356003489954 46.381662498232934 15.792655733574296]
cid: 212, volume: 40.527364912898804, center: [5.878909429925446 47.771062757608696 12.261434905434783]
cid: 213, volume: 173.61004340599314, center: [6.5117871713610675 3.4097245210602627 63.14889323972814]
cid: 214, volume: 81.05472982579761, center: [8.115811990429968 9.939412413994566 41.03123483111413]
cid: 215, volume: 278.6885644670378, center: [4.779611154435707 23.613712422942307 48.580972276566555]
cid: 216, volume: 229.39810085208754, center: [6.192455988053244 23.04058461156985 55.27788494733558]
cid: 217, volume: 171.92664742552722, center: [7.3735761429507365 34.25623629753843 38.78065688812225]
cid: 218, volume: 104.51214484331784, center: [6.972661240034745 37.0102966634352 10.997465785353002]
cid: 219, volume: 138.68350997950427, center: [4.730166785961001 44.350687194827 64.20730830180375]
cid: 220, volume: 310.37416731431193, center: [7.594809925385027 46.00084653299878 41.96963779784063]
cid: 221, volume: 288.89906905883566, center: [8.398040399691913 4.035413614785166 6.7503869330991675]
cid: 222, volume: 283.675821717577, center: [7.025266495272464 5.473660848582996 41.86207405702402]
cid: 223, volume: 76.97996759270724, center: [7.986441712137777 12.222751974248927 52.92506341759657]
cid: 224, volume: 105.18864977004714, center: [5.723095300998831 56.471266249267124 23.24849387925516]
cid: 225, volume: 35.27265222621084, center: [7.65755437139698 0.7122162120428189 56.029268137734164]
cid: 226, volume: 187.84811221273748, center: [7.688338017983676 30.681838854673366 21.116015894195982]
cid: 227, volume: 197.2247851506597, center: [7.169722975412065 39.94373686466975 39.121260559077854]
cid: 228, volume: 175.7811522406127, center: [8.144435226776926 26.266507118508905 7.833618638610937]
cid: 229, volume: 82.65946244269034, center: [7.337760021522123 30.444934026589266 1.1988016788922726]
cid: 230, volume: 110.06577831158387, center: [7.967459709972024 43.13174459279588 1.938994450728988]
cid: 231, volume: 229.5711602519485, center: [8.12037905630583 5.968343535115132 20.330034960587994]
cid: 232, volume: 107.7216100771033, center: [7.294382913945782 39.86056150344677 17.606336630422085]
cid: 233, volume: 108.16212491311308, center: [7.352405565826871 45.03689315633455 10.099617000785454]
cid: 234, volume: 146.84876711839962, center: [7.04582944695869 53.4765892961217 1.6061627742875508]
cid: 235, volume: 73.40865088648518, center: [9.553544342984921 61.169929525010716 1.0119019552721817]
cid: 236, volume: 81.65257138895372, center: [8.718384641859018 1.472329886069364 17.4407437266474]
cid: 237, volume: 72.19723508745831, center: [9.234519574408084 3.552554390716932 1.04207094868163]
cid: 238, volume: 81.05472982579761, center: [7.9535732301657625 10.419235719701087 45.92194954157608]
cid: 239, volume: 141.4367277045653, center: [7.338808347759921 35.112002927853176 1.6532327648609568]
cid: 240, volume: 168.79584555531494, center: [9.58608384554168 18.018920438083697 24.803356294733902]
cid: 241, volume: 123.72173822788672, center: [8.681951884985752 24.43706389146745 35.836599573753816]
cid: 242, volume: 288.82040569526254, center: [7.22281159681008 26.06027129714021 62.70685625172132]
cid: 243, volume: 117.72758992361092, center: [7.795579999125833 26.07191526931712 39.2487660940131]
cid: 244, volume: 284.84003949845993, center: [9.150145600468193 42.24881744762221 44.92363288]
cid: 245, volume: 65.80976996531665, center: [8.207789600929916 53.76831559787234 16.656539527659575]
cid: 246, volume: 17.63632611310542, center: [9.357678768352766 4.103426179750223 50.39007348733274]
cid: 247, volume: 73.66037364991934, center: [8.590140003800274 18.982645760593762 16.448178849829134]
cid: 248, volume: 139.40721292437743, center: [8.468743628159327 54.734176744475796 6.763034799469586]
cid: 249, volume: 64.330898730141, center: [10.329971588699413 0.9547870831254586 2.3395132767424798]
cid: 250, volume: 145.71601468294594, center: [10.661949254719795 2.1443855267652774 52.1583023601274]
cid: 251, volume: 159.45063796282196, center: [8.752596475582 7.107938392451899 33.013470274129254]
cid: 252, volume: 235.72263528337064, center: [9.38804100856135 19.550188694720685 2.6817805860108126]
cid: 253, volume: 117.19267905131335, center: [6.259217441934804 61.171501513411194 24.790295866129682]
cid: 254, volume: 98.58092722990058, center: [9.390445448577616 1.2931470213533354 39.74198042695499]
cid: 255, volume: 5.94695028613189, center: [8.412165729246256 14.994808505555556 51.97912142777778]
cid: 256, volume: 134.64021309184315, center: [8.948852695634134 18.9823743003856 31.87137111762094]
cid: 257, volume: 78.71056159131705, center: [8.02114122060933 34.558606314291424 34.12370081063362]
cid: 258, volume: 102.48263006312997, center: [7.928556199503829 37.782084419972364 14.707868746745472]
cid: 259, volume: 85.68013560390018, center: [10.411091783858353 20.440230403727508 26.33730850411311]
cid: 260, volume: 231.55347701399248, center: [9.411512102544446 24.016399923787198 13.76688605921321]
cid: 261, volume: 140.00505448753356, center: [9.659124660407684 1.3048286249578605 23.734066735071355]
cid: 262, volume: 95.51305605054684, center: [9.595245527464016 10.65575731477516 64.90253522342283]
cid: 263, volume: 139.42294559709208, center: [9.983102435059742 13.25469072251185 29.44218844834123]
cid: 264, volume: 361.1435021644379, center: [10.307027288559048 20.13247578275757 63.6674921405489]
cid: 265, volume: 174.63266713244437, center: [9.806946860679846 40.101986292729734 33.59469007035135]
cid: 266, volume: 365.5014525063917, center: [7.623311951833652 49.62423497156508 46.57319880955579]
cid: 267, volume: 258.0158325200079, center: [10.142121785113533 31.027545087768292 42.07342900501829]
cid: 268, volume: 76.75971017470235, center: [10.67539834067024 31.877864001004305 64.86595862969871]
cid: 269, volume: 161.4644200702952, center: [9.747461995503691 39.562245820461854 28.417163551914644]
cid: 270, volume: 106.0382140966374, center: [9.622943143054876 58.24028573937686 12.999379026632047]
cid: 271, volume: 211.79324008441137, center: [11.231362077428068 13.118762583338286 16.089059712635567]
cid: 272, volume: 152.63839067738516, center: [10.499582412922905 19.008147606493505 36.19447609718615]
cid: 273, volume: 173.76737013313948, center: [11.217692462785315 20.470256614114984 11.35953179598008]
cid: 274, volume: 106.41579824178864, center: [10.0480427235217 23.197624606578945 5.093042269736842]
cid: 275, volume: 196.4066861694987, center: [9.292572642500092 25.878840785661648 46.926828465331624]
cid: 276, volume: 99.93393708335917, center: [9.514055691254491 40.17773896638854 48.568225925062976]
cid: 277, volume: 269.75240636512535, center: [10.032016008300992 46.26238503497609 28.936138448104515]
cid: 278, volume: 72.54335388718027, center: [9.434235462404951 48.82973521489916 1.4007080862068966]
cid: 279, volume: 74.5099379765096, center: [10.24847585694521 4.377648280616554 47.201012831756756]
cid: 280, volume: 229.162110761368, center: [11.138095762864628 5.639808546100508 25.360944340388578]
cid: 281, volume: 126.00297577150874, center: [11.370182560690873 10.062984599363217 43.48202272392309]
cid: 282, volume: 255.2783474676615, center: [9.810821946009561 14.87744414327006 39.906442842579814]
cid: 283, volume: 222.72744762108243, center: [9.968667776399744 26.902769371413434 28.023513934223356]
cid: 284, volume: 26.60394956044716, center: [8.660616455114425 28.88975515263158 45.37691793157895]
cid: 285, volume: 177.38588485750543, center: [9.60977792692565 35.39214189400444 22.058194355521064]
cid: 286, volume: 582.1875538050544, center: [10.444349204786162 36.78893735886502 54.397423475484395]
cid: 287, volume: 233.0166155764535, center: [9.682035539085524 41.9762551349605 7.840926710816285]
cid: 288, volume: 126.60081733466485, center: [8.609970233745713 50.9234748227414 10.593688863974153]
cid: 289, volume: 151.36404418749976, center: [8.106721904485452 51.84627601995634 22.660990499657]
cid: 290, volume: 93.97125412451264, center: [9.629077831981906 61.408636319738825 16.31489047669513]
cid: 291, volume: 118.24676812319387, center: [10.465905264638012 2.5931109272219266 44.21540987350985]
cid: 292, volume: 355.25948256916456, center: [10.456039836061512 15.274896554643284 60.966212032908196]
cid: 293, volume: 134.40422300112363, center: [10.802180652115851 18.76831685379843 7.901967393234227]
cid: 294, volume: 143.13585635774587, center: [11.105144394884737 27.51304058187514 19.085034514695536]
cid: 295, volume: 157.21659843734383, center: [10.407165435215662 45.67859984845391 24.352326757820475]
cid: 296, volume: 241.82691229664889, center: [9.483486617701713 2.10665800798907 33.01727822027845]
cid: 297, volume: 109.10608527599115, center: [10.215627781978688 8.05248020820476 54.724015489098775]
cid: 298, volume: 191.60822099153515, center: [10.376896105710905 32.425008346062896 13.852601056498893]
cid: 299, volume: 108.35091698568868, center: [10.957514038992555 34.8021621155946 17.511544914607228]
cid: 300, volume: 103.30072904429097, center: [9.224582139977453 51.0248479576759 16.84263411620469]
cid: 301, volume: 54.76543371964314, center: [10.141387333154738 61.71124135785694 11.43957428652686]
cid: 302, volume: 217.97618046126277, center: [10.917135411884804 12.122320510285094 22.704636578260555]
cid: 303, volume: 87.33206623893682, center: [11.141133094000539 15.77954346998739 1.362153058259773]
cid: 304, volume: 35.335582917069374, center: [10.097719713541844 25.996100660329475 0.8777736864203027]
cid: 305, volume: 185.12635983310568, center: [10.759403829041586 32.515835074479476 34.19274556972041]
cid: 306, volume: 307.80974166182654, center: [11.467777020702712 47.02542438783542 50.656669715742396]
cid: 307, volume: 73.72330434077787, center: [9.40699093878199 50.49449476389245 5.171829474519846]
cid: 308, volume: 155.91078660202916, center: [10.80981901606124 52.77024577922301 34.784196859011104]
cid: 309, volume: 88.46481867439051, center: [12.29235913893668 8.840743268184244 27.6126405347857]
cid: 310, volume: 119.75710470379879, center: [12.40400308317964 10.886956747464529 1.3173590272858644]
cid: 311, volume: 11.516316427112548, center: [11.946414297290854 15.325086358606557 65.51716817008197]
cid: 312, volume: 161.1497666160025, center: [11.0965011951824 22.327777954115007 40.54382677805331]
cid: 313, volume: 141.2007376138458, center: [11.598754002673903 24.403296204467967 24.57724246221727]
cid: 314, volume: 119.26939184964512, center: [10.544838239013057 34.80392875096953 9.856737673130194]
cid: 315, volume: 9.10921750177345, center: [10.523136462190633 35.38887424611399 65.40454199274612]
cid: 316, volume: 161.13403394328787, center: [9.194590278571104 40.46876024001171 60.62693943072642]
cid: 317, volume: 66.80092834633864, center: [11.163037377631522 41.415586220843146 1.4067577403203013]
cid: 318, volume: 143.89102464804833, center: [10.723435858637702 43.4249261542751 14.761564103761208]
cid: 319, volume: 155.39160840244622, center: [9.84851762716125 58.20790487753367 19.372888377533663]
cid: 320, volume: 91.51695718102964, center: [9.855864434253656 61.71156300541516 5.977019202888087]
cid: 321, volume: 198.23167620439634, center: [11.73242978756035 14.094772811166665 55.42079948283334]
cid: 322, volume: 193.4489436991474, center: [11.730768296731728 26.41958204702342 32.4593842003741]
cid: 323, volume: 228.32827910749236, center: [11.940664161834682 28.972265599724384 54.45291648690829]
cid: 324, volume: 229.05198205236556, center: [7.830531495558982 29.14625425308057 52.388654423552445]
cid: 325, volume: 322.7557807407294, center: [12.075017868895214 34.18514119368754 60.8184551123032]
cid: 326, volume: 50.02989923253812, center: [12.230291895378185 9.855301357075472 51.282519413867924]
cid: 327, volume: 167.6945584652905, center: [12.250792896160698 30.227367404784687 37.39630006819589]
cid: 328, volume: 413.328777558881, center: [11.376746613480268 8.910307066557552 60.33739498274589]
cid: 329, volume: 127.40318364311122, center: [11.26071215199481 22.779906758335393 50.357064696875774]
cid: 330, volume: 36.452602679808436, center: [9.596135198422267 1.19869367673716 61.813292287613294]
cid: 331, volume: 121.66075810226958, center: [12.15052390247444 9.894732114405794 36.850396964839]
cid: 332, volume: 289.7958314035699, center: [13.258537776241807 13.94707658732899 10.398548582964171]
cid: 333, volume: 234.7472095750633, center: [12.342048009323472 21.667514020983848 20.222723497513574]
cid: 334, volume: 183.69468661607394, center: [11.703041085355226 29.155371089568344 3.8394142194244605]
cid: 335, volume: 156.87047963762188, center: [11.632784282291457 35.863259864035705 47.9331538215525]
cid: 336, volume: 207.63981448774783, center: [11.389849774662629 50.14701304996211 24.216957094059705]
cid: 337, volume: 201.5355374744696, center: [14.025592131252466 32.323604511147536 47.75386707934426]
cid: 338, volume: 51.61889917671622, center: [11.824925049820544 45.16819061667175 64.5843519733313]
cid: 339, volume: 142.36495539472875, center: [11.480755902937325 47.74904098309205 37.394210616919]
cid: 340, volume: 313.1116523666584, center: [12.904966752742817 3.313705014199578 57.319541802894186]
cid: 341, volume: 150.18409373390216, center: [12.3733257805732 11.039461635700818 47.13596375125707]
cid: 342, volume: 133.08267849309433, center: [13.90291247977265 13.451764172940065 33.603400211809905]
cid: 343, volume: 131.68247062149183, center: [11.443272844260157 20.646859791971327 52.367611014946235]
cid: 344, volume: 131.7139359669211, center: [13.017480375670901 22.021886302675586 29.39265048511706]
cid: 345, volume: 99.19450146577134, center: [11.53658496078476 35.02090367600317 4.38991052003172]
cid: 346, volume: 140.87035148683847, center: [12.805358381429748 37.17450868921152 24.563993684319858]
cid: 347, volume: 83.3674327148489, center: [11.40573395835362 40.77197836961691 64.92105035270805]
cid: 348, volume: 115.72954048885234, center: [11.570259184084305 46.90254315995106 4.958562620350734]
cid: 349, volume: 121.67649077498422, center: [11.423677362606186 48.72808830449961 11.902472152637705]
cid: 350, volume: 5.223247341258697, center: [12.71037923436133 0.43400994759036143 41.275314067771085]
cid: 351, volume: 285.5637424433331, center: [12.323729927553211 20.64033625221751 44.68180836594678]
cid: 352, volume: 198.07434947724997, center: [13.297731408430963 28.626292516441623 58.39454363206514]
cid: 353, volume: 278.87735653961346, center: [13.325118435629836 34.77467543892023 29.489890680429877]
cid: 354, volume: 174.39667704172487, center: [12.943481222511995 37.932327217212446 38.72380216503383]
cid: 355, volume: 113.98321381752788, center: [12.691130451012475 39.45310885942029 10.423580526376812]
cid: 356, volume: 105.12571907918858, center: [12.576361623900889 8.261213946662677 31.306340572672852]
cid: 357, volume: 374.92532346245787, center: [13.543339228218427 21.836043741521546 58.088693677164194]
cid: 358, volume: 158.6482716543756, center: [13.300020431380279 57.30848788280445 3.22846053882388]
cid: 359, volume: 245.96460522059778, center: [12.542011484288057 59.114167952437 8.209705322732507]
cid: 360, volume: 60.822512714777474, center: [13.757843734276534 41.08391013616141 60.278621209958615]
cid: 361, volume: 108.13065956768381, center: [12.573071999235438 42.16043661274553 21.5140890486687]
cid: 362, volume: 138.51045057964328, center: [13.066406203511551 52.534506786869606 2.975856573080418]
cid: 363, volume: 208.3005867417625, center: [13.04323024981606 54.79016395243958 11.259464370793053]
cid: 364, volume: 78.9150863366073, center: [13.83511664141267 1.067626567284689 24.979311388516745]
cid: 365, volume: 134.64021309184315, center: [14.424536998652922 19.324810698305676 16.482106643409676]
cid: 366, volume: 231.17589286884123, center: [13.75814631376629 26.975830500775825 63.11224688348305]
cid: 367, volume: 62.82056214953607, center: [13.116319509501487 27.661778767468068 13.98673653148009]
cid: 368, volume: 181.30332036344947, center: [13.56489264597231 29.707841719394306 8.626427156152378]
cid: 369, volume: 74.90325479437547, center: [13.98526794523437 30.6767631152489 1.0319889007561436]
cid: 370, volume: 155.5646678023072, center: [13.95963050788598 30.593382861498785 21.255492092930826]
cid: 371, volume: 109.43647140299848, center: [12.988612284798286 41.06457814407706 18.59307945293272]
cid: 372, volume: 136.27641105416515, center: [13.323072166804096 43.506726846421145 39.282086543211726]
cid: 373, volume: 31.30801870212291, center: [13.556705198343503 1.839666749396985 39.438234465527636]
cid: 374, volume: 216.49730922608714, center: [14.414041106755205 5.448165436952257 35.06368874353608]
cid: 375, volume: 178.53436996567376, center: [14.969183268098165 5.337106518082482 2.4832357493126542]
cid: 376, volume: 217.3468735526774, center: [15.510153086939717 9.00151160840391 4.877837431335505]
cid: 377, volume: 279.2864060301939, center: [15.00766983880277 7.729662518257098 11.814774215299686]
cid: 378, volume: 137.80248030748473, center: [14.531252181401445 17.264750232309623 29.877970243463864]
cid: 379, volume: 105.59769926062764, center: [13.941133744664592 38.586860888215135 6.283815634773539]
cid: 380, volume: 148.62655913515334, center: [13.422762166037607 40.04612389031439 44.31030262740553]
cid: 381, volume: 108.61837242183748, center: [13.606070981043523 41.987655770509846 33.00231574597335]
cid: 382, volume: 206.3025373070039, center: [13.981697266222277 51.781267900228784 29.488048313154884]
cid: 383, volume: 52.861780321172354, center: [13.085384024724988 61.68629905375 20.513688765]
cid: 384, volume: 237.95667480884876, center: [15.288804568864176 2.744273286803306 8.058948773712396]
cid: 385, volume: 127.35598562496732, center: [13.186994748315538 4.836945102100062 49.701806978875844]
cid: 386, volume: 94.45896697866631, center: [14.006991307469374 9.181395852281813 24.144417349017324]
cid: 387, volume: 108.17785758582771, center: [13.758731994294864 39.42368433451134 15.03130382277487]
cid: 388, volume: 86.70275933035144, center: [14.14157816567174 45.95235173728906 1.1955291997822537]
cid: 389, volume: 214.60938850033097, center: [14.479582501567881 3.177079339894436 17.177256473455024]
cid: 390, volume: 155.40734107516087, center: [13.668397065750241 4.201977471441587 64.69546468678882]
cid: 391, volume: 245.71288245716363, center: [14.065515458043008 15.259233694563965 5.093888045274683]
cid: 392, volume: 118.64008494105974, center: [14.362976524553334 42.75170804333643 25.028802228550592]
cid: 393, volume: 101.25548159138847, center: [13.849582092169438 2.3232263573026724 62.12978430009322]
cid: 394, volume: 143.98542068433613, center: [14.344810416652885 24.392220485402095 7.401344743236451]
cid: 395, volume: 193.05562688128154, center: [15.899533189152091 25.98077107273246 39.39306544740445]
cid: 396, volume: 135.1593912914261, center: [15.109672624792802 32.461053934117096 24.39847684483762]
cid: 397, volume: 37.74268184240847, center: [14.789605083559769 47.20700450458524 4.66917794793664]
cid: 398, volume: 52.012215994582085, center: [14.716185376491168 0.7670274239564429 35.65348914537205]
cid: 399, volume: 199.01830984012807, center: [15.146633259691866 9.105548979794467 17.44257007956522]
cid: 400, volume: 144.53606422934834, center: [14.531092858753004 21.281034553826057 36.2866739790356]
cid: 401, volume: 106.11687746021057, center: [15.032545416787631 35.204551472424015 64.69220255826538]
cid: 402, volume: 113.11791681822298, center: [13.776523811402233 38.602613576453415 1.7932163390820584]
cid: 403, volume: 103.9929666437349, center: [13.907304294546112 46.68512337226929 10.245969489667171]
cid: 404, volume: 163.77712295934649, center: [13.500454443851037 47.6090879710951 17.921969693487032]
cid: 405, volume: 102.51409540855924, center: [15.11933860918902 24.82313933314917 49.04798216519337]
cid: 406, volume: 134.05810420140168, center: [15.186772399942663 35.521414854993544 42.54534637284357]
cid: 407, volume: 219.0774675512872, center: [15.87191405795939 47.23518948646319 34.34591651060682]
cid: 408, volume: 171.56479595309062, center: [15.361437640682391 59.609481589876204 16.0425231088033]
cid: 409, volume: 20.232217111020134, center: [14.45373253724797 14.97627519984448 51.97481840388802]
cid: 410, volume: 179.14794420154453, center: [14.836940566993619 3.5172289830771937 44.225816318143494]
cid: 411, volume: 164.57948926779287, center: [15.39956129636954 16.80176534399197 43.65547985758532]
cid: 412, volume: 106.22700616921301, center: [15.584020322513236 24.795958116469194 1.438344228332346]
cid: 413, volume: 251.5497040342931, center: [16.323852344432943 27.705015898986805 45.22006638967415]
cid: 414, volume: 77.71940321029507, center: [15.940478831126969 9.115846487914979 42.83285997576923]
cid: 415, volume: 171.2344098260833, center: [15.391116880288683 13.228434335777287 26.61349521606946]
cid: 416, volume: 83.47756142385134, center: [16.03486583594533 23.738488730738787 31.436995575989446]
cid: 417, volume: 191.12050813738148, center: [15.48975934079433 30.070405725740862 14.710879568431018]
cid: 418, volume: 54.214790174630934, center: [14.923445078274943 31.545377603192104 53.2384109259141]
cid: 419, volume: 95.60745208683464, center: [15.09976157104937 53.16324754556525 35.37397040674675]
cid: 420, volume: 56.779215827116374, center: [15.652901852858601 10.351403314546966 65.14342943200333]
cid: 421, volume: 101.64879840925434, center: [15.756660343231244 12.809136451137594 38.60138750801734]
cid: 422, volume: 141.04341088669946, center: [16.29466570840732 23.57221345388734 13.169534637456776]
cid: 423, volume: 135.26952000042854, center: [16.001130906971774 37.65558405 33.1107679]
cid: 424, volume: 185.64553803268862, center: [15.580207430984679 43.25067817154237 47.756266397949155]
cid: 425, volume: 47.874523070633174, center: [15.08323408932341 61.69709878255012 12.472779116036806]
cid: 426, volume: 24.417108053112944, center: [16.15768003865153 0.5731029585695877 43.09161318054124]
cid: 427, volume: 139.48587628795062, center: [16.01055299505708 5.158417085461313 20.977560800315814]
cid: 428, volume: 191.73408237325222, center: [16.635985864986942 9.86213366674325 56.22223606938541]
cid: 429, volume: 59.076186043453035, center: [15.855247625168895 12.453881061571238 48.61761047225033]
cid: 430, volume: 330.9682358977687, center: [14.699998211166173 17.261181439226124 48.172039858183204]
cid: 431, volume: 122.03834224742081, center: [16.702194106427328 25.957154947479694 24.958834705401575]
cid: 432, volume: 103.80417457115928, center: [16.74189456293185 32.23199611868748 42.50565236357987]
cid: 433, volume: 120.18188686709394, center: [16.380997768956224 31.413815609359865 52.64113299146485]
cid: 434, volume: 195.5413891701938, center: [16.125498304674068 47.27735330374125 41.94398561037895]
cid: 435, volume: 316.745899763739, center: [15.940388162638277 52.783980113112804 41.2221457802265]
cid: 436, volume: 102.95461024456901, center: [16.478326769070193 6.40384052434291 47.6574099130654]
cid: 437, volume: 153.8340738036974, center: [16.39172196552928 25.139702663919003 20.804964203753325]
cid: 438, volume: 231.4276156322754, center: [16.70607526499778 29.49059726220938 32.98153378374575]
cid: 439, volume: 141.3423316682775, center: [16.339791089869536 36.7390799153829 14.202470066106411]
cid: 440, volume: 122.29006501085497, center: [16.137711151100753 45.40115385372443 29.012806867580085]
cid: 441, volume: 57.14106729955297, center: [16.09931725981442 11.758093224862336 44.846170305313876]
cid: 442, volume: 136.32360907230907, center: [17.284691284056635 20.87445693794576 1.9618340388574727]
cid: 443, volume: 104.15029337088124, center: [16.75937679392971 32.83134708285498 37.75314632995468]
cid: 444, volume: 149.1929353528802, center: [16.537969438625495 34.666557813286936 8.530833327048402]
cid: 445, volume: 139.7061337059555, center: [16.5607720582224 43.38709209435811 10.845001077939191]
cid: 446, volume: 97.27511539458591, center: [16.048521687219164 11.8865597860262 51.6564825207181]
cid: 447, volume: 93.32621454321261, center: [17.45643914899646 20.802518790323667 8.840074936193528]
cid: 448, volume: 89.67623447341738, center: [17.744993039807838 19.02619788410526 31.150100040684208]
cid: 449, volume: 133.14560918395287, center: [17.696656677539206 27.88170854218362 27.716037029776675]
cid: 450, volume: 70.71836385228265, center: [15.880327280996664 45.27741966680756 14.680652135172414]
cid: 451, volume: 211.3999232665455, center: [17.239043518383607 15.264604263674928 20.05949146615316]
cid: 452, volume: 35.744632407649874, center: [16.743547795515866 34.43130198023768 0.6393914809859156]
cid: 453, volume: 135.64710414557976, center: [16.860174856650143 34.793930771816285 3.874897118232429]
cid: 454, volume: 89.84929387327837, center: [16.70592849337944 46.50569374575381 21.38663508968657]
cid: 455, volume: 160.53619238013175, center: [16.95412235940599 50.59053699563896 46.387762889464916]
cid: 456, volume: 133.19280720209676, center: [17.6493234852609 1.5695411859319632 2.272549353827073]
cid: 457, volume: 186.93561719528867, center: [17.645758624824904 14.054417468902543 14.19622053746844]
cid: 458, volume: 132.87815374780408, center: [18.284124719653978 13.862667888633672 63.92158668079565]
cid: 459, volume: 55.28461191922609, center: [17.813273510022757 15.559768057768924 0.8070653145418327]
cid: 460, volume: 110.33323374773265, center: [17.32909313656722 15.974873984685583 33.810526075003565]
cid: 461, volume: 107.43842196823988, center: [16.637226894099367 37.34484498305755 19.7915218480451]
cid: 462, volume: 198.89244845841097, center: [16.38473926147175 7.906149980398671 38.893403870764125]
cid: 463, volume: 153.26769758597055, center: [17.953158747673314 18.6701914393759 24.478605024389243]
cid: 464, volume: 78.61616555502924, center: [17.244337651004898 39.60339310740444 22.15675263217931]
cid: 465, volume: 131.85553002135282, center: [17.338324699071215 41.79630055300083 26.864866332335044]
cid: 466, volume: 206.5385273977234, center: [17.095554755432648 42.70293158976234 3.7101317692413165]
cid: 467, volume: 6.293069085853851, center: [17.261012099120926 0.39236758050000003 59.61777645075]
cid: 468, volume: 270.97955483686684, center: [17.84664141119529 4.1858029920634 30.913869215437764]
cid: 469, volume: 132.32751020279187, center: [16.943125269133578 16.53395824226608 39.08208285647366]
cid: 470, volume: 299.97487064993845, center: [17.903395382716553 41.18068259590917 52.64791372644359]
cid: 471, volume: 226.36169501816303, center: [18.518823648753035 45.14125312431192 63.77690850696413]
cid: 472, volume: 177.66907296636887, center: [18.08681124801674 60.32991478275923 2.5700359991322057]
cid: 473, volume: 155.62759849316575, center: [18.714475042416694 2.076639381550748 11.282932279640113]
cid: 474, volume: 161.8262715427318, center: [17.508054234059145 3.495247825899281 25.40262152260354]
cid: 475, volume: 137.89687634377253, center: [17.58917640510851 26.055922595561896 6.9710370983685115]
cid: 476, volume: 114.62825339882791, center: [18.181329371709637 4.557187932994785 38.89724986482295]
cid: 477, volume: 187.64358746744722, center: [18.1235727266983 15.407940975132053 55.76724223039323]
cid: 478, volume: 79.52866057247805, center: [18.763562769821004 20.878268606646884 27.318372417270027]
cid: 479, volume: 92.90143237991748, center: [17.843982866473453 33.86258320978831 18.554177791803557]
cid: 480, volume: 59.91001769732867, center: [17.676477249315656 54.464253852573535 0.8323195908088235]
cid: 481, volume: 63.843185875987324, center: [17.65985377626439 61.65396293997043 6.79185439228684]
cid: 482, volume: 49.58938439652835, center: [18.731071641450953 0.6086452459073604 28.692231952538073]
cid: 483, volume: 175.57662749532247, center: [19.36153702040695 2.6823088148387098 62.15287362629032]
cid: 484, volume: 181.28758769073482, center: [18.132587856979978 9.145887123873992 25.129411012600883]
cid: 485, volume: 107.78454076796184, center: [18.227455031244453 22.40612683465188 18.279953976397607]
cid: 486, volume: 47.19801814390389, center: [17.74937957401346 54.308315488000005 3.2991016086]
cid: 487, volume: 146.59704435496548, center: [17.717116563147602 0.9719460909529942 51.54973271770766]
cid: 488, volume: 134.30982696483582, center: [19.047125896102557 20.161650118355393 12.70068631858967]
cid: 489, volume: 230.46792259668268, center: [20.29018361613677 39.79542260833504 38.07528462439075]
cid: 490, volume: 168.16653864672955, center: [19.246457448751826 44.92579775166994 36.94869666286837]
cid: 491, volume: 137.2046387443286, center: [19.281611916668922 19.527344939490884 5.339816688166494]
cid: 492, volume: 64.45676011185807, center: [18.50770537754338 41.100536824920674 8.77712622418843]
cid: 493, volume: 84.39005644130015, center: [18.447649743492523 42.91554426935124 17.3718019307047]
cid: 494, volume: 76.19333395697551, center: [18.41406917898785 1.5047680604996903 40.690841805926084]
cid: 495, volume: 127.76503511554782, center: [19.126147970322055 13.246802234724788 27.768960335315846]
cid: 496, volume: 193.9523892260157, center: [20.347391514293353 16.06131954081765 8.806769176216743]
cid: 497, volume: 178.2354491840957, center: [18.816175735705443 38.896908363235944 47.046705035854885]
cid: 498, volume: 240.1120509707537, center: [18.240201959850058 39.7558299631372 62.7034273319945]
cid: 499, volume: 144.9293810472142, center: [18.431181525186993 48.48437288389058 24.693237129939213]
cid: 500, volume: 197.11465644165727, center: [18.80937044586435 56.60044318877006 6.8873125417271925]
cid: 501, volume: 70.7340965249973, center: [18.91336762965888 11.812595513100534 41.58662443832296]
cid: 502, volume: 86.6398286394929, center: [18.715096015052143 19.032788616651533 64.96881376914835]
cid: 503, volume: 277.88619815859147, center: [19.817868822668242 24.629564482511466 62.798097444845155]
cid: 504, volume: 94.17577886980288, center: [19.000999115358162 36.9795512946876 24.9076629035583]
cid: 505, volume: 324.0773252487587, center: [19.98171846836119 42.12494544869168 42.59569498537793]
cid: 506, volume: 255.84472368538835, center: [19.199664925251707 6.297607188433157 51.052436041649244]
cid: 507, volume: 150.67180658805583, center: [20.208722320806167 8.731373186895688 63.24895019129164]
cid: 508, volume: 171.26587517151256, center: [19.724333524847893 20.76550381154694 40.29374993383245]
cid: 509, volume: 115.05303556212304, center: [19.731666158135553 30.560411405661153 5.902244240667304]
cid: 510, volume: 209.84238866779668, center: [19.535106800650833 50.465722521210076 30.536815570985155]
cid: 511, volume: 179.60419171026894, center: [19.675484867386714 59.994507454336016 11.334723516748424]
cid: 512, volume: 283.78595042657946, center: [20.323492914196787 15.736755643325203 60.807459655316556]
cid: 513, volume: 72.30736379646075, center: [20.11792861327569 31.47913687787206 10.054436004112272]
cid: 514, volume: 124.38251048190138, center: [19.334318088777472 32.36494156665823 13.495927914520617]
cid: 515, volume: 131.82406467592355, center: [20.68345895966845 32.554378622807015 46.448144331829575]
cid: 516, volume: 102.87594688099584, center: [20.636265357657688 34.015961032971404 26.479840856522404]
cid: 517, volume: 100.64190735551772, center: [19.962296366056425 35.98558432763795 47.72524655247773]
cid: 518, volume: 28.539068304347218, center: [20.471500524388592 0.6878772074421169 23.12988955584344]
cid: 519, volume: 187.20307263143744, center: [20.24841368279035 1.901758988209093 17.71781861020254]
cid: 520, volume: 272.694416162762, center: [21.039471130495215 3.28550557869959 56.4441508216408]
cid: 521, volume: 145.16537113793373, center: [20.205535581156223 10.512563773349951 33.7898299799935]
cid: 522, volume: 85.75879896747337, center: [21.010299810627913 16.547732724821135 3.020050891249312]
cid: 523, volume: 152.16641049594614, center: [19.729721077355634 29.590557975279157 2.0269007606389575]
cid: 524, volume: 128.01675787898196, center: [21.081159401649806 30.336481845385276 64.24606235135799]
cid: 525, volume: 115.54074841627671, center: [20.163065242297034 30.777210084558824 18.07388407365196]
cid: 526, volume: 105.51903589705445, center: [20.479333174369724 38.54977820253466 28.244741063769197]
cid: 527, volume: 92.83850168905894, center: [19.642098836750115 39.61153982135231 5.0558662330960855]
cid: 528, volume: 232.30864530429494, center: [20.114692335290464 42.01845869522552 32.34439375323039]
cid: 529, volume: 137.53502487133593, center: [19.831806152929836 48.23781531431023 48.02890235545642]
cid: 530, volume: 22.733712072647037, center: [19.268876034728713 62.160677669273355 16.18550443079585]
cid: 531, volume: 12.350148080988184, center: [20.195938759181555 5.274329190191083 0.7529881960509555]
cid: 532, volume: 79.33986849990244, center: [20.410561925110247 6.124825962760262 14.606726877215943]
cid: 533, volume: 198.29460689525487, center: [21.409638424893185 10.332977110972706 7.1021089225801335]
cid: 534, volume: 84.78337325916601, center: [19.864553235765538 41.0379229395064 14.924448845221749]
cid: 535, volume: 206.09801256171363, center: [20.596418860096193 51.540762588 36.610308776679396]
cid: 536, volume: 17.243009295239553, center: [21.06516985195054 0.5950369064781021 65.07040141970803]
cid: 537, volume: 245.36676365744168, center: [20.114886303118663 19.664230522755837 51.24583201615799]
cid: 538, volume: 292.5805144740602, center: [21.26076258383552 23.729617749637036 35.15357736249395]
cid: 539, volume: 130.3451934407479, center: [21.400489391803678 24.036832966674712 30.96783238620398]
cid: 540, volume: 191.43516159167416, center: [21.259009253778107 27.60260714183925 57.257349388387574]
cid: 541, volume: 186.7782904681423, center: [21.62361471608869 12.24860535283019 2.444536871992925]
cid: 542, volume: 117.3500057784597, center: [20.837860543606578 17.028728613084866 19.958854853975065]
cid: 543, volume: 10.509425373375931, center: [21.389279253384576 25.55388990943114 0.4454439741017964]
cid: 544, volume: 129.18097565986494, center: [20.990348815795656 27.3566865 16.61937582634271]
cid: 545, volume: 93.955521451798, center: [20.262636952988768 32.22816637670797 22.002816927478232]
cid: 546, volume: 153.39355896768762, center: [21.058356028262295 35.022111484769226 30.58320385873846]
cid: 547, volume: 207.87580457846735, center: [20.365397181796023 34.23601374741543 52.65278125247862]
cid: 548, volume: 127.23012424325024, center: [20.18792935309834 43.61799464538147 21.082944810374677]
cid: 549, volume: 57.17253264498224, center: [21.708033159184907 8.384982184012108 1.0534752734727573]
cid: 550, volume: 224.53670498326542, center: [22.546607552472334 10.324352490386772 11.285244415190583]
cid: 551, volume: 147.27354928169476, center: [21.07298342489956 24.148668405277213 42.31005301176156]
cid: 552, volume: 374.83092742617004, center: [20.59317169409452 25.411649556390348 52.37770026240504]
cid: 553, volume: 52.295404103445506, center: [21.54456040540234 31.339144430595667 24.20512982229242]
cid: 554, volume: 123.28122339187695, center: [20.504808241191245 38.779407047741195 11.391939795520674]
cid: 555, volume: 220.19448731402628, center: [22.305617325477115 4.797552658731066 4.921726275857388]
cid: 556, volume: 30.52138506639118, center: [21.395546697929866 5.308786791649484 65.34277991319587]
cid: 557, volume: 116.28018403386454, center: [21.76118015289287 15.277629793410906 15.46486639548099]
cid: 558, volume: 353.387294516123, center: [21.652141405350566 21.40746019142997 57.026243038375924]
cid: 559, volume: 188.19423101245943, center: [21.594660001186686 26.97341979648052 9.974465981692026]
cid: 560, volume: 214.86111126376514, center: [22.210470942762818 31.24141383874936 37.50652678385444]
cid: 561, volume: 61.21582953264334, center: [20.699909487669153 38.17601305620663 1.0624313928296067]
cid: 562, volume: 124.09932237303795, center: [21.464210529272258 10.127234906250001 17.339908207492392]
cid: 563, volume: 145.22830182879227, center: [21.740311690394158 14.441921817419566 35.932374685342864]
cid: 564, volume: 105.37744184262274, center: [21.63292234105013 17.69298256388474 37.4027900803822]
cid: 565, volume: 200.7174384933086, center: [22.125041767098757 36.31145733578931 34.65322642005016]
cid: 566, volume: 159.68662805354148, center: [22.254357406034455 26.79567322613793 22.677222035172417]
cid: 567, volume: 13.7660886253053, center: [21.040073982038283 61.8801361632 0.6914545992000001]
cid: 568, volume: 123.67454020974282, center: [21.300833770631083 1.5083663572573465 35.44088556224399]
cid: 569, volume: 197.6338346412402, center: [22.306130535583808 8.39084014938704 60.07465709777902]
cid: 570, volume: 185.92872614155203, center: [22.4637096546084 9.514319554670841 55.165616741479106]
cid: 571, volume: 145.13390579250446, center: [22.529691409882236 30.570826277235774 42.84918032494309]
cid: 572, volume: 215.27016075434562, center: [22.517414022411334 4.209649355272966 24.63599876377987]
cid: 573, volume: 179.06928083797135, center: [23.424215983528455 6.9731678328413285 17.4690864398524]
cid: 574, volume: 303.78217744688004, center: [22.23381504089842 13.863304925273189 49.58963924991455]
cid: 575, volume: 144.7405889746386, center: [22.38238614362337 30.144677204249998 32.235771083706524]
cid: 576, volume: 47.95318643420635, center: [21.525750901257677 57.141057368996066 1.3158529552165354]
cid: 577, volume: 4.137692923948907, center: [23.121872126438017 0.39308552167300376 0.45520525437262355]
cid: 578, volume: 21.12897945575431, center: [22.938993581162272 0.47762274125093074 31.969413947580044]
cid: 579, volume: 179.3682016195494, center: [21.194720619689157 8.520261365125865 44.507297566748534]
cid: 580, volume: 138.49471790692863, center: [22.245727953551707 10.091411848483471 22.528499036578438]
cid: 581, volume: 143.6550345573288, center: [22.80099438553437 22.245244897941078 20.166009089168764]
cid: 582, volume: 168.57558813731004, center: [22.89762667683125 29.719501355389642 28.017301974148392]
cid: 583, volume: 78.38017546430972, center: [23.725893607369088 3.532884978101164 1.136198000702529]
cid: 584, volume: 188.09983497617162, center: [22.571389445518967 6.095029071779859 34.36693542049181]
cid: 585, volume: 7.803405666458776, center: [22.656537610225097 10.822722965927419 65.50277178205646]
cid: 586, volume: 69.80586883483384, center: [22.54314767268112 18.559427413995945 29.944730425760646]
cid: 587, volume: 170.57363757206863, center: [22.863140624684974 24.590965135777534 3.955337376950747]
cid: 588, volume: 64.18930467570928, center: [22.538184769432927 24.232827106250003 27.199806612279414]
cid: 589, volume: 61.62487902322384, center: [22.607729189749136 26.056141210645904 38.02182404758744]
cid: 590, volume: 236.9340510823975, center: [23.163230769934607 34.688311001394425 63.782704369860554]
cid: 591, volume: 176.0958056949054, center: [22.733263487855435 35.601750160787994 40.11907241575985]
cid: 592, volume: 40.196978785891474, center: [23.71526925342959 0.6450926284931506 4.210083724109589]
cid: 593, volume: 86.30944251248557, center: [22.787229619478317 25.03661736676996 14.620238634104995]
cid: 594, volume: 196.89439902365237, center: [22.79487122726161 32.47148170928486 58.542234497403115]
cid: 595, volume: 159.1989151993878, center: [22.717166625688044 35.87657780373554 6.880993589801363]
cid: 596, volume: 142.41215341287267, center: [22.619314824247493 37.626418854220056 19.089854256429522]
cid: 597, volume: 124.50837186361845, center: [22.316174062839977 44.070381342342685 49.731515744162245]
cid: 598, volume: 217.92898244311888, center: [24.199041756486682 4.300266454613053 10.248895232941091]
cid: 599, volume: 101.33414495496164, center: [22.74395171005896 13.5860704978109 31.12909671052632]
cid: 600, volume: 57.81757222628226, center: [22.889353250095855 20.237061012 31.900137466285713]
cid: 601, volume: 126.19176784408435, center: [23.076527772214394 34.58543468680963 2.212174660603416]
cid: 602, volume: 108.82289716712773, center: [23.105119262798265 35.807947838643926 15.816664140841405]
cid: 603, volume: 70.4194430707046, center: [22.673609184086505 36.564105671045574 43.428536802412864]
cid: 604, volume: 66.09295807418007, center: [23.983566329219936 40.049708518114734 64.98509854598905]
cid: 605, volume: 74.54140332193887, center: [22.616666695290945 1.343434596496412 43.063788642106374]
cid: 606, volume: 131.3048864763406, center: [23.456184891256157 16.190611269266714 26.608710876491735]
cid: 607, volume: 158.77413303609268, center: [24.118961924616656 20.438369143370988 15.958359049762189]
cid: 608, volume: 199.9937355484354, center: [25.229231539952202 20.857061068612335 64.1620527756608]
cid: 609, volume: 180.37509267328602, center: [23.605694791529782 43.129814129071086 25.826275872088967]
cid: 610, volume: 101.49147168210798, center: [22.976640329904654 21.990850431871028 24.891991963509533]
cid: 611, volume: 127.15146087967707, center: [24.26469307643555 21.627202760764664 8.451716976985894]
cid: 612, volume: 60.86971073292138, center: [22.66888089795034 36.20457329185836 11.32906325319204]
cid: 613, volume: 156.20970738360722, center: [24.242018487704584 10.01722533260147 39.742647323809045]
cid: 614, volume: 212.15509155684796, center: [24.267634408261582 10.357513847919911 28.2405391898109]
cid: 615, volume: 58.55700784387009, center: [23.35593756046119 28.061535732590006 40.547904885491675]
cid: 616, volume: 134.16823291040413, center: [23.05077946261423 46.4479120931637 28.19803588564728]
cid: 617, volume: 265.70910947746427, center: [24.212726004967397 48.33976787233703 40.60325972699982]
cid: 618, volume: 41.219602512342725, center: [24.285912689448143 0.8561286211832061 22.849382885267175]
cid: 619, volume: 30.55285041182045, center: [24.467577316603695 0.5879245546343975 59.746264100514935]
cid: 620, volume: 179.30527092869087, center: [23.953875297135852 3.6409480301395103 40.26883586367465]
cid: 621, volume: 89.17278894654908, center: [24.296624461026294 17.637881073323925 22.557679351534933]
cid: 622, volume: 126.11310448051118, center: [24.155488136794894 20.751167241167668 1.4249730011601798]
cid: 623, volume: 64.53542347543124, center: [23.806144602349434 23.034553331569967 11.368835350341298]
cid: 624, volume: 183.33283514363734, center: [24.39933895418678 47.46330661282073 33.151245219909036]
cid: 625, volume: 42.71420642023302, center: [24.045801078764434 0.6782995451933702 8.946530301436463]
cid: 626, volume: 67.06838378248742, center: [23.54189008608858 61.34272112955665 6.6535361812807885]
cid: 627, volume: 24.432840725827578, center: [26.522431979443898 15.379483986220219 0.5320337762395364]
cid: 628, volume: 10.824078827668625, center: [24.27098704542145 30.952006434593024 0.4192593501453488]
cid: 629, volume: 181.74383519945923, center: [24.220678460238524 39.328476053912745 23.29491236839508]
cid: 630, volume: 210.7548836852455, center: [25.81473415302028 2.987410465019409 62.57035671911019]
cid: 631, volume: 23.4888803629495, center: [24.664045123389958 27.85766857896852 65.28555816751508]
cid: 632, volume: 133.99517351054314, center: [24.791437740381415 38.01835742180345 49.035236184043676]
cid: 633, volume: 142.08176728586534, center: [25.198941421101253 2.042708908016831 16.833790946761155]
cid: 634, volume: 161.33855868857813, center: [25.207600575820265 3.8371051693515357 29.74010492047782]
cid: 635, volume: 117.82198595989874, center: [24.824714377053905 32.54451666137001 13.05339066261183]
cid: 636, volume: 257.0246741389859, center: [25.64957207084096 42.17170667790292 61.23070418189998]
cid: 637, volume: 205.68896307113314, center: [25.009217154149493 46.135728373703536 44.791038297544745]
cid: 638, volume: 220.06862593230917, center: [26.42505843798368 12.714750521139548 63.76556686782242]
cid: 639, volume: 88.82667014682711, center: [25.29711790213093 31.54570093273114 9.094804424814027]
cid: 640, volume: 144.96084639264348, center: [25.493504677377192 32.09168241108097 48.39109372091383]
cid: 641, volume: 86.35664053062948, center: [24.701006451990896 60.59156471515759 1.9391037758608127]
cid: 642, volume: 10.005979846507625, center: [26.029873299883853 0.5318653853773585 11.559544599056604]
cid: 643, volume: 320.490275869822, center: [27.144584691628356 13.007530622247312 55.57354435880909]
cid: 644, volume: 99.19450146577134, center: [25.328460739595403 13.64001236369548 22.21249525884219]
cid: 645, volume: 155.62759849316575, center: [26.769831604509175 15.341095928497776 9.008156716467854]
cid: 646, volume: 143.7494305936166, center: [25.414341528929715 30.496362132319142 4.090520707814381]
cid: 647, volume: 156.00518263831697, center: [26.028214693142775 17.585794743455022 13.401297541942316]
cid: 648, volume: 105.70782796963007, center: [26.193726460947754 11.737302809316862 35.93750265671975]
cid: 649, volume: 123.72173822788672, center: [26.337779952580863 14.771903288339267 18.22083201717955]
cid: 650, volume: 201.4096760927525, center: [26.168304619438306 17.214802198008123 4.768073655264803]
cid: 651, volume: 228.72159592535823, center: [27.069454050779846 24.419832574969046 61.430404129715235]
cid: 652, volume: 435.9680935952402, center: [23.84413999325324 27.441499916682908 46.42124504265454]
cid: 653, volume: 144.378737502202, center: [26.001292637003008 30.446905091533182 18.108590473913043]
cid: 654, volume: 129.9833419683113, center: [25.685223087162953 33.57499976586783 22.166778068082788]
cid: 655, volume: 145.196836483363, center: [26.333891971940965 41.29169502592914 46.128003367905514]
cid: 656, volume: 79.87477937220001, center: [26.74209063198466 6.8089534950561355 37.12349357331101]
cid: 657, volume: 122.13273828370862, center: [27.07810446918744 9.311040513165013 24.239631619206495]
cid: 658, volume: 136.95291598089443, center: [26.65087861846701 44.3398679743251 35.51906036040207]
cid: 659, volume: 57.392790062987125, center: [26.7746328188115 0.7084072032072369 27.47451138963816]
cid: 660, volume: 90.95058096330278, center: [27.45165342179037 12.479445811831864 13.526943527970941]
cid: 661, volume: 81.54244267995128, center: [27.138749975773415 0.9199568865714838 51.297866685934785]
cid: 662, volume: 76.68104681112918, center: [26.57813135005229 15.430205507406649 37.02407483377103]
cid: 663, volume: 316.58857303659266, center: [27.73397859263846 17.59878075094668 53.927053491397906]
cid: 664, volume: 124.57130255447699, center: [26.702237533523224 19.070664951717607 37.495235321760546]
cid: 665, volume: 281.78790099182083, center: [28.129376131351094 27.36092254272793 56.58792123942828]
cid: 666, volume: 115.14743159841085, center: [27.080450816632926 28.351971725836865 13.165200683331056]
cid: 667, volume: 240.12778364346835, center: [27.148416254942205 40.76601508604468 32.030880365983094]
cid: 668, volume: 153.18903422239737, center: [28.169460408414547 44.304180811574405 64.74496031365923]
cid: 669, volume: 44.39760240069892, center: [27.451901008228585 9.144009713642806 0.7758651479447201]
cid: 670, volume: 87.63098702051488, center: [27.456002742852426 27.941834041023338 8.389786849443448]
cid: 671, volume: 127.08853018881854, center: [27.289504645132677 33.94876900216638 26.577638781889082]
cid: 672, volume: 170.08592471791496, center: [27.83803915213697 11.344810758514477 3.819053054907039]
cid: 673, volume: 101.69599642739824, center: [27.914515248779846 4.50873679743193 25.72861276865718]
cid: 674, volume: 60.16174046076282, center: [26.901591064324172 29.833022134597282 22.159590436898537]
cid: 675, volume: 273.0877329806279, center: [27.442638644133975 34.633077929122024 57.85298963859316]
cid: 676, volume: 183.19124108920562, center: [27.238742449677765 36.87281747633116 29.250170638474753]
cid: 677, volume: 112.78753069121565, center: [28.266161924422416 6.680263173720184 21.396739635751153]
cid: 678, volume: 142.99426230331414, center: [28.173721279336434 10.156501395830125 32.92229790435692]
cid: 679, volume: 249.1898031270979, center: [29.28743409807072 17.0480557464297 60.038197752667465]
cid: 680, volume: 108.94875854884481, center: [27.4417462579161 19.608043002931407 31.93047640722022]
cid: 681, volume: 135.69430216372368, center: [28.058052822021686 24.690391323895653 16.58740011502609]
cid: 682, volume: 162.1881230151684, center: [28.180918601646464 36.226313908827244 43.860117808507134]
cid: 683, volume: 156.7918162740487, center: [28.06059241057185 42.10632519334738 40.814888295544854]
cid: 684, volume: 70.26211634355825, center: [28.87029016258326 1.4173998409090909 1.4406683468652037]
cid: 685, volume: 186.2276469231301, center: [28.09875882913503 2.8305747315789476 34.8139581631579]
cid: 686, volume: 146.53411366410694, center: [28.010356871291897 5.153052106839167 54.39892870532532]
cid: 687, volume: 141.53112374085313, center: [28.917919556635248 7.159538160960427 6.865302816462872]
cid: 688, volume: 93.70379868836385, center: [27.500019587636995 16.29031856882136 31.416288138969108]
cid: 689, volume: 171.20294448065403, center: [27.674649140466563 24.9091328636372 21.573592609777617]
cid: 690, volume: 130.72277758589914, center: [27.653537307951243 24.880738838416175 26.971045556107835]
cid: 691, volume: 57.487186099274936, center: [26.97298370345623 27.160250201149424 0.902874003448276]
cid: 692, volume: 76.30346266597795, center: [27.612916270373017 27.235868201752577 4.3211376340206185]
cid: 693, volume: 130.32946076803327, center: [27.706809396673883 28.646054163013037 27.71913236690005]
cid: 694, volume: 163.47820217776842, center: [28.57820069529452 38.67786651569627 37.94794517643153]
cid: 695, volume: 94.14431352437362, center: [29.35147763818536 2.0892261377506687 4.824076368499331]
cid: 696, volume: 171.39173655322963, center: [29.263929052277504 4.295790114200477 64.37861012852946]
cid: 697, volume: 122.44739173800131, center: [28.78923035037434 5.9188441988950276 2.459486235950148]
cid: 698, volume: 129.2596390234381, center: [27.895095409973763 20.2568168906889 26.528079418196203]
cid: 699, volume: 129.3855004051552, center: [27.82555622799094 24.010766331639104 32.43776430189689]
cid: 700, volume: 155.4702717660194, center: [28.186123424581872 30.14796190148755 32.320260827079544]
cid: 701, volume: 150.7032719334851, center: [28.411383765093266 10.026133724083934 17.465195579956156]
cid: 702, volume: 83.38316538756354, center: [28.18848954129678 11.44746123328302 48.796337199452836]
cid: 703, volume: 170.5107068812101, center: [28.946693892408625 21.771293136261303 55.52484863832811]
cid: 704, volume: 145.32269786508007, center: [28.436965252130424 33.7047402277038 34.97431949285482]
cid: 705, volume: 199.96227020300614, center: [28.798494383976074 2.282456739040126 56.573028027309206]
cid: 706, volume: 116.37458007015235, center: [29.135019802953902 4.8854929783696095 18.48021992283358]
cid: 707, volume: 105.09425373375932, center: [28.74013871514642 14.696684191796406 28.361389765284432]
cid: 708, volume: 158.11336078207802, center: [29.189177076082142 19.444957258059702 20.475814083074628]
cid: 709, volume: 135.64710414557976, center: [28.1528803188491 24.50331460059151 36.23703810873347]
cid: 710, volume: 105.1729170973325, center: [29.40401818922211 1.899112735287958 22.974448406701573]
cid: 711, volume: 155.75345987488282, center: [29.71768368664139 5.730295381363637 12.64333411790909]
cid: 712, volume: 122.17993630185252, center: [28.798619417221186 10.098890727659025 10.80443014133402]
cid: 713, volume: 149.0198759530192, center: [29.12928239866733 23.628669041427365 11.31063069387669]
cid: 714, volume: 19.083732002851804, center: [28.91912177711913 25.33499899513603 65.2731211746084]
cid: 715, volume: 166.59327137526608, center: [28.585298166491008 28.042969010747 38.586689711955806]
cid: 716, volume: 254.5546445227883, center: [28.201063652035508 30.921817016662544 52.376255898522864]
cid: 717, volume: 187.25027064958135, center: [29.98070083945113 9.40414568431356 53.31814479467316]
cid: 718, volume: 123.70600555517208, center: [29.54707071006635 22.90582524078596 1.9179501629912248]
cid: 719, volume: 124.79155997248188, center: [29.46941368669252 23.70042163263994 6.34139143392587]
cid: 720, volume: 132.57923296622602, center: [28.883248213443597 32.57467511363475 39.64212275863297]
cid: 721, volume: 148.09164826285576, center: [30.028979182247713 40.114773675247 57.594535854180386]
cid: 722, volume: 120.16615419437929, center: [30.09536911286055 1.8602418581696778 8.809280146661429]
cid: 723, volume: 313.7094939298145, center: [31.01180689372827 9.031837746018054 59.873970301083254]
cid: 724, volume: 144.41020284763127, center: [30.21525906219237 2.0731772241420634 14.519739394454733]
cid: 725, volume: 130.0305399864552, center: [30.664103189087186 34.12173505568058 64.00576511292196]
cid: 726, volume: 94.52189766952485, center: [29.693507245164362 16.455087814613847 24.55313114460719]
cid: 727, volume: 85.06656136802944, center: [31.12934381062263 18.35414757869429 1.1932623068244868]
cid: 728, volume: 91.18657105402231, center: [30.183343781064274 20.40037491304348 15.91744936304348]
cid: 729, volume: 370.7246998476504, center: [31.559358176687176 28.35992326259124 62.68483222645136]
cid: 730, volume: 175.639558186181, center: [30.94565504181905 6.64862353301684 29.13137230872447]
cid: 731, volume: 44.28747369169648, center: [30.199457036720005 10.877705485257549 29.771784217833037]
cid: 732, volume: 153.07890551339494, center: [31.259285793346184 19.073571239568345 10.139604389568346]
cid: 733, volume: 82.07735355224887, center: [30.786962211876098 1.2912919566992527 30.520755526624495]
cid: 734, volume: 155.23428167529988, center: [31.88719621224553 37.01611164776528 62.61875142450593]
cid: 735, volume: 52.98764170288943, center: [30.269690849077286 0.9378740777315915 19.524464383165082]
cid: 736, volume: 136.68546054474567, center: [31.654590007102524 19.09237257413674 5.239132762741713]
cid: 737, volume: 99.38329353834695, center: [31.778346699239208 10.865994921988285 64.70775741138199]
cid: 738, volume: 192.992696190423, center: [32.303818895748975 16.624115773661043 63.332397692834434]
cid: 739, volume: 192.75670609970348, center: [31.974458174067927 13.175868080778647 20.435939911385894]
cid: 740, volume: 202.54242852820622, center: [32.08839723643839 15.349414772898866 15.578713895890942]
cid: 741, volume: 62.50590869524338, center: [32.66383619587508 0.9263076832871886 59.75786742678077]
cid: 742, volume: 128.45727271499175, center: [32.67417316003662 4.119888706956521 50.38824734781384]
cid: 743, volume: 170.4163108449223, center: [32.16266651759745 10.658044088635524 24.56461169177437]
cid: 744, volume: 88.79520480139784, center: [32.96188227165066 22.962144271775337 64.61523585898298]
cid: 745, volume: 165.25599419452215, center: [32.81957786680874 14.1486917895754 2.6511729591488957]
cid: 746, volume: 121.58209473869641, center: [33.11714125945228 14.645752983152175 8.147084354076087]
cid: 747, volume: 230.54658596025584, center: [33.456617837250704 26.17526864062372 50.72297316819298]
cid: 748, volume: 8.25965317518318, center: [32.60740645877864 0.440767872 63.762888372]
cid: 749, volume: 96.03223425012978, center: [33.13184354783378 6.172147264678899 62.543735277522934]
cid: 750, volume: 80.83447240779272, center: [33.61141282240338 11.816007664577658 6.696735036784741]
cid: 751, volume: 416.7113021925274, center: [34.162426766217294 41.979764880541396 61.8392995582852]
cid: 752, volume: 13.29410844386626, center: [33.62602916405216 1.897931677633136 65.46564768816569]
cid: 753, volume: 212.34388362942357, center: [33.77507838069439 4.246548377817293 25.117979845210048]
cid: 754, volume: 85.66440293118555, center: [33.227211140026 14.329937863856749 11.97310329168044]
cid: 755, volume: 236.10021942852188, center: [33.49048860331903 33.68796668939828 57.15429197455854]
cid: 756, volume: 162.84889526918303, center: [33.925949672340856 27.638959604192834 56.41942772359192]
cid: 757, volume: 135.23805465499927, center: [33.87056569456797 7.843992858713356 49.72266740081433]
cid: 758, volume: 79.74891799048294, center: [33.82299981461253 9.385382161905703 1.236054688064707]
cid: 759, volume: 243.0225954229611, center: [34.736483607669406 22.23462323198679 54.24231339380462]
cid: 760, volume: 138.0227377254896, center: [34.665270315256386 8.645586837934573 4.935411503533569]
cid: 761, volume: 241.43359547878302, center: [34.68420533844682 9.358558848423042 12.259426392265086]
cid: 762, volume: 191.32503288267174, center: [35.022296863795894 12.868569296497 49.268778513091036]
cid: 763, volume: 128.78765884199908, center: [34.75982729496439 3.472141074370877 1.4506406746396288]
cid: 764, volume: 161.2441626522903, center: [35.05488816708593 4.4837686207142164 6.328223174465802]
cid: 765, volume: 239.970456916322, center: [34.998262104172966 6.821520422257916 18.0153416552547]
cid: 766, volume: 108.854362512557, center: [35.34047831927542 1.2513464457146986 52.92966695072988]
cid: 767, volume: 261.9175353532373, center: [35.2824455012261 5.325118672885632 56.66907873845507]
cid: 768, volume: 172.9650038246931, center: [35.16610738653626 16.339901464808076 54.922145523913045]
cid: 769, volume: 34.4388205723352, center: [35.84483779340627 37.016993752489725 56.806145053540426]
cid: 770, volume: 55.20594855565291, center: [35.65643519726591 0.7136474764890282 5.3246497598746085]
cid: 771, volume: 19.94902900215671, center: [34.422531513893524 0.45180082831230284 25.245295372003152]
cid: 772, volume: 105.44037253348128, center: [36.03663516072633 1.7370836263205014 16.099873540017906]
cid: 773, volume: 118.19957010504997, center: [35.65388781406455 1.9055229666045521 20.693923092586186]
cid: 774, volume: 198.10581482267924, center: [35.92551309592773 3.0105730734672806 11.134821771275412]
cid: 775, volume: 83.43036340570744, center: [36.31132979913724 33.00558474116538 61.155725502960586]
cid: 776, volume: 23.536078381093404, center: [35.59294257251937 31.107578655681817 65.24289933168448]
cid: 777, volume: 20.49967254716892, center: [36.1079431536726 34.52428547590176 65.07781461366078]
cid: 778, volume: 132.4848369299382, center: [36.85691473292824 17.240744263591022 64.09313096234415]
cid: 779, volume: 316.1165928551536, center: [37.133628647699744 11.913087529811378 56.43879951110337]
cid: 780, volume: 323.3221569584563, center: [37.25308624308953 20.602376378789355 60.608257754031435]
cid: 781, volume: 86.48250191234655, center: [36.5707439468583 1.4486180055302893 63.1578351182827]
cid: 782, volume: 208.45791346890883, center: [38.05199242070003 7.557935986709434 62.621532326513204]
cid: 783, volume: 285.5952077887624, center: [38.06738676491553 21.736431678962155 49.97319935620558]
cid: 784, volume: 167.5057663927149, center: [37.95439760474939 28.83221663984221 55.25748055621302]
cid: 785, volume: 137.660886253053, center: [38.44358577806754 2.99183436672 59.96766273192]
cid: 786, volume: 224.4895069651215, center: [40.07166167465627 12.492119101408647 63.468970833071694]
cid: 787, volume: 294.2639104545261, center: [39.48312308954758 27.790846886227545 61.78360042949102]
cid: 788, volume: 125.94004508065021, center: [40.19465406664842 10.650642751292942 51.422015046108676]
cid: 789, volume: 206.20814127071608, center: [39.815135580047155 17.52895208892195 56.30834739418631]
cid: 790, volume: 133.8850448015407, center: [40.73559371430124 24.24627487878966 64.23509059262045]
cid: 791, volume: 171.6434593166638, center: [39.8380533421362 5.941871676544455 53.41385279942255]
cid: 792, volume: 375.4445016620408, center: [39.90057796715093 35.2712044256998 58.63237006120097]
cid: 793, volume: 95.51305605054684, center: [40.7234535140111 32.83326729122056 64.52860875575688]
cid: 794, volume: 130.78570827675767, center: [41.2984834440125 3.7902146169974738 64.39095972407074]
cid: 795, volume: 198.9553791492695, center: [40.85212327841226 37.31721324614898 63.51506584787285]
cid: 796, volume: 87.26913554807828, center: [40.92872861244878 1.4145087974040023 56.50058781460248]
cid: 797, volume: 114.09334252653034, center: [42.83364155044934 41.87533361901544 64.5965549003861]
cid: 798, volume: 275.667891305828, center: [42.21697452833688 17.998290459947494 51.255988465534756]
cid: 799, volume: 108.74423380355455, center: [42.56023389738179 19.302387286935765 64.34173010295139]
cid: 800, volume: 287.593257223521, center: [42.526105327464506 26.13876745330963 55.398284365043764]
cid: 801, volume: 10.949940209385701, center: [42.30452999296555 0.4371440620689655 62.728248857327586]
cid: 802, volume: 146.17226219167034, center: [43.84905366636608 6.690993768421053 57.014668418114304]
cid: 803, volume: 18.51735578512496, center: [44.19423894971293 8.418937336108751 65.33516797544605]
cid: 804, volume: 157.0120736920536, center: [43.83894813045954 10.30057819995992 61.2733152705511]
cid: 805, volume: 183.99360739765197, center: [44.84082549659806 16.586172127900813 57.758423292851646]
cid: 806, volume: 190.66426062865708, center: [45.072100455550945 11.814231455111809 55.199269080163376]
cid: 807, volume: 36.16941457094501, center: [45.473515329468604 13.46943830969987 60.69378763270987]
cid: 808, volume: 161.32282601586348, center: [44.969911067882016 3.5939948988004677 60.78936553042715]
cid: 809, volume: 256.8830800845542, center: [45.00250161723157 22.509041685191082 58.03562827296056]
cid: 810, volume: 162.5185091421757, center: [45.05369791046867 31.00366195591481 60.123507355527586]
cid: 811, volume: 68.81471045381187, center: [45.96223377330182 2.4005297555555556 64.49357146296296]
cid: 812, volume: 25.943177306432503, center: [45.98239678486587 13.528628424196484 65.24779771855671]
cid: 813, volume: 138.41605454335547, center: [46.51264386854574 28.582707305967265 62.97186922324392]
cid: 814, volume: 133.36586660195775, center: [46.47102720336781 18.07674262642444 61.220793084723375]
cid: 815, volume: 123.47001546445257, center: [46.85702210321878 35.590199279854744 63.93795942595566]
cid: 816, volume: 91.01351165416133, center: [48.210513177841435 17.731953023076926 64.64768077384616]
cid: 817, volume: 49.33766163309419, center: [48.678220530291945 31.70692232745536 65.02695996026786]
cid: 818, volume: 201.78726023790375, center: [47.84402023759648 23.84040311056448 63.45845960138781]
cid: 819, volume: 98.48653119361278, center: [48.4194544815298 7.813766187555911 64.49778753345048]
cid: 820, volume: 166.8764594841295, center: [49.16499660934493 10.878723337446969 62.316766541095504]
cid: 821, volume: 150.78193529705828, center: [49.95715058814217 14.960457381010016 61.04917801640234]
cid: 822, volume: 28.916652449498446, center: [50.58284903584752 22.6254662562568 65.24547976795431]
cid: 823, volume: 12.853593607856492, center: [50.543665889339934 27.989797651652385 65.35782644357406]
cid: 824, volume: 9.533999665068585, center: [52.364794967504366 16.803315435643565 65.40652966732674]
cid: 825, volume: 33.08581071887662, center: [1.4208783171038617 0.6419968786019972 30.2688601721826]
cid: 826, volume: 62.15978989552142, center: [1.5319562702168918 37.17300699643128 51.905631903340925]
cid: 827, volume: 70.9228885975729, center: [3.4480221733851097 39.272286214285714 58.407767380900616]
cid: 828, volume: 311.837305876773, center: [5.827090540047321 41.154554909247764 52.86966901860148]
cid: 829, volume: 61.70354238679701, center: [18.84576781354504 13.070906826593575 46.2890533672871]
cid: 830, volume: 241.54372418778544, center: [19.078680960585974 34.278369446902886 59.18896224429101]
cid: 831, volume: 54.293453538204105, center: [22.43303590496764 19.163300880730223 44.52901322373226]
cid: 832, volume: 25.0778803071276, center: [22.558316292629907 40.47155464178168 59.53974432948557]
cid: 833, volume: 134.7031437827017, center: [24.187724632343365 22.124907836860547 46.54483817939734]
cid: 834, volume: 176.99256803963956, center: [26.69512146729747 22.185727743386668 41.35057329293333]
cid: 835, volume: 36.814454152245034, center: [26.769762283439384 4.150985981153846 50.43069689089744]
cid: 836, volume: 83.69781884185623, center: [27.114800507226533 7.5450889199999995 49.23513863328947]
cid: 837, volume: 97.52683815802007, center: [29.51722147649222 21.28981786338119 49.536934408969195]
cid: 838, volume: 7.882069030031949, center: [10.940068842164004 53.99802025808383 16.093718380239523]
cid: 839, volume: 100.7205707190909, center: [19.78048057722261 3.125786045126523 45.799791750140585]
cid: 840, volume: 68.79897778109724, center: [23.7674821514129 5.075190987468557 50.99768910178367]
cid: 841, volume: 129.55855980501616, center: [23.599181157519894 15.118361426229509 42.10170136258652]
cid: 842, volume: 122.54178777428912, center: [31.65465339618277 15.744892115996919 49.14640014268841]
cid: 843, volume: 5.569366140980659, center: [46.30395768239188 43.35328493050847 65.50883963898305]
cid: 844, volume: 32.42503846486197, center: [20.4928406593049 14.856575352983988 43.39133615909753]
cid: 845, volume: 44.05148360097696, center: [26.078102514356218 19.581265758 49.79003030475]