#group 1
#p_0 p_1 ...
0.00044451 0.326711 0.00134786 0.372494 0.0074453 0.650675 0.425577 0.00132738 0.00059816 1.16421 0.00934959 0.116588 2.89809 0.0956846 0.00111533 0.0307425 0.411592 0.0393679 1.7942 0.0228893 2.22839 0.0073861 0.234309 6.76137e-06 0.220864 0.549842 0.0248652 0.00188595 0.365145 1.22502 0.00608356 0.000515191 0.00246326 
0.00115294 0.326711 0.00163091 0.338631 0.0074453 0.537748 1.00349 0.00416589 0.000494347 1.16421 0.011313 0.0963537 3.50669 0.169511 0.00101394 0.0307425 0.411592 0.0393679 1.97362 0.0117458 1.52202 0.0158328 0.234309 1.3176e-05 0.220864 0.499856 0.0248652 0.00106457 0.711564 4.65201 0.00234548 0.000468355 0.00246326 
0.000344749 0.00735514 0.0129863 0.150638 0.0298464 0.327943 0.00678134 3.0819e-05 0.00246476 0.118106 0.00303722 0.00401349 3.44286 0.872144 0.16587 0.00174903 0.446465 0.170939 2.38289 0.0129896 0.0943498 0.0278942 0.08947 0.0833243 0.631675 0.637478 2.05572 0.000449997 0.000173272 0.293653 0.0729044 0.306783 1.31945 
0.00596811 0.121003 0.000593652 0.476095 0.00867518 0.71116 0.00317576 0.1207 0.000164058 0.521769 0.0866133 1.47306 0.00100739 0.0262363 0.023921 0.020091 0.215832 0.0206095 0.0547767 0.00010216 201.587 0.0181291 0.0843354 2.81208e-05 0.180467 0.158388 0.16949 0.00303372 0.182885 8.1278 4.62594 1.29356e-08 0.00165757 
0.0319102 0.230514 0.00296172 0.528137 0.0180324 0.691598 0.000666295 0.653749 0.0231413 0.506993 0.022131 0.638579 0.313202 1.49224 0.00380447 0.00775783 0.0779925 0.000518578 0.0400483 0.00184721 0.230979 0.0184238 0.139494 0.000112538 0.245567 0.186519 0.149626 0.353293 0.613002 0.610346 0.0923477 5.60634e-07 0.388864 
0.00612517 0.0925954 0.00151983 0.463079 0.0154263 0.683718 0.00618867 0.402818 0.00202404 0.281542 0.0193456 0.0133341 0.477115 0.2828 0.113649 0.00750234 0.429344 0.0210738 0.598827 0.00916647 0.159788 0.0284484 0.123475 0.0150358 0.386846 1.45039 0.029945 0.0533935 2.70679 1.35226 0.262838 0.000589175 1.15931 
0.0969043 0.0120789 0.01955 0.227102 0.0392526 0.723879 0.0712523 0.00336728 0.00849911 0.130895 0.000324075 0.000211263 0.000101916 0.0784288 0.000163373 0.00259571 0.039751 0.211451 0.537133 1.09939e-07 0.480681 0.13863 0.0165224 11.6403 0.103709 0.00118408 0.133572 0.871523 0.000823998 0.00182291 0.129068 0.126137 0.000205038 
0.0337875 0.0186232 0.0254768 0.166882 0.0509692 0.468538 0.138851 0.00310086 0.00142763 0.112547 0.00034859 0.00014664 0.00131013 0.070038 0.000121816 0.00556413 0.033649 0.295121 0.409645 4.40373e-07 0.222478 0.087083 0.0136578 1.93561 0.0924548 0.0104312 0.140099 0.845108 0.00244196 0.0193353 0.194471 0.011835 0.0086143 
0.0900583 0.0415597 0.0295813 0.21106 0.0430114 0.634759 0.283876 0.0279223 0.000261376 0.0965521 1.88987e-05 0.000158699 0.00130759 0.154125 0.00447921 0.0064749 0.205794 0.127172 3.14666 6.15684e-07 0.336635 0.118789 0.0195623 1.22959 0.148899 0.0797155 0.0118796 0.0696461 2.07218e-05 0.000557868 0.0906431 0.0688746 0.000348065 
0.000364747 0.132103 0.00165028 0.425008 0.00713476 0.812289 4.09636 0.0395218 1.23724e-05 0.191008 0.0159111 0.126138 0.0112914 0.463579 0.840832 0.0329383 0.0198616 0.0850003 5.7267 0.00128242 0.238777 0.090103 0.0331228 0.000105825 0.134185 0.114047 0.00781891 0.000615219 0.0752061 5.28626e-06 0.158514 0.298062 0.356052 
0.00715593 0.0378762 0.00616055 0.0715641 0.0687602 0.243262 0.516995 0.00597066 1.58284e-05 0.467413 1.65374 0.00440653 1.06793 0.393926 0.0343995 0.0116279 0.0914368 0.281645 1.02097 0.0132328 0.117371 0.00904928 0.570539 0.506887 1.18767 0.588301 0.509148 0.347291 0.0125283 0.0138266 0.00641326 1.02345 0.269232 
0.00367213 0.081191 0.0145263 0.247059 0.02651 0.521454 0.0698618 0.0646903 2.84688e-06 0.565569 1.36673 0.00944579 1.2922 0.844415 0.0343995 0.0127907 0.0914368 0.144529 1.35891 0.00216367 0.0662529 0.0176345 0.690352 0.460806 0.981547 0.128031 0.121886 0.420222 0.0475761 0.0152092 0.0243544 0.699027 0.0857856 
0.00340945 0.13748 9.44734e-05 0.0256905 0.0572181 0.0289819 0.000787029 0.997843 0.0750966 0.005739 0.036955 2.79592 0.377861 0.290028 0.0698336 0.397246 0.0314343 2.47207 0.635511 0.032025 2.40711 0.0923559 0.332755 0.00691448 0.001366 0.0140853 0.237948 0.937521 0.187073 0.912392 1.49354 0.00338001 0.0658887 
0.0359199 0.05585 0.0016154 0.380092 0.010974 1.05941 0.00213051 0.00156708 0.00556214 0.0846488 0.0145583 0.671572 0.0928174 0.0415647 0.0011763 0.0560011 0.0584426 0.924072 1.22502 0.0945324 0.308579 0.034975 0.0180726 1.14275 0.207565 1.0984 0.967665 0.127022 0.000537037 0.438692 0.000684171 0.0721533 0.243074 
0.00341005 0.132745 0.0205151 0.119554 0.113377 0.285755 0.00619684 0.111043 0.00766193 0.245286 0.000526045 0.018355 2.93781e-06 0.0267873 0.0001286 0.295877 1.20645 1.61303 0.138972 0.0522409 0.398841 0.0213101 0.19056 0.0245309 0.813019 0.420983 0.0666486 0.000551203 0.688317 1.21267 0.0117982 0.0070508 0.249461 
8.83882e-05 0.96331 1.77275e-05 0.772349 0.00693824 2.07097 34.3009 0.00408127 1.54287e-05 0.335296 0.0250676 0.00281947 0.405608 0.0521914 0.423301 0.2327 0.015556 0.00165757 1.5977 0.125214 0.0753496 8.47238e-06 0.233077 0.000969245 0.717375 1.13415 0.0216691 1.44642 0.0769388 0.137416 1.76099e-09 0.0128141 0.0195371 
4.87669e-05 1.20845 0.000440544 0.225248 0.0509233 0.102267 0.341405 0.00562902 5.88191e-05 0.0722286 0.718806 0.101066 7.09904e-07 0.0543636 0.0066191 0.339418 0.0505952 0.201086 0.784381 1.64891 0.213371 0.0386108 0.0522777 0.0806148 0.676547 1.04205 2.49771 0.00699494 0.000292375 0.0112167 0.000441934 8.8578e-07 0.00160172 

#Group 2
#p_0 p_1 ...
 
2.24341e-06 0.934116 1.22236 0.0692784 0.00766993 10.1696 3.61444 0.00264909 0.000112858 0.057522 0.00328347 1.47707 0.437042 0.036386 0.000393348 0.197411 0.000245753 0.186498 0.0208184 0.000979823 0.0703098 0.0231725 0.152168 5.64139 2.04779 1.64054 0.0963611 3.5082 0.362472 0.00138184 0.000492257 0.0284502 0.122702 
3.27959e-05 0.978598 0.471274 0.130338 0.00653594 15.7049 5.25598 6.93108e-05 9.41221e-05 0.0256147 0.00869228 1.33671 0.192857 0.069237 0.000142966 0.0724863 0.000670811 0.0720663 0.0193603 0.00231562 0.0971524 0.0004099 0.0484854 0.0743796 2.04779 3.28145 0.137603 0.337675 0.0417392 0.00277347 0.00328918 0.00792904 0.561905 
9.15776e-08 0.931998 0.832997 4.12949e-05 0.0171263 3.5402 0.0604106 2.78792e-06 0.000612713 0.129469 0.00194611 0.277684 0.217013 0.0717154 1.82947e-05 0.079735 1.35302e-07 0.0915602 0.00542025 0.00451249 0.0841146 0.0114023 0.175754 0.0168241 1.27152 1.38695 0.14124 0.105539 0.00259562 0.00721001 0.013771 0.00399562 0.0147356 
3.18187e-12 1.05032 7.64653 0.0162507 0.00179766 0.877116 0.0515498 1.22375e-05 0.00034826 0.149239 0.00149686 0.358386 0.0213563 0.0492055 1.40431e-06 0.15453 5.76828e-05 0.139142 0.00270787 0.0612216 0.0867095 0.00420043 0.13153 0.11538 0.896053 0.0170831 0.0962756 0.00747606 2.08222e-06 0.00232746 0.000132351 0.038392 5.78131 
3.24632e-05 1.1841 0.481539 0.0128187 0.00103056 2.45948 0.720788 0.000712783 1.718e-05 0.0632742 0.00940026 0.861654 1.02819 0.0447322 0.00187003 0.21666 5.22825e-05 0.178425 0.0415949 0.00493574 0.0668098 0.0174494 0.138335 0.925542 1.86163 0.203599 0.0954901 1.93584 1.15319 0.00267762 0.00204468 0.0158782 1.12649 
1.13781e-05 1.07646 0.0444442 0.010594 0.00473539 0.58878 0.369878 0.000249826 0.000247753 0.0432171 0.0053062 1.84703 11.1401 0.0595386 0.000720978 0.111181 5.75107e-05 0.100716 0.00822933 0.00407912 0.0734908 0.01311 0.103933 0.294906 2.25257 0.70288 0.0789174 0.382995 0.0130751 0.00631369 0.0137556 0.0144347 1.49936 
0.000149167 1.73365 0.115277 0.00963091 0.00243 1.04306 1.27692 0.000589077 3.04355e-05 0.0243949 0.00854569 0.647374 0.479656 0.0792459 0.000117886 0.134529 0.000829362 0.0756696 0.00995749 0.00337118 0.0889239 0.00214359 0.0484854 1.11991 2.04779 1.65735 0.940552 0.348177 0.0967591 0.00356391 0.0574605 0.00896281 0.0710134 
1.61176e-06 0.562973 0.250189 0.00449289 0.0122824 3.00071 198.766 4.62203e-07 6.83944e-06 0.0338932 0.00498591 0.0759018 0.315378 0.335969 0.000158299 0.0390669 0.0013925 0.0717882 3.24255 4.03415e-05 0.0968849 1.3073e-05 0.0207889 0.000336442 0.6546 1.79757 1727.31 6.23924 0.000101315 2.61128e-05 0.233161 18.9911 0.000132274 
8.61894e-09 0.819115 0.441411 0.000184746 0.0122824 3.38071 0.000962569 1.88526e-06 0.00173654 0.213112 0.00281272 1.6459 0.0255549 0.054126 0.00270639 0.139217 1.64944e-05 0.169843 0.00231112 0.00102828 0.121245 0.029389 0.0978203 0.0447074 0.392403 0.0109757 0.0378067 0.00523394 0.000394072 0.00433207 0.087083 0.049858 0.9361 
4.9738e-08 1.1841 0.437763 0.000311552 0.0564372 0.535254 0.00614007 5.01808e-06 9.55195e-05 0.112094 0.0125117 0.365426 0.138939 0.0958875 0.000655435 0.101074 1.66588e-05 0.0915602 0.00122324 0.00493574 0.107598 0.00194872 0.222789 0.574689 2.04779 0.0072449 1.51477 0.00326256 0.000681196 0.0424754 0.00482125 0.53992 0.0331283 
5.92786e-07 1.30251 0.139485 9.02455e-05 0.0564372 1.38831 0.0131618 7.45906e-07 4.45605e-05 0.180529 0.0183184 0.486382 0.436051 0.116024 0.000369976 0.0759381 7.17274e-07 0.0625369 0.00995749 0.00172995 0.0889239 0.000466508 0.167385 0.0482195 0.955309 0.00371778 0.398886 0.0353489 0.0067096 0.00221291 0.00139654 0.0498325 0.29664 
0.000273971 1.76608 0.205074 0.00192304 0.00613369 0.00855075 0.0544743 0.00470445 0.00722423 0.00402442 0.000297044 0.00376294 0.000533255 0.0416675 0.018045 0.329915 7.13982e-06 0.128875 8.49889e-05 0.0118863 0.0803172 0.00564853 0.00502957 0.156773 1.24026 0.0018903 1.44087 0.146409 0.0047652 0.000693507 0.172635 0.000150253 0.0109661 
7.21451e-05 1.14773 0.00114278 1.24163e-05 0.000780156 0.00161605 0.259112 0.0951141 0.00222365 0.00050047 0.00975557 2.62649e-05 0.000801285 0.0668311 1.10138e-06 0.12891 0.0156722 0.118932 5.11983e-07 0.0590435 0.129131 0.000503623 0.000442642 0.00340487 0.938817 0.0130517 2.57463 39.1415 1.56535e-09 0.00239418 0.00868843 0.00370746 274.71 
4.47964e-05 2.13696 0.225582 0.00119405 0.229427 0.0221784 0.00377743 0.0216168 0.014078 0.00116573 0.000326749 0.000420239 0.000105502 0.0671059 0.0264196 0.204851 1.04534e-05 0.0727467 4.36128e-05 0.0210573 0.0803172 0.0035073 0.000617862 1.27618 0.525993 0.000801672 0.132987 0.672744 3.04978e-05 0.0285342 5.87026 6.3722e-05 0.00619009 
1.30745e-08 1.20753 74.8929 0.00017519 6.39103 0.004312 2479.18 4.55524e-09 0.0711568 0.000951484 0.00139854 0.0182972 0.005557 0.0607038 0.0086966 0.162973 0.14423 0.126622 1.24716e-07 0.000193918 1195.48 0.00107416 0.000714581 0.0544779 0.826865 0.074954 2.09405 0.380935 2.50457e-08 7.82775 35.5878 0.000136771 6.54959e-05 

