<?xml version="1.0"?> 
<VTKFile type="Collection" version="0.1" > 
<Collection> 
<DataSet timestep="0" part="0" file="VTK_cells000000.vtu"/>
<DataSet timestep="0" part="1" file="VTK_walls000000.vtu"/>
<DataSet timestep="1" part="0" file="VTK_cells000001.vtu"/>
<DataSet timestep="1" part="1" file="VTK_walls000001.vtu"/>
<DataSet timestep="2" part="0" file="VTK_cells000002.vtu"/>
<DataSet timestep="2" part="1" file="VTK_walls000002.vtu"/>
<DataSet timestep="3" part="0" file="VTK_cells000003.vtu"/>
<DataSet timestep="3" part="1" file="VTK_walls000003.vtu"/>
<DataSet timestep="4" part="0" file="VTK_cells000004.vtu"/>
<DataSet timestep="4" part="1" file="VTK_walls000004.vtu"/>
<DataSet timestep="5" part="0" file="VTK_cells000005.vtu"/>
<DataSet timestep="5" part="1" file="VTK_walls000005.vtu"/>
<DataSet timestep="6" part="0" file="VTK_cells000006.vtu"/>
<DataSet timestep="6" part="1" file="VTK_walls000006.vtu"/>
<DataSet timestep="7" part="0" file="VTK_cells000007.vtu"/>
<DataSet timestep="7" part="1" file="VTK_walls000007.vtu"/>
<DataSet timestep="8" part="0" file="VTK_cells000008.vtu"/>
<DataSet timestep="8" part="1" file="VTK_walls000008.vtu"/>
<DataSet timestep="9" part="0" file="VTK_cells000009.vtu"/>
<DataSet timestep="9" part="1" file="VTK_walls000009.vtu"/>
<DataSet timestep="10" part="0" file="VTK_cells000010.vtu"/>
<DataSet timestep="10" part="1" file="VTK_walls000010.vtu"/>
<DataSet timestep="11" part="0" file="VTK_cells000011.vtu"/>
<DataSet timestep="11" part="1" file="VTK_walls000011.vtu"/>
<DataSet timestep="12" part="0" file="VTK_cells000012.vtu"/>
<DataSet timestep="12" part="1" file="VTK_walls000012.vtu"/>
<DataSet timestep="13" part="0" file="VTK_cells000013.vtu"/>
<DataSet timestep="13" part="1" file="VTK_walls000013.vtu"/>
<DataSet timestep="14" part="0" file="VTK_cells000014.vtu"/>
<DataSet timestep="14" part="1" file="VTK_walls000014.vtu"/>
<DataSet timestep="15" part="0" file="VTK_cells000015.vtu"/>
<DataSet timestep="15" part="1" file="VTK_walls000015.vtu"/>
<DataSet timestep="16" part="0" file="VTK_cells000016.vtu"/>
<DataSet timestep="16" part="1" file="VTK_walls000016.vtu"/>
<DataSet timestep="17" part="0" file="VTK_cells000017.vtu"/>
<DataSet timestep="17" part="1" file="VTK_walls000017.vtu"/>
<DataSet timestep="18" part="0" file="VTK_cells000018.vtu"/>
<DataSet timestep="18" part="1" file="VTK_walls000018.vtu"/>
<DataSet timestep="19" part="0" file="VTK_cells000019.vtu"/>
<DataSet timestep="19" part="1" file="VTK_walls000019.vtu"/>
<DataSet timestep="20" part="0" file="VTK_cells000020.vtu"/>
<DataSet timestep="20" part="1" file="VTK_walls000020.vtu"/>
<DataSet timestep="21" part="0" file="VTK_cells000021.vtu"/>
<DataSet timestep="21" part="1" file="VTK_walls000021.vtu"/>
<DataSet timestep="22" part="0" file="VTK_cells000022.vtu"/>
<DataSet timestep="22" part="1" file="VTK_walls000022.vtu"/>
<DataSet timestep="23" part="0" file="VTK_cells000023.vtu"/>
<DataSet timestep="23" part="1" file="VTK_walls000023.vtu"/>
<DataSet timestep="24" part="0" file="VTK_cells000024.vtu"/>
<DataSet timestep="24" part="1" file="VTK_walls000024.vtu"/>
<DataSet timestep="25" part="0" file="VTK_cells000025.vtu"/>
<DataSet timestep="25" part="1" file="VTK_walls000025.vtu"/>
<DataSet timestep="26" part="0" file="VTK_cells000026.vtu"/>
<DataSet timestep="26" part="1" file="VTK_walls000026.vtu"/>
<DataSet timestep="27" part="0" file="VTK_cells000027.vtu"/>
<DataSet timestep="27" part="1" file="VTK_walls000027.vtu"/>
<DataSet timestep="28" part="0" file="VTK_cells000028.vtu"/>
<DataSet timestep="28" part="1" file="VTK_walls000028.vtu"/>
<DataSet timestep="29" part="0" file="VTK_cells000029.vtu"/>
<DataSet timestep="29" part="1" file="VTK_walls000029.vtu"/>
<DataSet timestep="30" part="0" file="VTK_cells000030.vtu"/>
<DataSet timestep="30" part="1" file="VTK_walls000030.vtu"/>
<DataSet timestep="31" part="0" file="VTK_cells000031.vtu"/>
<DataSet timestep="31" part="1" file="VTK_walls000031.vtu"/>
<DataSet timestep="32" part="0" file="VTK_cells000032.vtu"/>
<DataSet timestep="32" part="1" file="VTK_walls000032.vtu"/>
<DataSet timestep="33" part="0" file="VTK_cells000033.vtu"/>
<DataSet timestep="33" part="1" file="VTK_walls000033.vtu"/>
<DataSet timestep="34" part="0" file="VTK_cells000034.vtu"/>
<DataSet timestep="34" part="1" file="VTK_walls000034.vtu"/>
<DataSet timestep="35" part="0" file="VTK_cells000035.vtu"/>
<DataSet timestep="35" part="1" file="VTK_walls000035.vtu"/>
<DataSet timestep="36" part="0" file="VTK_cells000036.vtu"/>
<DataSet timestep="36" part="1" file="VTK_walls000036.vtu"/>
<DataSet timestep="37" part="0" file="VTK_cells000037.vtu"/>
<DataSet timestep="37" part="1" file="VTK_walls000037.vtu"/>
<DataSet timestep="38" part="0" file="VTK_cells000038.vtu"/>
<DataSet timestep="38" part="1" file="VTK_walls000038.vtu"/>
<DataSet timestep="39" part="0" file="VTK_cells000039.vtu"/>
<DataSet timestep="39" part="1" file="VTK_walls000039.vtu"/>
<DataSet timestep="40" part="0" file="VTK_cells000040.vtu"/>
<DataSet timestep="40" part="1" file="VTK_walls000040.vtu"/>
<DataSet timestep="41" part="0" file="VTK_cells000041.vtu"/>
<DataSet timestep="41" part="1" file="VTK_walls000041.vtu"/>
<DataSet timestep="42" part="0" file="VTK_cells000042.vtu"/>
<DataSet timestep="42" part="1" file="VTK_walls000042.vtu"/>
<DataSet timestep="43" part="0" file="VTK_cells000043.vtu"/>
<DataSet timestep="43" part="1" file="VTK_walls000043.vtu"/>
<DataSet timestep="44" part="0" file="VTK_cells000044.vtu"/>
<DataSet timestep="44" part="1" file="VTK_walls000044.vtu"/>
<DataSet timestep="45" part="0" file="VTK_cells000045.vtu"/>
<DataSet timestep="45" part="1" file="VTK_walls000045.vtu"/>
<DataSet timestep="46" part="0" file="VTK_cells000046.vtu"/>
<DataSet timestep="46" part="1" file="VTK_walls000046.vtu"/>
<DataSet timestep="47" part="0" file="VTK_cells000047.vtu"/>
<DataSet timestep="47" part="1" file="VTK_walls000047.vtu"/>
<DataSet timestep="48" part="0" file="VTK_cells000048.vtu"/>
<DataSet timestep="48" part="1" file="VTK_walls000048.vtu"/>
<DataSet timestep="49" part="0" file="VTK_cells000049.vtu"/>
<DataSet timestep="49" part="1" file="VTK_walls000049.vtu"/>
</Collection> 
</VTKFile> 
