controls,controls,rectangles,rectangles,triangles,triangles,squares,squares,circles,circles
Average angle,anisotropy,Average angle,anisotropy,Average angle,anisotropy,Average angle,anisotropy,Average angle,anisotropy
-16.87,0.0936,-0.05,0.2587,-4.72,0.0581,16.86,0.0173,-9.11,0.0226
-47.31,0.0326,6.08,0.1045,-58.27,0.0864,1.17,0.0304,-64.24,0.0417
41.82,0.0099,-23.14,0.1738,-42.73,0.065,-70.7,0.0517,10.12,0.0169
76.78,0.0065,-1.94,0.0262,-41.4,0.0642,4.4,0.0779,66.27,0.0847
51.05,0.0175,-15.07,0.0423,-38.74,0.077,-16.63,0.0178,-39.97,0.0342
-2.31,0.0611,5.65,0.1466,-47.06,0.0173,-5.08,0.0601,-37.91,0.0374
-31.32,0.0088,-10.71,0.0693,56.55,0.0941,80.01,0.0656,-15.1,0.0615
-28.93,0.0095,-1.91,0.0621,14.24,0.0325,31.15,0.0272,-43.43,0.0234
-0.81,0.0054,-40.87,0.011,44.77,0.0358,-47.61,0.0513,74.55,0.0759
6.46,0.0142,2.43,0.1094,-47.41,0.0531,63.59,0.063,-19.01,0.0812
11.97,0.0103,-3.91,0.0453,80.74,0.0379,-26.43,0.1592,1.7,0.1399
54.37,0.0376,1.8,0.0456,-46.5,0.0485,65.12,0.052,-88.57,0.0234
-41.55,0.0397,58.13,0.017,71.87,0.0909,7.94,0.0559,22.17,0.03
-53.2,0.0381,9.66,0.0415,-15.21,0.2263,-13.1,0.0368,-2.39,0.064
-0.99,0.0422,5.24,0.0434,-13.14,0.1479,29.05,0.0392,-4.19,0.0255
-42.75,0.0363,7.44,0.053,41.83,0.0268,-38.21,0.0466,27.2,0.0355
-48.74,0.0456,16.25,0.0678,72.21,0.0894,-12.19,0.0476,-15.46,0.059
-56.93,0.0249,-4.19,0.0562,4.87,0.0752,-4.05,0.0403,66.76,0.025
-2.8,0.0231,-17.93,0.0447,-20.07,0.088,13.59,0.0453,62.1,0.047
66.18,0.0094,23.61,0.0489,64.56,0.0777,-15.73,0.0347,-47.99,0.0334
73.75,0.0348,2.03,0.0462,-27.12,0.0208,84,0.0364,-42.94,0.0285
32.42,0.0277,-30.2,0.0373,56.71,0.0502,-24.78,0.084,-15.19,0.0696
,,-34.53,0.0586,18.26,0.027,-20.73,0.0183,46.37,0.0257
,,-14.31,0.0601,-1.56,0.016,-28.01,0.0623,-73.78,0.0588
,,-5.17,0.0799,71.85,0.0455,-71.56,0.0554,84.42,0.0414
,,-14.55,0.1026,-15.67,0.058,-28.05,0.0183,-52.46,0.0309
,,-3.3,0.1306,42.03,0.0524,-40.23,0.009,,
,,-8.3,0.0342,40.24,0.0575,73.25,0.0031,,
,,2.72,0.0727,-84.21,0.0753,23.18,0.0294,,
,,1.65,0.0744,-42.56,0.044,-58.8,0.0172,,
,,6.39,0.0982,19.48,0.0501,5.89,0.0046,,
,,14.49,0.1055,-51.99,0.0765,46.84,0.0167,,
,,2.91,0.0282,52.03,0.017,-30.73,0.0622,,
,,10.05,0.0453,83.81,0.0106,-0.21,0.024,,
,,11.55,0.0873,20.49,0.0375,62.27,0.0233,,
,,-2.36,0.0819,65.31,0.0286,25.57,0.1887,,
,,4.12,0.2031,42.59,0.0163,-27.62,0.1338,,
,,5.07,0.0907,-11.35,0.0711,-62.64,0.0983,,
,,14.89,0.0695,-58.39,0.0455,,,,
,,-28.31,0.1765,4.09,0.0707,,,,
,,3.34,0.2236,-20.11,0.0761,,,,
,,-19.05,0.0564,-3.55,0.0989,,,,
,,8.78,0.0467,14.02,0.0163,,,,
,,9.36,0.2167,-25.38,0.0492,,,,
,,17.92,0.2016,,,,,,
,,-5.47,0.1601,,,,,,
,,14.44,0.0333,,,,,,
,,-2.65,0.1696,,,,,,
