0.0728,0.0128,0.0098,0.0166
0.0954,0.0228,0.0641,0.0475
0.1026,0.0358,0.0652,0.0541
0.1194,0.041,0.084,0.0593
0.1413,0.0427,0.0861,0.0633
0.1511,0.05,0.1007,0.0662
0.1663,0.0518,0.1025,0.0663
0.1996,0.0614,0.116,0.0669
0.2021,0.0669,0.1229,0.0746
0.205,0.068,0.1256,0.0775
0.2331,0.0707,0.1277,0.0843
0.2588,0.0741,0.1496,0.0962
0.2633,0.0778,0.1547,0.1093
0.2706,0.0929,0.1584,0.1183
0.2745,0.0958,0.192,0.1249
0.2805,0.1162,0.1974,0.1269
0.3137,0.1249,0.1986,0.1284
0.3409,0.1383,0.2172,0.1308
0.3719,0.1413,0.2553,0.1309
0.3743,0.1884,,0.1522
,,,0.1714
,,,0.1801
,,,0.1981
,,,0.2003
,,,0.2158
,,,0.3059
