genotype_treatment,shape,angle,anisotropy
wt,control,-61.29,0.0098
wt,control,-61.05,0.0641
wt,control,-38.34,0.0652
wt,control,-37.43,0.084
wt,control,-33.05,0.0861
wt,control,-14.66,0.1007
wt,control,-8.02,0.1025
wt,control,0.72,0.116
wt,control,3.05,0.1229
wt,control,5.9,0.1256
wt,control,8.75,0.1277
wt,control,16.08,0.1496
wt,control,26.96,0.1547
wt,control,30.48,0.1584
wt,control,38.12,0.192
wt,control,38.26,0.1974
wt,control,40.38,0.1986
wt,control,57.62,0.2172
wt,control,78.16,0.2553
cytod,control,-74.89,0.006
cytod,control,-71.14,0.0063
cytod,control,-69.17,0.0199
cytod,control,-69.15,0.0209
cytod,control,-63.83,0.0531
cytod,control,-62.32,0.0604
cytod,control,-51.02,0.0674
cytod,control,-49.5,0.074
cytod,control,-20.57,0.0794
cytod,control,-20.54,0.0816
cytod,control,-19.75,0.0871
cytod,control,-16.81,0.0899
cytod,control,-9.03,0.097
cytod,control,0.56,0.1008
cytod,control,21.83,0.1014
cytod,control,59.82,0.1033
cytod,control,66.2,0.1219
cytod,control,68.15,0.1242
cytod,control,68.58,0.1267
cytod,control,78.89,0.1807
wt,rectangle,-46.67,0.0728
wt,rectangle,-16.93,0.0954
wt,rectangle,-10.43,0.1026
wt,rectangle,-6.62,0.1194
wt,rectangle,-6.11,0.1413
wt,rectangle,-5.87,0.1511
wt,rectangle,-5.09,0.1663
wt,rectangle,-4.69,0.1996
wt,rectangle,-3.72,0.2021
wt,rectangle,-3.1,0.205
wt,rectangle,-1.68,0.2331
wt,rectangle,0.23,0.2588
wt,rectangle,2.14,0.2633
wt,rectangle,9.55,0.2706
wt,rectangle,11.39,0.2745
wt,rectangle,13.64,0.2805
wt,rectangle,14.33,0.3137
wt,rectangle,14.95,0.3409
wt,rectangle,18.54,0.3719
wt,rectangle,19.07,0.3743
cytod,rectangle,-67.81,0.0574
cytod,rectangle,-21.69,0.0629
cytod,rectangle,-14.65,0.0706
cytod,rectangle,-12.47,0.0822
cytod,rectangle,-11.74,0.1047
cytod,rectangle,-9.3,0.1069
cytod,rectangle,-6.58,0.1136
cytod,rectangle,-2.7,0.1176
cytod,rectangle,-1.06,0.1182
cytod,rectangle,-0.11,0.1192
cytod,rectangle,0.99,0.1837
cytod,rectangle,1.24,0.1902
cytod,rectangle,1.7,0.1919
cytod,rectangle,4.32,0.1958
cytod,rectangle,4.96,0.1976
cytod,rectangle,5.44,0.2055
cytod,rectangle,6.97,0.2067
cytod,rectangle,10.62,0.2235
cytod,rectangle,17.09,0.2516
cytod,rectangle,18.28,0.3034
cytod,rectangle,19.07,0.3072
cytod,rectangle,19.25,0.3136
cytod,rectangle,35.95,0.3513
