<?xml version="1.0" encoding="utf-8" standalone="no"?>
<!DOCTYPE svg PUBLIC "-//W3C//DTD SVG 1.1//EN"
  "http://www.w3.org/Graphics/SVG/1.1/DTD/svg11.dtd">
<svg height="576pt" version="1.1" viewBox="0 0 1008 576" width="1008pt" xmlns="http://www.w3.org/2000/svg" xmlns:xlink="http://www.w3.org/1999/xlink">
 <metadata>
  <rdf:RDF xmlns:cc="http://creativecommons.org/ns#" xmlns:dc="http://purl.org/dc/elements/1.1/" xmlns:rdf="http://www.w3.org/1999/02/22-rdf-syntax-ns#">
   <cc:Work>
    <dc:type rdf:resource="http://purl.org/dc/dcmitype/StillImage"/>
    <dc:date>2022-03-14T11:38:03.171284</dc:date>
    <dc:format>image/svg+xml</dc:format>
    <dc:creator>
     <cc:Agent>
      <dc:title>Matplotlib v3.4.1, https://matplotlib.org/</dc:title>
     </cc:Agent>
    </dc:creator>
   </cc:Work>
  </rdf:RDF>
 </metadata>
 <defs>
  <style type="text/css">*{stroke-linecap:butt;stroke-linejoin:round;}</style>
 </defs>
 <g id="figure_1">
  <g id="patch_1">
   <path d="M 0 576 
L 1008 576 
L 1008 0 
L 0 0 
z
" style="fill:#ffffff;"/>
  </g>
  <g id="axes_1">
   <g id="patch_2">
    <path d="M 108 456.66 
L 677.16 456.66 
L 677.16 67.08 
L 108 67.08 
z
" style="fill:#ffffff;"/>
   </g>
   <g id="matplotlib.axis_1">
    <g id="xtick_1">
     <g id="line2d_1">
      <defs>
       <path d="M 0 0 
L 0 6 
" id="m147d9d26cf" style="stroke:#262626;stroke-width:1.25;"/>
      </defs>
      <g>
       <use style="fill:#262626;stroke:#262626;stroke-width:1.25;" x="274.005" xlink:href="#m147d9d26cf" y="456.66"/>
      </g>
     </g>
     <g id="text_1">
      <!-- WT -->
      <g style="fill:#262626;" transform="translate(247.612734 491.234844)scale(0.33 -0.33)">
       <defs>
        <path d="M 213 4666 
L 850 4666 
L 1831 722 
L 2809 4666 
L 3519 4666 
L 4500 722 
L 5478 4666 
L 6119 4666 
L 4947 0 
L 4153 0 
L 3169 4050 
L 2175 0 
L 1381 0 
L 213 4666 
z
" id="DejaVuSans-57" transform="scale(0.015625)"/>
        <path d="M -19 4666 
L 3928 4666 
L 3928 4134 
L 2272 4134 
L 2272 0 
L 1638 0 
L 1638 4134 
L -19 4134 
L -19 4666 
z
" id="DejaVuSans-54" transform="scale(0.015625)"/>
       </defs>
       <use xlink:href="#DejaVuSans-57"/>
       <use x="98.876953" xlink:href="#DejaVuSans-54"/>
      </g>
     </g>
    </g>
    <g id="xtick_2">
     <g id="line2d_2">
      <g>
       <use style="fill:#262626;stroke:#262626;stroke-width:1.25;" x="511.155" xlink:href="#m147d9d26cf" y="456.66"/>
      </g>
     </g>
     <g id="text_2">
      <!-- NPA -->
      <g style="fill:#262626;" transform="translate(478.626797 491.234844)scale(0.33 -0.33)">
       <defs>
        <path d="M 628 4666 
L 1478 4666 
L 3547 763 
L 3547 4666 
L 4159 4666 
L 4159 0 
L 3309 0 
L 1241 3903 
L 1241 0 
L 628 0 
L 628 4666 
z
" id="DejaVuSans-4e" transform="scale(0.015625)"/>
        <path d="M 1259 4147 
L 1259 2394 
L 2053 2394 
Q 2494 2394 2734 2622 
Q 2975 2850 2975 3272 
Q 2975 3691 2734 3919 
Q 2494 4147 2053 4147 
L 1259 4147 
z
M 628 4666 
L 2053 4666 
Q 2838 4666 3239 4311 
Q 3641 3956 3641 3272 
Q 3641 2581 3239 2228 
Q 2838 1875 2053 1875 
L 1259 1875 
L 1259 0 
L 628 0 
L 628 4666 
z
" id="DejaVuSans-50" transform="scale(0.015625)"/>
        <path d="M 2188 4044 
L 1331 1722 
L 3047 1722 
L 2188 4044 
z
M 1831 4666 
L 2547 4666 
L 4325 0 
L 3669 0 
L 3244 1197 
L 1141 1197 
L 716 0 
L 50 0 
L 1831 4666 
z
" id="DejaVuSans-41" transform="scale(0.015625)"/>
       </defs>
       <use xlink:href="#DejaVuSans-4e"/>
       <use x="74.804688" xlink:href="#DejaVuSans-50"/>
       <use x="128.732422" xlink:href="#DejaVuSans-41"/>
      </g>
     </g>
    </g>
    <g id="text_3">
     <!-- Genotype -->
     <g style="fill:#262626;" transform="translate(304.922813 529.452187)scale(0.36 -0.36)">
      <defs>
       <path d="M 3809 666 
L 3809 1919 
L 2778 1919 
L 2778 2438 
L 4434 2438 
L 4434 434 
Q 4069 175 3628 42 
Q 3188 -91 2688 -91 
Q 1594 -91 976 548 
Q 359 1188 359 2328 
Q 359 3472 976 4111 
Q 1594 4750 2688 4750 
Q 3144 4750 3555 4637 
Q 3966 4525 4313 4306 
L 4313 3634 
Q 3963 3931 3569 4081 
Q 3175 4231 2741 4231 
Q 1884 4231 1454 3753 
Q 1025 3275 1025 2328 
Q 1025 1384 1454 906 
Q 1884 428 2741 428 
Q 3075 428 3337 486 
Q 3600 544 3809 666 
z
" id="DejaVuSans-47" transform="scale(0.015625)"/>
       <path d="M 3597 1894 
L 3597 1613 
L 953 1613 
Q 991 1019 1311 708 
Q 1631 397 2203 397 
Q 2534 397 2845 478 
Q 3156 559 3463 722 
L 3463 178 
Q 3153 47 2828 -22 
Q 2503 -91 2169 -91 
Q 1331 -91 842 396 
Q 353 884 353 1716 
Q 353 2575 817 3079 
Q 1281 3584 2069 3584 
Q 2775 3584 3186 3129 
Q 3597 2675 3597 1894 
z
M 3022 2063 
Q 3016 2534 2758 2815 
Q 2500 3097 2075 3097 
Q 1594 3097 1305 2825 
Q 1016 2553 972 2059 
L 3022 2063 
z
" id="DejaVuSans-65" transform="scale(0.015625)"/>
       <path d="M 3513 2113 
L 3513 0 
L 2938 0 
L 2938 2094 
Q 2938 2591 2744 2837 
Q 2550 3084 2163 3084 
Q 1697 3084 1428 2787 
Q 1159 2491 1159 1978 
L 1159 0 
L 581 0 
L 581 3500 
L 1159 3500 
L 1159 2956 
Q 1366 3272 1645 3428 
Q 1925 3584 2291 3584 
Q 2894 3584 3203 3211 
Q 3513 2838 3513 2113 
z
" id="DejaVuSans-6e" transform="scale(0.015625)"/>
       <path d="M 1959 3097 
Q 1497 3097 1228 2736 
Q 959 2375 959 1747 
Q 959 1119 1226 758 
Q 1494 397 1959 397 
Q 2419 397 2687 759 
Q 2956 1122 2956 1747 
Q 2956 2369 2687 2733 
Q 2419 3097 1959 3097 
z
M 1959 3584 
Q 2709 3584 3137 3096 
Q 3566 2609 3566 1747 
Q 3566 888 3137 398 
Q 2709 -91 1959 -91 
Q 1206 -91 779 398 
Q 353 888 353 1747 
Q 353 2609 779 3096 
Q 1206 3584 1959 3584 
z
" id="DejaVuSans-6f" transform="scale(0.015625)"/>
       <path d="M 1172 4494 
L 1172 3500 
L 2356 3500 
L 2356 3053 
L 1172 3053 
L 1172 1153 
Q 1172 725 1289 603 
Q 1406 481 1766 481 
L 2356 481 
L 2356 0 
L 1766 0 
Q 1100 0 847 248 
Q 594 497 594 1153 
L 594 3053 
L 172 3053 
L 172 3500 
L 594 3500 
L 594 4494 
L 1172 4494 
z
" id="DejaVuSans-74" transform="scale(0.015625)"/>
       <path d="M 2059 -325 
Q 1816 -950 1584 -1140 
Q 1353 -1331 966 -1331 
L 506 -1331 
L 506 -850 
L 844 -850 
Q 1081 -850 1212 -737 
Q 1344 -625 1503 -206 
L 1606 56 
L 191 3500 
L 800 3500 
L 1894 763 
L 2988 3500 
L 3597 3500 
L 2059 -325 
z
" id="DejaVuSans-79" transform="scale(0.015625)"/>
       <path d="M 1159 525 
L 1159 -1331 
L 581 -1331 
L 581 3500 
L 1159 3500 
L 1159 2969 
Q 1341 3281 1617 3432 
Q 1894 3584 2278 3584 
Q 2916 3584 3314 3078 
Q 3713 2572 3713 1747 
Q 3713 922 3314 415 
Q 2916 -91 2278 -91 
Q 1894 -91 1617 61 
Q 1341 213 1159 525 
z
M 3116 1747 
Q 3116 2381 2855 2742 
Q 2594 3103 2138 3103 
Q 1681 3103 1420 2742 
Q 1159 2381 1159 1747 
Q 1159 1113 1420 752 
Q 1681 391 2138 391 
Q 2594 391 2855 752 
Q 3116 1113 3116 1747 
z
" id="DejaVuSans-70" transform="scale(0.015625)"/>
      </defs>
      <use xlink:href="#DejaVuSans-47"/>
      <use x="77.490234" xlink:href="#DejaVuSans-65"/>
      <use x="139.013672" xlink:href="#DejaVuSans-6e"/>
      <use x="202.392578" xlink:href="#DejaVuSans-6f"/>
      <use x="263.574219" xlink:href="#DejaVuSans-74"/>
      <use x="302.783203" xlink:href="#DejaVuSans-79"/>
      <use x="361.962891" xlink:href="#DejaVuSans-70"/>
      <use x="425.439453" xlink:href="#DejaVuSans-65"/>
     </g>
    </g>
   </g>
   <g id="matplotlib.axis_2">
    <g id="ytick_1">
     <g id="line2d_3">
      <defs>
       <path d="M 0 0 
L -6 0 
" id="mfeb2fe84ed" style="stroke:#262626;stroke-width:1.25;"/>
      </defs>
      <g>
       <use style="fill:#262626;stroke:#262626;stroke-width:1.25;" x="108" xlink:href="#mfeb2fe84ed" y="447.457192"/>
      </g>
     </g>
     <g id="text_4">
      <!-- 0 -->
      <g style="fill:#262626;" transform="translate(77.50375 459.994614)scale(0.33 -0.33)">
       <defs>
        <path d="M 2034 4250 
Q 1547 4250 1301 3770 
Q 1056 3291 1056 2328 
Q 1056 1369 1301 889 
Q 1547 409 2034 409 
Q 2525 409 2770 889 
Q 3016 1369 3016 2328 
Q 3016 3291 2770 3770 
Q 2525 4250 2034 4250 
z
M 2034 4750 
Q 2819 4750 3233 4129 
Q 3647 3509 3647 2328 
Q 3647 1150 3233 529 
Q 2819 -91 2034 -91 
Q 1250 -91 836 529 
Q 422 1150 422 2328 
Q 422 3509 836 4129 
Q 1250 4750 2034 4750 
z
" id="DejaVuSans-30" transform="scale(0.015625)"/>
       </defs>
       <use xlink:href="#DejaVuSans-30"/>
      </g>
     </g>
    </g>
    <g id="ytick_2">
     <g id="line2d_4">
      <g>
       <use style="fill:#262626;stroke:#262626;stroke-width:1.25;" x="108" xlink:href="#mfeb2fe84ed" y="292.880554"/>
      </g>
     </g>
     <g id="text_5">
      <!-- 2 -->
      <g style="fill:#262626;" transform="translate(77.50375 305.417976)scale(0.33 -0.33)">
       <defs>
        <path d="M 1228 531 
L 3431 531 
L 3431 0 
L 469 0 
L 469 531 
Q 828 903 1448 1529 
Q 2069 2156 2228 2338 
Q 2531 2678 2651 2914 
Q 2772 3150 2772 3378 
Q 2772 3750 2511 3984 
Q 2250 4219 1831 4219 
Q 1534 4219 1204 4116 
Q 875 4013 500 3803 
L 500 4441 
Q 881 4594 1212 4672 
Q 1544 4750 1819 4750 
Q 2544 4750 2975 4387 
Q 3406 4025 3406 3419 
Q 3406 3131 3298 2873 
Q 3191 2616 2906 2266 
Q 2828 2175 2409 1742 
Q 1991 1309 1228 531 
z
" id="DejaVuSans-32" transform="scale(0.015625)"/>
       </defs>
       <use xlink:href="#DejaVuSans-32"/>
      </g>
     </g>
    </g>
    <g id="ytick_3">
     <g id="line2d_5">
      <g>
       <use style="fill:#262626;stroke:#262626;stroke-width:1.25;" x="108" xlink:href="#mfeb2fe84ed" y="138.303916"/>
      </g>
     </g>
     <g id="text_6">
      <!-- 4 -->
      <g style="fill:#262626;" transform="translate(77.50375 150.841338)scale(0.33 -0.33)">
       <defs>
        <path d="M 2419 4116 
L 825 1625 
L 2419 1625 
L 2419 4116 
z
M 2253 4666 
L 3047 4666 
L 3047 1625 
L 3713 1625 
L 3713 1100 
L 3047 1100 
L 3047 0 
L 2419 0 
L 2419 1100 
L 313 1100 
L 313 1709 
L 2253 4666 
z
" id="DejaVuSans-34" transform="scale(0.015625)"/>
       </defs>
       <use xlink:href="#DejaVuSans-34"/>
      </g>
     </g>
    </g>
    <g id="text_7">
     <!-- Apex distance [μm] -->
     <g style="fill:#262626;" transform="translate(66.016875 437.769375)rotate(-90)scale(0.36 -0.36)">
      <defs>
       <path d="M 3513 3500 
L 2247 1797 
L 3578 0 
L 2900 0 
L 1881 1375 
L 863 0 
L 184 0 
L 1544 1831 
L 300 3500 
L 978 3500 
L 1906 2253 
L 2834 3500 
L 3513 3500 
z
" id="DejaVuSans-78" transform="scale(0.015625)"/>
       <path id="DejaVuSans-20" transform="scale(0.015625)"/>
       <path d="M 2906 2969 
L 2906 4863 
L 3481 4863 
L 3481 0 
L 2906 0 
L 2906 525 
Q 2725 213 2448 61 
Q 2172 -91 1784 -91 
Q 1150 -91 751 415 
Q 353 922 353 1747 
Q 353 2572 751 3078 
Q 1150 3584 1784 3584 
Q 2172 3584 2448 3432 
Q 2725 3281 2906 2969 
z
M 947 1747 
Q 947 1113 1208 752 
Q 1469 391 1925 391 
Q 2381 391 2643 752 
Q 2906 1113 2906 1747 
Q 2906 2381 2643 2742 
Q 2381 3103 1925 3103 
Q 1469 3103 1208 2742 
Q 947 2381 947 1747 
z
" id="DejaVuSans-64" transform="scale(0.015625)"/>
       <path d="M 603 3500 
L 1178 3500 
L 1178 0 
L 603 0 
L 603 3500 
z
M 603 4863 
L 1178 4863 
L 1178 4134 
L 603 4134 
L 603 4863 
z
" id="DejaVuSans-69" transform="scale(0.015625)"/>
       <path d="M 2834 3397 
L 2834 2853 
Q 2591 2978 2328 3040 
Q 2066 3103 1784 3103 
Q 1356 3103 1142 2972 
Q 928 2841 928 2578 
Q 928 2378 1081 2264 
Q 1234 2150 1697 2047 
L 1894 2003 
Q 2506 1872 2764 1633 
Q 3022 1394 3022 966 
Q 3022 478 2636 193 
Q 2250 -91 1575 -91 
Q 1294 -91 989 -36 
Q 684 19 347 128 
L 347 722 
Q 666 556 975 473 
Q 1284 391 1588 391 
Q 1994 391 2212 530 
Q 2431 669 2431 922 
Q 2431 1156 2273 1281 
Q 2116 1406 1581 1522 
L 1381 1569 
Q 847 1681 609 1914 
Q 372 2147 372 2553 
Q 372 3047 722 3315 
Q 1072 3584 1716 3584 
Q 2034 3584 2315 3537 
Q 2597 3491 2834 3397 
z
" id="DejaVuSans-73" transform="scale(0.015625)"/>
       <path d="M 2194 1759 
Q 1497 1759 1228 1600 
Q 959 1441 959 1056 
Q 959 750 1161 570 
Q 1363 391 1709 391 
Q 2188 391 2477 730 
Q 2766 1069 2766 1631 
L 2766 1759 
L 2194 1759 
z
M 3341 1997 
L 3341 0 
L 2766 0 
L 2766 531 
Q 2569 213 2275 61 
Q 1981 -91 1556 -91 
Q 1019 -91 701 211 
Q 384 513 384 1019 
Q 384 1609 779 1909 
Q 1175 2209 1959 2209 
L 2766 2209 
L 2766 2266 
Q 2766 2663 2505 2880 
Q 2244 3097 1772 3097 
Q 1472 3097 1187 3025 
Q 903 2953 641 2809 
L 641 3341 
Q 956 3463 1253 3523 
Q 1550 3584 1831 3584 
Q 2591 3584 2966 3190 
Q 3341 2797 3341 1997 
z
" id="DejaVuSans-61" transform="scale(0.015625)"/>
       <path d="M 3122 3366 
L 3122 2828 
Q 2878 2963 2633 3030 
Q 2388 3097 2138 3097 
Q 1578 3097 1268 2742 
Q 959 2388 959 1747 
Q 959 1106 1268 751 
Q 1578 397 2138 397 
Q 2388 397 2633 464 
Q 2878 531 3122 666 
L 3122 134 
Q 2881 22 2623 -34 
Q 2366 -91 2075 -91 
Q 1284 -91 818 406 
Q 353 903 353 1747 
Q 353 2603 823 3093 
Q 1294 3584 2113 3584 
Q 2378 3584 2631 3529 
Q 2884 3475 3122 3366 
z
" id="DejaVuSans-63" transform="scale(0.015625)"/>
       <path d="M 550 4863 
L 1875 4863 
L 1875 4416 
L 1125 4416 
L 1125 -397 
L 1875 -397 
L 1875 -844 
L 550 -844 
L 550 4863 
z
" id="DejaVuSans-5b" transform="scale(0.015625)"/>
       <path d="M 544 -1331 
L 544 3500 
L 1119 3500 
L 1119 1325 
Q 1119 872 1334 640 
Q 1550 409 1972 409 
Q 2434 409 2667 671 
Q 2900 934 2900 1459 
L 2900 3500 
L 3475 3500 
L 3475 806 
Q 3475 619 3529 530 
Q 3584 441 3700 441 
Q 3728 441 3778 458 
Q 3828 475 3916 513 
L 3916 50 
Q 3788 -22 3673 -56 
Q 3559 -91 3450 -91 
Q 3234 -91 3106 31 
Q 2978 153 2931 403 
Q 2775 156 2548 32 
Q 2322 -91 2016 -91 
Q 1697 -91 1473 31 
Q 1250 153 1119 397 
L 1119 -1331 
L 544 -1331 
z
" id="DejaVuSans-3bc" transform="scale(0.015625)"/>
       <path d="M 3328 2828 
Q 3544 3216 3844 3400 
Q 4144 3584 4550 3584 
Q 5097 3584 5394 3201 
Q 5691 2819 5691 2113 
L 5691 0 
L 5113 0 
L 5113 2094 
Q 5113 2597 4934 2840 
Q 4756 3084 4391 3084 
Q 3944 3084 3684 2787 
Q 3425 2491 3425 1978 
L 3425 0 
L 2847 0 
L 2847 2094 
Q 2847 2600 2669 2842 
Q 2491 3084 2119 3084 
Q 1678 3084 1418 2786 
Q 1159 2488 1159 1978 
L 1159 0 
L 581 0 
L 581 3500 
L 1159 3500 
L 1159 2956 
Q 1356 3278 1631 3431 
Q 1906 3584 2284 3584 
Q 2666 3584 2933 3390 
Q 3200 3197 3328 2828 
z
" id="DejaVuSans-6d" transform="scale(0.015625)"/>
       <path d="M 1947 4863 
L 1947 -844 
L 622 -844 
L 622 -397 
L 1369 -397 
L 1369 4416 
L 622 4416 
L 622 4863 
L 1947 4863 
z
" id="DejaVuSans-5d" transform="scale(0.015625)"/>
      </defs>
      <use xlink:href="#DejaVuSans-41"/>
      <use x="68.408203" xlink:href="#DejaVuSans-70"/>
      <use x="131.884766" xlink:href="#DejaVuSans-65"/>
      <use x="191.658203" xlink:href="#DejaVuSans-78"/>
      <use x="250.837891" xlink:href="#DejaVuSans-20"/>
      <use x="282.625" xlink:href="#DejaVuSans-64"/>
      <use x="346.101562" xlink:href="#DejaVuSans-69"/>
      <use x="373.884766" xlink:href="#DejaVuSans-73"/>
      <use x="425.984375" xlink:href="#DejaVuSans-74"/>
      <use x="465.193359" xlink:href="#DejaVuSans-61"/>
      <use x="526.472656" xlink:href="#DejaVuSans-6e"/>
      <use x="589.851562" xlink:href="#DejaVuSans-63"/>
      <use x="644.832031" xlink:href="#DejaVuSans-65"/>
      <use x="706.355469" xlink:href="#DejaVuSans-20"/>
      <use x="738.142578" xlink:href="#DejaVuSans-5b"/>
      <use x="777.15625" xlink:href="#DejaVuSans-3bc"/>
      <use x="840.779297" xlink:href="#DejaVuSans-6d"/>
      <use x="938.191406" xlink:href="#DejaVuSans-5d"/>
     </g>
    </g>
    <g id="text_8">
     <!-- 1e1 -->
     <g style="fill:#262626;" transform="translate(108 64.08)scale(0.33 -0.33)">
      <defs>
       <path d="M 794 531 
L 1825 531 
L 1825 4091 
L 703 3866 
L 703 4441 
L 1819 4666 
L 2450 4666 
L 2450 531 
L 3481 531 
L 3481 0 
L 794 0 
L 794 531 
z
" id="DejaVuSans-31" transform="scale(0.015625)"/>
      </defs>
      <use xlink:href="#DejaVuSans-31"/>
      <use x="63.623047" xlink:href="#DejaVuSans-65"/>
      <use x="125.146484" xlink:href="#DejaVuSans-31"/>
     </g>
    </g>
   </g>
   <g id="patch_3">
    <path clip-path="url(#pfb4e4322b4)" d="M 180.0936 418.969036 
L 273.0564 418.969036 
L 273.0564 396.026685 
L 180.0936 396.026685 
L 180.0936 418.969036 
z
" style="fill:#72b6a1;stroke:#595959;stroke-linejoin:miter;stroke-width:1.5;"/>
   </g>
   <g id="patch_4">
    <path clip-path="url(#pfb4e4322b4)" d="M 274.9536 423.67267 
L 367.9164 423.67267 
L 367.9164 400.928316 
L 274.9536 400.928316 
L 274.9536 423.67267 
z
" style="fill:#e99675;stroke:#595959;stroke-linejoin:miter;stroke-width:1.5;"/>
   </g>
   <g id="patch_5">
    <path clip-path="url(#pfb4e4322b4)" d="M 417.2436 302.021283 
L 510.2064 302.021283 
L 510.2064 253.711694 
L 417.2436 253.711694 
L 417.2436 302.021283 
z
" style="fill:#72b6a1;stroke:#595959;stroke-linejoin:miter;stroke-width:1.5;"/>
   </g>
   <g id="patch_6">
    <path clip-path="url(#pfb4e4322b4)" d="M 512.1036 407.377022 
L 605.0664 407.377022 
L 605.0664 374.446483 
L 512.1036 374.446483 
L 512.1036 407.377022 
z
" style="fill:#e99675;stroke:#595959;stroke-linejoin:miter;stroke-width:1.5;"/>
   </g>
   <g id="PathCollection_1"/>
   <g id="PathCollection_2"/>
   <g id="patch_7">
    <path clip-path="url(#pfb4e4322b4)" d="M 274.005 447.457192 
L 274.005 447.457192 
L 274.005 447.457192 
L 274.005 447.457192 
z
" style="fill:#72b6a1;stroke:#595959;stroke-linejoin:miter;stroke-width:0.75;"/>
   </g>
   <g id="patch_8">
    <path clip-path="url(#pfb4e4322b4)" d="M 274.005 447.457192 
L 274.005 447.457192 
L 274.005 447.457192 
L 274.005 447.457192 
z
" style="fill:#e99675;stroke:#595959;stroke-linejoin:miter;stroke-width:0.75;"/>
   </g>
   <g id="line2d_6">
    <path clip-path="url(#pfb4e4322b4)" d="M 226.575 418.969036 
L 226.575 434.214793 
" style="fill:none;stroke:#595959;stroke-linecap:round;stroke-width:1.5;"/>
   </g>
   <g id="line2d_7">
    <path clip-path="url(#pfb4e4322b4)" d="M 226.575 396.026685 
L 226.575 371.186118 
" style="fill:none;stroke:#595959;stroke-linecap:round;stroke-width:1.5;"/>
   </g>
   <g id="line2d_8">
    <path clip-path="url(#pfb4e4322b4)" d="M 203.3343 434.214793 
L 249.8157 434.214793 
" style="fill:none;stroke:#595959;stroke-linecap:round;stroke-width:1.5;"/>
   </g>
   <g id="line2d_9">
    <path clip-path="url(#pfb4e4322b4)" d="M 203.3343 371.186118 
L 249.8157 371.186118 
" style="fill:none;stroke:#595959;stroke-linecap:round;stroke-width:1.5;"/>
   </g>
   <g id="line2d_10">
    <path clip-path="url(#pfb4e4322b4)" d="M 321.435 423.67267 
L 321.435 444.585042 
" style="fill:none;stroke:#595959;stroke-linecap:round;stroke-width:1.5;"/>
   </g>
   <g id="line2d_11">
    <path clip-path="url(#pfb4e4322b4)" d="M 321.435 400.928316 
L 321.435 380.663907 
" style="fill:none;stroke:#595959;stroke-linecap:round;stroke-width:1.5;"/>
   </g>
   <g id="line2d_12">
    <path clip-path="url(#pfb4e4322b4)" d="M 298.1943 444.585042 
L 344.6757 444.585042 
" style="fill:none;stroke:#595959;stroke-linecap:round;stroke-width:1.5;"/>
   </g>
   <g id="line2d_13">
    <path clip-path="url(#pfb4e4322b4)" d="M 298.1943 380.663907 
L 344.6757 380.663907 
" style="fill:none;stroke:#595959;stroke-linecap:round;stroke-width:1.5;"/>
   </g>
   <g id="line2d_14">
    <path clip-path="url(#pfb4e4322b4)" d="M 463.725 302.021283 
L 463.725 338.56471 
" style="fill:none;stroke:#595959;stroke-linecap:round;stroke-width:1.5;"/>
   </g>
   <g id="line2d_15">
    <path clip-path="url(#pfb4e4322b4)" d="M 463.725 253.711694 
L 463.725 203.085886 
" style="fill:none;stroke:#595959;stroke-linecap:round;stroke-width:1.5;"/>
   </g>
   <g id="line2d_16">
    <path clip-path="url(#pfb4e4322b4)" d="M 440.4843 338.56471 
L 486.9657 338.56471 
" style="fill:none;stroke:#595959;stroke-linecap:round;stroke-width:1.5;"/>
   </g>
   <g id="line2d_17">
    <path clip-path="url(#pfb4e4322b4)" d="M 440.4843 203.085886 
L 486.9657 203.085886 
" style="fill:none;stroke:#595959;stroke-linecap:round;stroke-width:1.5;"/>
   </g>
   <g id="line2d_18">
    <path clip-path="url(#pfb4e4322b4)" d="M 558.585 407.377022 
L 558.585 440.31152 
" style="fill:none;stroke:#595959;stroke-linecap:round;stroke-width:1.5;"/>
   </g>
   <g id="line2d_19">
    <path clip-path="url(#pfb4e4322b4)" d="M 558.585 374.446483 
L 558.585 330.332966 
" style="fill:none;stroke:#595959;stroke-linecap:round;stroke-width:1.5;"/>
   </g>
   <g id="line2d_20">
    <path clip-path="url(#pfb4e4322b4)" d="M 535.3443 440.31152 
L 581.8257 440.31152 
" style="fill:none;stroke:#595959;stroke-linecap:round;stroke-width:1.5;"/>
   </g>
   <g id="line2d_21">
    <path clip-path="url(#pfb4e4322b4)" d="M 535.3443 330.332966 
L 581.8257 330.332966 
" style="fill:none;stroke:#595959;stroke-linecap:round;stroke-width:1.5;"/>
   </g>
   <g id="line2d_22">
    <path clip-path="url(#pfb4e4322b4)" d="M 463.725 187.146942 
L 463.725 181.83396 
L 558.585 181.83396 
L 558.585 187.146942 
" style="fill:none;stroke:#333333;stroke-linecap:round;stroke-width:1.5;"/>
   </g>
   <g id="line2d_23">
    <path clip-path="url(#pfb4e4322b4)" d="M 226.575 355.247174 
L 226.575 349.934193 
L 321.435 349.934193 
L 321.435 355.247174 
" style="fill:none;stroke:#333333;stroke-linecap:round;stroke-width:1.5;"/>
   </g>
   <g id="line2d_24">
    <path clip-path="url(#pfb4e4322b4)" d="M 226.575 146.390126 
L 226.575 141.077144 
L 463.725 141.077144 
L 463.725 146.390126 
" style="fill:none;stroke:#333333;stroke-linecap:round;stroke-width:1.5;"/>
   </g>
   <g id="line2d_25">
    <path clip-path="url(#pfb4e4322b4)" d="M 321.435 105.63331 
L 321.435 100.320328 
L 558.585 100.320328 
L 558.585 105.63331 
" style="fill:none;stroke:#333333;stroke-linecap:round;stroke-width:1.5;"/>
   </g>
   <g id="line2d_26">
    <path clip-path="url(#pfb4e4322b4)" d="M 180.0936 411.249058 
L 273.0564 411.249058 
" style="fill:none;stroke:#595959;stroke-linecap:round;stroke-width:1.5;"/>
   </g>
   <g id="line2d_27">
    <path clip-path="url(#pfb4e4322b4)" d="M 274.9536 413.782677 
L 367.9164 413.782677 
" style="fill:none;stroke:#595959;stroke-linecap:round;stroke-width:1.5;"/>
   </g>
   <g id="line2d_28">
    <path clip-path="url(#pfb4e4322b4)" d="M 417.2436 282.854672 
L 510.2064 282.854672 
" style="fill:none;stroke:#595959;stroke-linecap:round;stroke-width:1.5;"/>
   </g>
   <g id="line2d_29">
    <path clip-path="url(#pfb4e4322b4)" d="M 512.1036 393.959288 
L 605.0664 393.959288 
" style="fill:none;stroke:#595959;stroke-linecap:round;stroke-width:1.5;"/>
   </g>
   <g id="patch_9">
    <path d="M 108 456.66 
L 108 67.08 
" style="fill:none;stroke:#262626;stroke-linecap:square;stroke-linejoin:miter;stroke-width:1.25;"/>
   </g>
   <g id="patch_10">
    <path d="M 108 456.66 
L 677.16 456.66 
" style="fill:none;stroke:#262626;stroke-linecap:square;stroke-linejoin:miter;stroke-width:1.25;"/>
   </g>
   <g id="PathCollection_3">
    <defs>
     <path d="M 0 2.5 
C 0.663008 2.5 1.29895 2.236584 1.767767 1.767767 
C 2.236584 1.29895 2.5 0.663008 2.5 -0 
C 2.5 -0.663008 2.236584 -1.29895 1.767767 -1.767767 
C 1.29895 -2.236584 0.663008 -2.5 0 -2.5 
C -0.663008 -2.5 -1.29895 -2.236584 -1.767767 -1.767767 
C -2.236584 -1.29895 -2.5 -0.663008 -2.5 0 
C -2.5 0.663008 -2.236584 1.29895 -1.767767 1.767767 
C -1.29895 2.236584 -0.663008 2.5 0 2.5 
z
" id="C0_0_7485a19edc"/>
    </defs>
    <g clip-path="url(#pfb4e4322b4)">
     <use style="fill:#66c2a5;stroke:#000000;" x="221.328892" xlink:href="#C0_0_7485a19edc" y="399.335647"/>
    </g>
    <g clip-path="url(#pfb4e4322b4)">
     <use style="fill:#66c2a5;stroke:#000000;" x="237.349668" xlink:href="#C0_0_7485a19edc" y="385.502903"/>
    </g>
    <g clip-path="url(#pfb4e4322b4)">
     <use style="fill:#66c2a5;stroke:#000000;" x="221.667188" xlink:href="#C0_0_7485a19edc" y="371.186118"/>
    </g>
    <g clip-path="url(#pfb4e4322b4)">
     <use style="fill:#66c2a5;stroke:#000000;" x="235.891672" xlink:href="#C0_0_7485a19edc" y="416.610002"/>
    </g>
    <g clip-path="url(#pfb4e4322b4)">
     <use style="fill:#66c2a5;stroke:#000000;" x="219.074322" xlink:href="#C0_0_7485a19edc" y="410.386362"/>
    </g>
    <g clip-path="url(#pfb4e4322b4)">
     <use style="fill:#66c2a5;stroke:#000000;" x="223.956334" xlink:href="#C0_0_7485a19edc" y="386.0998"/>
    </g>
    <g clip-path="url(#pfb4e4322b4)">
     <use style="fill:#66c2a5;stroke:#000000;" x="221.498923" xlink:href="#C0_0_7485a19edc" y="429.17687"/>
    </g>
    <g clip-path="url(#pfb4e4322b4)">
     <use style="fill:#66c2a5;stroke:#000000;" x="217.139176" xlink:href="#C0_0_7485a19edc" y="412.111753"/>
    </g>
    <g clip-path="url(#pfb4e4322b4)">
     <use style="fill:#66c2a5;stroke:#000000;" x="230.899958" xlink:href="#C0_0_7485a19edc" y="403.500644"/>
    </g>
    <g clip-path="url(#pfb4e4322b4)">
     <use style="fill:#66c2a5;stroke:#000000;" x="230.162812" xlink:href="#C0_0_7485a19edc" y="426.046141"/>
    </g>
    <g clip-path="url(#pfb4e4322b4)">
     <use style="fill:#66c2a5;stroke:#000000;" x="227.472229" xlink:href="#C0_0_7485a19edc" y="434.214793"/>
    </g>
    <g clip-path="url(#pfb4e4322b4)">
     <use style="fill:#66c2a5;stroke:#000000;" x="223.086313" xlink:href="#C0_0_7485a19edc" y="413.928247"/>
    </g>
   </g>
   <g id="PathCollection_4">
    <defs>
     <path d="M 0 2.5 
C 0.663008 2.5 1.29895 2.236584 1.767767 1.767767 
C 2.236584 1.29895 2.5 0.663008 2.5 -0 
C 2.5 -0.663008 2.236584 -1.29895 1.767767 -1.767767 
C 1.29895 -2.236584 0.663008 -2.5 0 -2.5 
C -0.663008 -2.5 -1.29895 -2.236584 -1.767767 -1.767767 
C -2.236584 -1.29895 -2.5 -0.663008 -2.5 0 
C -2.5 0.663008 -2.236584 1.29895 -1.767767 1.767767 
C -1.29895 2.236584 -0.663008 2.5 0 2.5 
z
" id="C1_0_230d4355bf"/>
    </defs>
    <g clip-path="url(#pfb4e4322b4)">
     <use style="fill:#fc8d62;stroke:#000000;" x="324.611724" xlink:href="#C1_0_230d4355bf" y="414.616319"/>
    </g>
    <g clip-path="url(#pfb4e4322b4)">
     <use style="fill:#fc8d62;stroke:#000000;" x="331.785015" xlink:href="#C1_0_230d4355bf" y="411.971565"/>
    </g>
    <g clip-path="url(#pfb4e4322b4)">
     <use style="fill:#fc8d62;stroke:#000000;" x="328.574257" xlink:href="#C1_0_230d4355bf" y="393.084556"/>
    </g>
    <g clip-path="url(#pfb4e4322b4)">
     <use style="fill:#fc8d62;stroke:#000000;" x="311.990371" xlink:href="#C1_0_230d4355bf" y="412.949035"/>
    </g>
    <g clip-path="url(#pfb4e4322b4)">
     <use style="fill:#fc8d62;stroke:#000000;" x="330.631792" xlink:href="#C1_0_230d4355bf" y="418.083699"/>
    </g>
    <g clip-path="url(#pfb4e4322b4)">
     <use style="fill:#fc8d62;stroke:#000000;" x="311.465015" xlink:href="#C1_0_230d4355bf" y="393.968503"/>
    </g>
    <g clip-path="url(#pfb4e4322b4)">
     <use style="fill:#fc8d62;stroke:#000000;" x="333.202908" xlink:href="#C1_0_230d4355bf" y="444.585042"/>
    </g>
    <g clip-path="url(#pfb4e4322b4)">
     <use style="fill:#fc8d62;stroke:#000000;" x="318.683483" xlink:href="#C1_0_230d4355bf" y="403.248253"/>
    </g>
    <g clip-path="url(#pfb4e4322b4)">
     <use style="fill:#fc8d62;stroke:#000000;" x="316.476981" xlink:href="#C1_0_230d4355bf" y="380.663907"/>
    </g>
    <g clip-path="url(#pfb4e4322b4)">
     <use style="fill:#fc8d62;stroke:#000000;" x="310.571371" xlink:href="#C1_0_230d4355bf" y="425.78608"/>
    </g>
    <g clip-path="url(#pfb4e4322b4)">
     <use style="fill:#fc8d62;stroke:#000000;" x="329.847" xlink:href="#C1_0_230d4355bf" y="429.18231"/>
    </g>
    <g clip-path="url(#pfb4e4322b4)">
     <use style="fill:#fc8d62;stroke:#000000;" x="315.945763" xlink:href="#C1_0_230d4355bf" y="422.968199"/>
    </g>
   </g>
   <g id="PathCollection_5">
    <defs>
     <path d="M 0 2.5 
C 0.663008 2.5 1.29895 2.236584 1.767767 1.767767 
C 2.236584 1.29895 2.5 0.663008 2.5 -0 
C 2.5 -0.663008 2.236584 -1.29895 1.767767 -1.767767 
C 1.29895 -2.236584 0.663008 -2.5 0 -2.5 
C -0.663008 -2.5 -1.29895 -2.236584 -1.767767 -1.767767 
C -2.236584 -1.29895 -2.5 -0.663008 -2.5 0 
C -2.5 0.663008 -2.236584 1.29895 -1.767767 1.767767 
C -1.29895 2.236584 -0.663008 2.5 0 2.5 
z
" id="C2_0_29b7016b6b"/>
    </defs>
    <g clip-path="url(#pfb4e4322b4)">
     <use style="fill:#66c2a5;stroke:#000000;" x="455.850653" xlink:href="#C2_0_29b7016b6b" y="238.28915"/>
    </g>
    <g clip-path="url(#pfb4e4322b4)">
     <use style="fill:#66c2a5;stroke:#000000;" x="454.69848" xlink:href="#C2_0_29b7016b6b" y="314.641284"/>
    </g>
    <g clip-path="url(#pfb4e4322b4)">
     <use style="fill:#66c2a5;stroke:#000000;" x="459.89704" xlink:href="#C2_0_29b7016b6b" y="324.19448"/>
    </g>
    <g clip-path="url(#pfb4e4322b4)">
     <use style="fill:#66c2a5;stroke:#000000;" x="472.113413" xlink:href="#C2_0_29b7016b6b" y="337.395916"/>
    </g>
    <g clip-path="url(#pfb4e4322b4)">
     <use style="fill:#66c2a5;stroke:#000000;" x="452.56939" xlink:href="#C2_0_29b7016b6b" y="307.649635"/>
    </g>
    <g clip-path="url(#pfb4e4322b4)">
     <use style="fill:#66c2a5;stroke:#000000;" x="462.809815" xlink:href="#C2_0_29b7016b6b" y="282.866103"/>
    </g>
    <g clip-path="url(#pfb4e4322b4)">
     <use style="fill:#66c2a5;stroke:#000000;" x="471.504981" xlink:href="#C2_0_29b7016b6b" y="252.980569"/>
    </g>
    <g clip-path="url(#pfb4e4322b4)">
     <use style="fill:#66c2a5;stroke:#000000;" x="457.028419" xlink:href="#C2_0_29b7016b6b" y="239.590102"/>
    </g>
    <g clip-path="url(#pfb4e4322b4)">
     <use style="fill:#66c2a5;stroke:#000000;" x="464.001277" xlink:href="#C2_0_29b7016b6b" y="290.148117"/>
    </g>
    <g clip-path="url(#pfb4e4322b4)">
     <use style="fill:#66c2a5;stroke:#000000;" x="457.473319" xlink:href="#C2_0_29b7016b6b" y="242.166257"/>
    </g>
    <g clip-path="url(#pfb4e4322b4)">
     <use style="fill:#66c2a5;stroke:#000000;" x="459.762174" xlink:href="#C2_0_29b7016b6b" y="277.978306"/>
    </g>
    <g clip-path="url(#pfb4e4322b4)">
     <use style="fill:#66c2a5;stroke:#000000;" x="470.045572" xlink:href="#C2_0_29b7016b6b" y="262.451954"/>
    </g>
    <g clip-path="url(#pfb4e4322b4)">
     <use style="fill:#66c2a5;stroke:#000000;" x="453.421295" xlink:href="#C2_0_29b7016b6b" y="275.967742"/>
    </g>
    <g clip-path="url(#pfb4e4322b4)">
     <use style="fill:#66c2a5;stroke:#000000;" x="463.45534" xlink:href="#C2_0_29b7016b6b" y="274.022463"/>
    </g>
    <g clip-path="url(#pfb4e4322b4)">
     <use style="fill:#66c2a5;stroke:#000000;" x="464.211562" xlink:href="#C2_0_29b7016b6b" y="326.715454"/>
    </g>
    <g clip-path="url(#pfb4e4322b4)">
     <use style="fill:#66c2a5;stroke:#000000;" x="475.262159" xlink:href="#C2_0_29b7016b6b" y="323.763922"/>
    </g>
    <g clip-path="url(#pfb4e4322b4)">
     <use style="fill:#66c2a5;stroke:#000000;" x="463.004242" xlink:href="#C2_0_29b7016b6b" y="306.493146"/>
    </g>
    <g clip-path="url(#pfb4e4322b4)">
     <use style="fill:#66c2a5;stroke:#000000;" x="474.022003" xlink:href="#C2_0_29b7016b6b" y="319.212633"/>
    </g>
    <g clip-path="url(#pfb4e4322b4)">
     <use style="fill:#66c2a5;stroke:#000000;" x="474.377013" xlink:href="#C2_0_29b7016b6b" y="321.617875"/>
    </g>
    <g clip-path="url(#pfb4e4322b4)">
     <use style="fill:#66c2a5;stroke:#000000;" x="453.34278" xlink:href="#C2_0_29b7016b6b" y="282.854672"/>
    </g>
    <g clip-path="url(#pfb4e4322b4)">
     <use style="fill:#66c2a5;stroke:#000000;" x="474.66728" xlink:href="#C2_0_29b7016b6b" y="259.239"/>
    </g>
    <g clip-path="url(#pfb4e4322b4)">
     <use style="fill:#66c2a5;stroke:#000000;" x="466.59813" xlink:href="#C2_0_29b7016b6b" y="291.206568"/>
    </g>
    <g clip-path="url(#pfb4e4322b4)">
     <use style="fill:#66c2a5;stroke:#000000;" x="472.034781" xlink:href="#C2_0_29b7016b6b" y="302.014575"/>
    </g>
    <g clip-path="url(#pfb4e4322b4)">
     <use style="fill:#66c2a5;stroke:#000000;" x="458.882028" xlink:href="#C2_0_29b7016b6b" y="288.837474"/>
    </g>
    <g clip-path="url(#pfb4e4322b4)">
     <use style="fill:#66c2a5;stroke:#000000;" x="472.734053" xlink:href="#C2_0_29b7016b6b" y="256.805649"/>
    </g>
    <g clip-path="url(#pfb4e4322b4)">
     <use style="fill:#66c2a5;stroke:#000000;" x="460.11535" xlink:href="#C2_0_29b7016b6b" y="242.927372"/>
    </g>
    <g clip-path="url(#pfb4e4322b4)">
     <use style="fill:#66c2a5;stroke:#000000;" x="467.180502" xlink:href="#C2_0_29b7016b6b" y="275.751811"/>
    </g>
    <g clip-path="url(#pfb4e4322b4)">
     <use style="fill:#66c2a5;stroke:#000000;" x="461.621931" xlink:href="#C2_0_29b7016b6b" y="252.904452"/>
    </g>
    <g clip-path="url(#pfb4e4322b4)">
     <use style="fill:#66c2a5;stroke:#000000;" x="474.360532" xlink:href="#C2_0_29b7016b6b" y="264.642582"/>
    </g>
    <g clip-path="url(#pfb4e4322b4)">
     <use style="fill:#66c2a5;stroke:#000000;" x="456.540457" xlink:href="#C2_0_29b7016b6b" y="295.731156"/>
    </g>
    <g clip-path="url(#pfb4e4322b4)">
     <use style="fill:#66c2a5;stroke:#000000;" x="472.778381" xlink:href="#C2_0_29b7016b6b" y="286.769528"/>
    </g>
    <g clip-path="url(#pfb4e4322b4)">
     <use style="fill:#66c2a5;stroke:#000000;" x="474.994068" xlink:href="#C2_0_29b7016b6b" y="247.34289"/>
    </g>
    <g clip-path="url(#pfb4e4322b4)">
     <use style="fill:#66c2a5;stroke:#000000;" x="473.34914" xlink:href="#C2_0_29b7016b6b" y="294.012731"/>
    </g>
    <g clip-path="url(#pfb4e4322b4)">
     <use style="fill:#66c2a5;stroke:#000000;" x="466.460468" xlink:href="#C2_0_29b7016b6b" y="285.698435"/>
    </g>
    <g clip-path="url(#pfb4e4322b4)">
     <use style="fill:#66c2a5;stroke:#000000;" x="468.970099" xlink:href="#C2_0_29b7016b6b" y="246.940151"/>
    </g>
    <g clip-path="url(#pfb4e4322b4)">
     <use style="fill:#66c2a5;stroke:#000000;" x="469.058179" xlink:href="#C2_0_29b7016b6b" y="260.368507"/>
    </g>
    <g clip-path="url(#pfb4e4322b4)">
     <use style="fill:#66c2a5;stroke:#000000;" x="473.267289" xlink:href="#C2_0_29b7016b6b" y="282.726426"/>
    </g>
    <g clip-path="url(#pfb4e4322b4)">
     <use style="fill:#66c2a5;stroke:#000000;" x="459.815998" xlink:href="#C2_0_29b7016b6b" y="295.819001"/>
    </g>
    <g clip-path="url(#pfb4e4322b4)">
     <use style="fill:#66c2a5;stroke:#000000;" x="454.544393" xlink:href="#C2_0_29b7016b6b" y="254.44282"/>
    </g>
    <g clip-path="url(#pfb4e4322b4)">
     <use style="fill:#66c2a5;stroke:#000000;" x="463.752802" xlink:href="#C2_0_29b7016b6b" y="296.170295"/>
    </g>
    <g clip-path="url(#pfb4e4322b4)">
     <use style="fill:#66c2a5;stroke:#000000;" x="465.360508" xlink:href="#C2_0_29b7016b6b" y="287.607587"/>
    </g>
    <g clip-path="url(#pfb4e4322b4)">
     <use style="fill:#66c2a5;stroke:#000000;" x="463.172744" xlink:href="#C2_0_29b7016b6b" y="302.027991"/>
    </g>
    <g clip-path="url(#pfb4e4322b4)">
     <use style="fill:#66c2a5;stroke:#000000;" x="474.521351" xlink:href="#C2_0_29b7016b6b" y="248.404161"/>
    </g>
    <g clip-path="url(#pfb4e4322b4)">
     <use style="fill:#66c2a5;stroke:#000000;" x="453.507073" xlink:href="#C2_0_29b7016b6b" y="239.456368"/>
    </g>
    <g clip-path="url(#pfb4e4322b4)">
     <use style="fill:#66c2a5;stroke:#000000;" x="471.485007" xlink:href="#C2_0_29b7016b6b" y="279.841701"/>
    </g>
    <g clip-path="url(#pfb4e4322b4)">
     <use style="fill:#66c2a5;stroke:#000000;" x="461.55866" xlink:href="#C2_0_29b7016b6b" y="273.355023"/>
    </g>
    <g clip-path="url(#pfb4e4322b4)">
     <use style="fill:#66c2a5;stroke:#000000;" x="465.128789" xlink:href="#C2_0_29b7016b6b" y="220.410351"/>
    </g>
    <g clip-path="url(#pfb4e4322b4)">
     <use style="fill:#66c2a5;stroke:#000000;" x="462.947293" xlink:href="#C2_0_29b7016b6b" y="234.905909"/>
    </g>
    <g clip-path="url(#pfb4e4322b4)">
     <use style="fill:#66c2a5;stroke:#000000;" x="453.044567" xlink:href="#C2_0_29b7016b6b" y="245.425116"/>
    </g>
    <g clip-path="url(#pfb4e4322b4)">
     <use style="fill:#66c2a5;stroke:#000000;" x="464.695344" xlink:href="#C2_0_29b7016b6b" y="203.085886"/>
    </g>
    <g clip-path="url(#pfb4e4322b4)">
     <use style="fill:#66c2a5;stroke:#000000;" x="465.066767" xlink:href="#C2_0_29b7016b6b" y="218.146833"/>
    </g>
    <g clip-path="url(#pfb4e4322b4)">
     <use style="fill:#66c2a5;stroke:#000000;" x="461.204349" xlink:href="#C2_0_29b7016b6b" y="286.254099"/>
    </g>
    <g clip-path="url(#pfb4e4322b4)">
     <use style="fill:#66c2a5;stroke:#000000;" x="455.108536" xlink:href="#C2_0_29b7016b6b" y="304.762434"/>
    </g>
    <g clip-path="url(#pfb4e4322b4)">
     <use style="fill:#66c2a5;stroke:#000000;" x="469.419375" xlink:href="#C2_0_29b7016b6b" y="321.981412"/>
    </g>
    <g clip-path="url(#pfb4e4322b4)">
     <use style="fill:#66c2a5;stroke:#000000;" x="464.328115" xlink:href="#C2_0_29b7016b6b" y="338.56471"/>
    </g>
    <g clip-path="url(#pfb4e4322b4)">
     <use style="fill:#66c2a5;stroke:#000000;" x="460.432421" xlink:href="#C2_0_29b7016b6b" y="329.42946"/>
    </g>
    <g clip-path="url(#pfb4e4322b4)">
     <use style="fill:#66c2a5;stroke:#000000;" x="469.539661" xlink:href="#C2_0_29b7016b6b" y="322.389768"/>
    </g>
    <g clip-path="url(#pfb4e4322b4)">
     <use style="fill:#66c2a5;stroke:#000000;" x="455.559993" xlink:href="#C2_0_29b7016b6b" y="298.613243"/>
    </g>
    <g clip-path="url(#pfb4e4322b4)">
     <use style="fill:#66c2a5;stroke:#000000;" x="459.427616" xlink:href="#C2_0_29b7016b6b" y="275.385644"/>
    </g>
   </g>
   <g id="PathCollection_6">
    <defs>
     <path d="M 0 2.5 
C 0.663008 2.5 1.29895 2.236584 1.767767 1.767767 
C 2.236584 1.29895 2.5 0.663008 2.5 -0 
C 2.5 -0.663008 2.236584 -1.29895 1.767767 -1.767767 
C 1.29895 -2.236584 0.663008 -2.5 0 -2.5 
C -0.663008 -2.5 -1.29895 -2.236584 -1.767767 -1.767767 
C -2.236584 -1.29895 -2.5 -0.663008 -2.5 0 
C -2.5 0.663008 -2.236584 1.29895 -1.767767 1.767767 
C -1.29895 2.236584 -0.663008 2.5 0 2.5 
z
" id="C3_0_d2a531445a"/>
    </defs>
    <g clip-path="url(#pfb4e4322b4)">
     <use style="fill:#fc8d62;stroke:#000000;" x="551.122451" xlink:href="#C3_0_d2a531445a" y="406.633292"/>
    </g>
    <g clip-path="url(#pfb4e4322b4)">
     <use style="fill:#fc8d62;stroke:#000000;" x="567.723963" xlink:href="#C3_0_d2a531445a" y="384.992"/>
    </g>
    <g clip-path="url(#pfb4e4322b4)">
     <use style="fill:#fc8d62;stroke:#000000;" x="550.259839" xlink:href="#C3_0_d2a531445a" y="375.780254"/>
    </g>
    <g clip-path="url(#pfb4e4322b4)">
     <use style="fill:#fc8d62;stroke:#000000;" x="554.699618" xlink:href="#C3_0_d2a531445a" y="423.356011"/>
    </g>
    <g clip-path="url(#pfb4e4322b4)">
     <use style="fill:#fc8d62;stroke:#000000;" x="550.710582" xlink:href="#C3_0_d2a531445a" y="391.278746"/>
    </g>
    <g clip-path="url(#pfb4e4322b4)">
     <use style="fill:#fc8d62;stroke:#000000;" x="568.744682" xlink:href="#C3_0_d2a531445a" y="416.780089"/>
    </g>
    <g clip-path="url(#pfb4e4322b4)">
     <use style="fill:#fc8d62;stroke:#000000;" x="563.747171" xlink:href="#C3_0_d2a531445a" y="408.120752"/>
    </g>
    <g clip-path="url(#pfb4e4322b4)">
     <use style="fill:#fc8d62;stroke:#000000;" x="562.55589" xlink:href="#C3_0_d2a531445a" y="372.97341"/>
    </g>
    <g clip-path="url(#pfb4e4322b4)">
     <use style="fill:#fc8d62;stroke:#000000;" x="549.450179" xlink:href="#C3_0_d2a531445a" y="370.393931"/>
    </g>
    <g clip-path="url(#pfb4e4322b4)">
     <use style="fill:#fc8d62;stroke:#000000;" x="552.403123" xlink:href="#C3_0_d2a531445a" y="338.605521"/>
    </g>
    <g clip-path="url(#pfb4e4322b4)">
     <use style="fill:#fc8d62;stroke:#000000;" x="568.015417" xlink:href="#C3_0_d2a531445a" y="362.891571"/>
    </g>
    <g clip-path="url(#pfb4e4322b4)">
     <use style="fill:#fc8d62;stroke:#000000;" x="562.313314" xlink:href="#C3_0_d2a531445a" y="375.916411"/>
    </g>
    <g clip-path="url(#pfb4e4322b4)">
     <use style="fill:#fc8d62;stroke:#000000;" x="566.240526" xlink:href="#C3_0_d2a531445a" y="313.567231"/>
    </g>
    <g clip-path="url(#pfb4e4322b4)">
     <use style="fill:#fc8d62;stroke:#000000;" x="559.821892" xlink:href="#C3_0_d2a531445a" y="334.556073"/>
    </g>
    <g clip-path="url(#pfb4e4322b4)">
     <use style="fill:#fc8d62;stroke:#000000;" x="555.489488" xlink:href="#C3_0_d2a531445a" y="423.483277"/>
    </g>
    <g clip-path="url(#pfb4e4322b4)">
     <use style="fill:#fc8d62;stroke:#000000;" x="565.954247" xlink:href="#C3_0_d2a531445a" y="411.742593"/>
    </g>
    <g clip-path="url(#pfb4e4322b4)">
     <use style="fill:#fc8d62;stroke:#000000;" x="548.549928" xlink:href="#C3_0_d2a531445a" y="400.691614"/>
    </g>
    <g clip-path="url(#pfb4e4322b4)">
     <use style="fill:#fc8d62;stroke:#000000;" x="564.825186" xlink:href="#C3_0_d2a531445a" y="386.400916"/>
    </g>
    <g clip-path="url(#pfb4e4322b4)">
     <use style="fill:#fc8d62;stroke:#000000;" x="567.411978" xlink:href="#C3_0_d2a531445a" y="390.503284"/>
    </g>
    <g clip-path="url(#pfb4e4322b4)">
     <use style="fill:#fc8d62;stroke:#000000;" x="547.608096" xlink:href="#C3_0_d2a531445a" y="376.16814"/>
    </g>
    <g clip-path="url(#pfb4e4322b4)">
     <use style="fill:#fc8d62;stroke:#000000;" x="557.132523" xlink:href="#C3_0_d2a531445a" y="301.530228"/>
    </g>
    <g clip-path="url(#pfb4e4322b4)">
     <use style="fill:#fc8d62;stroke:#000000;" x="562.411165" xlink:href="#C3_0_d2a531445a" y="318.3398"/>
    </g>
    <g clip-path="url(#pfb4e4322b4)">
     <use style="fill:#fc8d62;stroke:#000000;" x="570.263421" xlink:href="#C3_0_d2a531445a" y="400.140913"/>
    </g>
    <g clip-path="url(#pfb4e4322b4)">
     <use style="fill:#fc8d62;stroke:#000000;" x="555.115428" xlink:href="#C3_0_d2a531445a" y="340.174482"/>
    </g>
    <g clip-path="url(#pfb4e4322b4)">
     <use style="fill:#fc8d62;stroke:#000000;" x="562.479367" xlink:href="#C3_0_d2a531445a" y="390.216243"/>
    </g>
    <g clip-path="url(#pfb4e4322b4)">
     <use style="fill:#fc8d62;stroke:#000000;" x="547.882613" xlink:href="#C3_0_d2a531445a" y="375.298531"/>
    </g>
    <g clip-path="url(#pfb4e4322b4)">
     <use style="fill:#fc8d62;stroke:#000000;" x="563.314544" xlink:href="#C3_0_d2a531445a" y="427.624675"/>
    </g>
    <g clip-path="url(#pfb4e4322b4)">
     <use style="fill:#fc8d62;stroke:#000000;" x="554.021367" xlink:href="#C3_0_d2a531445a" y="405.023294"/>
    </g>
    <g clip-path="url(#pfb4e4322b4)">
     <use style="fill:#fc8d62;stroke:#000000;" x="552.956074" xlink:href="#C3_0_d2a531445a" y="395.487465"/>
    </g>
    <g clip-path="url(#pfb4e4322b4)">
     <use style="fill:#fc8d62;stroke:#000000;" x="557.128038" xlink:href="#C3_0_d2a531445a" y="402.802912"/>
    </g>
    <g clip-path="url(#pfb4e4322b4)">
     <use style="fill:#fc8d62;stroke:#000000;" x="570.411223" xlink:href="#C3_0_d2a531445a" y="396.1021"/>
    </g>
    <g clip-path="url(#pfb4e4322b4)">
     <use style="fill:#fc8d62;stroke:#000000;" x="553.725068" xlink:href="#C3_0_d2a531445a" y="373.594436"/>
    </g>
    <g clip-path="url(#pfb4e4322b4)">
     <use style="fill:#fc8d62;stroke:#000000;" x="552.528056" xlink:href="#C3_0_d2a531445a" y="375.916765"/>
    </g>
    <g clip-path="url(#pfb4e4322b4)">
     <use style="fill:#fc8d62;stroke:#000000;" x="547.49375" xlink:href="#C3_0_d2a531445a" y="362.965037"/>
    </g>
    <g clip-path="url(#pfb4e4322b4)">
     <use style="fill:#fc8d62;stroke:#000000;" x="551.185983" xlink:href="#C3_0_d2a531445a" y="330.332966"/>
    </g>
    <g clip-path="url(#pfb4e4322b4)">
     <use style="fill:#fc8d62;stroke:#000000;" x="546.971024" xlink:href="#C3_0_d2a531445a" y="401.291506"/>
    </g>
    <g clip-path="url(#pfb4e4322b4)">
     <use style="fill:#fc8d62;stroke:#000000;" x="569.83824" xlink:href="#C3_0_d2a531445a" y="393.959288"/>
    </g>
    <g clip-path="url(#pfb4e4322b4)">
     <use style="fill:#fc8d62;stroke:#000000;" x="570.188839" xlink:href="#C3_0_d2a531445a" y="404.567542"/>
    </g>
    <g clip-path="url(#pfb4e4322b4)">
     <use style="fill:#fc8d62;stroke:#000000;" x="555.685967" xlink:href="#C3_0_d2a531445a" y="402.196192"/>
    </g>
    <g clip-path="url(#pfb4e4322b4)">
     <use style="fill:#fc8d62;stroke:#000000;" x="555.566192" xlink:href="#C3_0_d2a531445a" y="388.545745"/>
    </g>
    <g clip-path="url(#pfb4e4322b4)">
     <use style="fill:#fc8d62;stroke:#000000;" x="560.803647" xlink:href="#C3_0_d2a531445a" y="393.333734"/>
    </g>
    <g clip-path="url(#pfb4e4322b4)">
     <use style="fill:#fc8d62;stroke:#000000;" x="565.700634" xlink:href="#C3_0_d2a531445a" y="430.282759"/>
    </g>
    <g clip-path="url(#pfb4e4322b4)">
     <use style="fill:#fc8d62;stroke:#000000;" x="550.781538" xlink:href="#C3_0_d2a531445a" y="412.586405"/>
    </g>
    <g clip-path="url(#pfb4e4322b4)">
     <use style="fill:#fc8d62;stroke:#000000;" x="566.660946" xlink:href="#C3_0_d2a531445a" y="432.94802"/>
    </g>
    <g clip-path="url(#pfb4e4322b4)">
     <use style="fill:#fc8d62;stroke:#000000;" x="556.805931" xlink:href="#C3_0_d2a531445a" y="423.822964"/>
    </g>
    <g clip-path="url(#pfb4e4322b4)">
     <use style="fill:#fc8d62;stroke:#000000;" x="562.332168" xlink:href="#C3_0_d2a531445a" y="440.31152"/>
    </g>
    <g clip-path="url(#pfb4e4322b4)">
     <use style="fill:#fc8d62;stroke:#000000;" x="548.865738" xlink:href="#C3_0_d2a531445a" y="412.569375"/>
    </g>
    <g clip-path="url(#pfb4e4322b4)">
     <use style="fill:#fc8d62;stroke:#000000;" x="555.369424" xlink:href="#C3_0_d2a531445a" y="371.702366"/>
    </g>
    <g clip-path="url(#pfb4e4322b4)">
     <use style="fill:#fc8d62;stroke:#000000;" x="551.69907" xlink:href="#C3_0_d2a531445a" y="347.50535"/>
    </g>
    <g clip-path="url(#pfb4e4322b4)">
     <use style="fill:#fc8d62;stroke:#000000;" x="561.268841" xlink:href="#C3_0_d2a531445a" y="395.144214"/>
    </g>
    <g clip-path="url(#pfb4e4322b4)">
     <use style="fill:#fc8d62;stroke:#000000;" x="556.084613" xlink:href="#C3_0_d2a531445a" y="336.596067"/>
    </g>
    <g clip-path="url(#pfb4e4322b4)">
     <use style="fill:#fc8d62;stroke:#000000;" x="551.984218" xlink:href="#C3_0_d2a531445a" y="376.246109"/>
    </g>
    <g clip-path="url(#pfb4e4322b4)">
     <use style="fill:#fc8d62;stroke:#000000;" x="568.508011" xlink:href="#C3_0_d2a531445a" y="392.865617"/>
    </g>
    <g clip-path="url(#pfb4e4322b4)">
     <use style="fill:#fc8d62;stroke:#000000;" x="562.123768" xlink:href="#C3_0_d2a531445a" y="401.546629"/>
    </g>
    <g clip-path="url(#pfb4e4322b4)">
     <use style="fill:#fc8d62;stroke:#000000;" x="553.768642" xlink:href="#C3_0_d2a531445a" y="411.893326"/>
    </g>
    <g clip-path="url(#pfb4e4322b4)">
     <use style="fill:#fc8d62;stroke:#000000;" x="568.892444" xlink:href="#C3_0_d2a531445a" y="417.757403"/>
    </g>
    <g clip-path="url(#pfb4e4322b4)">
     <use style="fill:#fc8d62;stroke:#000000;" x="551.350743" xlink:href="#C3_0_d2a531445a" y="419.592352"/>
    </g>
    <g clip-path="url(#pfb4e4322b4)">
     <use style="fill:#fc8d62;stroke:#000000;" x="559.596672" xlink:href="#C3_0_d2a531445a" y="404.133589"/>
    </g>
    <g clip-path="url(#pfb4e4322b4)">
     <use style="fill:#fc8d62;stroke:#000000;" x="560.265462" xlink:href="#C3_0_d2a531445a" y="405.493729"/>
    </g>
   </g>
   <g id="text_9">
    <!-- **** -->
    <g style="fill:#262626;" transform="translate(475.155 173.347085)scale(0.36 -0.36)">
     <defs>
      <path d="M 3009 3897 
L 1888 3291 
L 3009 2681 
L 2828 2375 
L 1778 3009 
L 1778 1831 
L 1422 1831 
L 1422 3009 
L 372 2375 
L 191 2681 
L 1313 3291 
L 191 3897 
L 372 4206 
L 1422 3572 
L 1422 4750 
L 1778 4750 
L 1778 3572 
L 2828 4206 
L 3009 3897 
z
" id="DejaVuSans-2a" transform="scale(0.015625)"/>
     </defs>
     <use xlink:href="#DejaVuSans-2a"/>
     <use x="50" xlink:href="#DejaVuSans-2a"/>
     <use x="100" xlink:href="#DejaVuSans-2a"/>
     <use x="150" xlink:href="#DejaVuSans-2a"/>
    </g>
   </g>
   <g id="text_10">
    <!-- ns -->
    <g style="fill:#262626;" transform="translate(253.220625 341.447318)scale(0.36 -0.36)">
     <use xlink:href="#DejaVuSans-6e"/>
     <use x="63.378906" xlink:href="#DejaVuSans-73"/>
    </g>
   </g>
   <g id="text_11">
    <!-- **** -->
    <g style="fill:#262626;" transform="translate(309.15 132.590269)scale(0.36 -0.36)">
     <use xlink:href="#DejaVuSans-2a"/>
     <use x="50" xlink:href="#DejaVuSans-2a"/>
     <use x="100" xlink:href="#DejaVuSans-2a"/>
     <use x="150" xlink:href="#DejaVuSans-2a"/>
    </g>
   </g>
   <g id="text_12">
    <!-- * -->
    <g style="fill:#262626;" transform="translate(431.01 91.833453)scale(0.36 -0.36)">
     <use xlink:href="#DejaVuSans-2a"/>
    </g>
   </g>
   <g id="legend_1">
    <g id="text_13">
     <!-- Metric -->
     <g style="fill:#262626;" transform="translate(767.121562 107.634375)scale(0.36 -0.36)">
      <defs>
       <path d="M 628 4666 
L 1569 4666 
L 2759 1491 
L 3956 4666 
L 4897 4666 
L 4897 0 
L 4281 0 
L 4281 4097 
L 3078 897 
L 2444 897 
L 1241 4097 
L 1241 0 
L 628 0 
L 628 4666 
z
" id="DejaVuSans-4d" transform="scale(0.015625)"/>
       <path d="M 2631 2963 
Q 2534 3019 2420 3045 
Q 2306 3072 2169 3072 
Q 1681 3072 1420 2755 
Q 1159 2438 1159 1844 
L 1159 0 
L 581 0 
L 581 3500 
L 1159 3500 
L 1159 2956 
Q 1341 3275 1631 3429 
Q 1922 3584 2338 3584 
Q 2397 3584 2469 3576 
Q 2541 3569 2628 3553 
L 2631 2963 
z
" id="DejaVuSans-72" transform="scale(0.015625)"/>
      </defs>
      <use xlink:href="#DejaVuSans-4d"/>
      <use x="86.279297" xlink:href="#DejaVuSans-65"/>
      <use x="147.802734" xlink:href="#DejaVuSans-74"/>
      <use x="187.011719" xlink:href="#DejaVuSans-72"/>
      <use x="228.125" xlink:href="#DejaVuSans-69"/>
      <use x="255.908203" xlink:href="#DejaVuSans-63"/>
     </g>
    </g>
    <g id="patch_11">
     <path d="M 690.36 156.696094 
L 756.36 156.696094 
L 756.36 133.596094 
L 690.36 133.596094 
z
" style="fill:#66c2a5;stroke:#66c2a5;stroke-linejoin:miter;"/>
    </g>
    <g id="text_14">
     <!-- Paraboloid -->
     <g style="fill:#262626;" transform="translate(782.76 156.696094)scale(0.33 -0.33)">
      <defs>
       <path d="M 3116 1747 
Q 3116 2381 2855 2742 
Q 2594 3103 2138 3103 
Q 1681 3103 1420 2742 
Q 1159 2381 1159 1747 
Q 1159 1113 1420 752 
Q 1681 391 2138 391 
Q 2594 391 2855 752 
Q 3116 1113 3116 1747 
z
M 1159 2969 
Q 1341 3281 1617 3432 
Q 1894 3584 2278 3584 
Q 2916 3584 3314 3078 
Q 3713 2572 3713 1747 
Q 3713 922 3314 415 
Q 2916 -91 2278 -91 
Q 1894 -91 1617 61 
Q 1341 213 1159 525 
L 1159 0 
L 581 0 
L 581 4863 
L 1159 4863 
L 1159 2969 
z
" id="DejaVuSans-62" transform="scale(0.015625)"/>
       <path d="M 603 4863 
L 1178 4863 
L 1178 0 
L 603 0 
L 603 4863 
z
" id="DejaVuSans-6c" transform="scale(0.015625)"/>
      </defs>
      <use xlink:href="#DejaVuSans-50"/>
      <use x="55.802734" xlink:href="#DejaVuSans-61"/>
      <use x="117.082031" xlink:href="#DejaVuSans-72"/>
      <use x="158.195312" xlink:href="#DejaVuSans-61"/>
      <use x="219.474609" xlink:href="#DejaVuSans-62"/>
      <use x="282.951172" xlink:href="#DejaVuSans-6f"/>
      <use x="344.132812" xlink:href="#DejaVuSans-6c"/>
      <use x="371.916016" xlink:href="#DejaVuSans-6f"/>
      <use x="433.097656" xlink:href="#DejaVuSans-69"/>
      <use x="460.880859" xlink:href="#DejaVuSans-64"/>
     </g>
    </g>
    <g id="patch_12">
     <path d="M 690.36 205.133906 
L 756.36 205.133906 
L 756.36 182.033906 
L 690.36 182.033906 
z
" style="fill:#fc8d62;stroke:#fc8d62;stroke-linejoin:miter;"/>
    </g>
    <g id="text_15">
     <!-- COM -->
     <g style="fill:#262626;" transform="translate(782.76 205.133906)scale(0.33 -0.33)">
      <defs>
       <path d="M 4122 4306 
L 4122 3641 
Q 3803 3938 3442 4084 
Q 3081 4231 2675 4231 
Q 1875 4231 1450 3742 
Q 1025 3253 1025 2328 
Q 1025 1406 1450 917 
Q 1875 428 2675 428 
Q 3081 428 3442 575 
Q 3803 722 4122 1019 
L 4122 359 
Q 3791 134 3420 21 
Q 3050 -91 2638 -91 
Q 1578 -91 968 557 
Q 359 1206 359 2328 
Q 359 3453 968 4101 
Q 1578 4750 2638 4750 
Q 3056 4750 3426 4639 
Q 3797 4528 4122 4306 
z
" id="DejaVuSans-43" transform="scale(0.015625)"/>
       <path d="M 2522 4238 
Q 1834 4238 1429 3725 
Q 1025 3213 1025 2328 
Q 1025 1447 1429 934 
Q 1834 422 2522 422 
Q 3209 422 3611 934 
Q 4013 1447 4013 2328 
Q 4013 3213 3611 3725 
Q 3209 4238 2522 4238 
z
M 2522 4750 
Q 3503 4750 4090 4092 
Q 4678 3434 4678 2328 
Q 4678 1225 4090 567 
Q 3503 -91 2522 -91 
Q 1538 -91 948 565 
Q 359 1222 359 2328 
Q 359 3434 948 4092 
Q 1538 4750 2522 4750 
z
" id="DejaVuSans-4f" transform="scale(0.015625)"/>
      </defs>
      <use xlink:href="#DejaVuSans-43"/>
      <use x="69.824219" xlink:href="#DejaVuSans-4f"/>
      <use x="148.535156" xlink:href="#DejaVuSans-4d"/>
     </g>
    </g>
   </g>
  </g>
 </g>
 <defs>
  <clipPath id="pfb4e4322b4">
   <rect height="389.58" width="569.16" x="108" y="67.08"/>
  </clipPath>
 </defs>
</svg>
