Model,reLLG_bfactor_constant,status_bfactor_constant
T1024TS334_1-D1.pdb,3.8242115370000005,0
T1024TS337_0occ.pdb,0.0,-6
T1024TS340_1-D1.pdb,0.07899322121,0
T1024TS427_2-D1.pdb,25.38900705,0
T1024TS427_4-D1.pdb,33.86855731,0
T1024TS427_5-D1.pdb,13.48011533,0
