# This file may be used to create an environment using:
# $ conda create --name <env> --file <this file>
# platform: osx-64
@EXPLICIT
https://conda.anaconda.org/cctbx202105/osx-64/ca-certificates-2020.12.5-h033912b_0.tar.bz2#4483d8ea13bd57b52e3539e741501a7d
https://conda.anaconda.org/cctbx202105/osx-64/jpeg-9d-hbcb3906_0.tar.bz2#ff6fba028f282f94ceb10597d58a56e8
https://conda.anaconda.org/cctbx202105/osx-64/libcxx-11.1.0-habf9029_0.tar.bz2#a88609e545f948a404419c65cd96fa1a
https://conda.anaconda.org/cctbx202105/osx-64/libiconv-1.16-haf1e3a3_0.tar.bz2#c5fab167412a52e491c8e11453ae016f
https://conda.anaconda.org/cctbx202105/osx-64/libsodium-1.0.18-hbcb3906_1.tar.bz2#24632c09ed931af617fe6d5292919cab
https://conda.anaconda.org/cctbx202105/osx-64/libwebp-base-1.2.0-h0d85af4_2.tar.bz2#a5d807d5f16967981d45d6f33621f580
https://conda.anaconda.org/cctbx202105/osx-64/llvm-openmp-11.1.0-hda6cdc1_1.tar.bz2#ca57c0d989dda699ee387581f781e239
https://conda.anaconda.org/cctbx202105/osx-64/mysql-common-8.0.23-h694c41f_1.tar.bz2#44d3c955e17437cbf6dbed05d5aa4d5f
https://conda.anaconda.org/cctbx202105/osx-64/ncurses-6.2-h2e338ed_4.tar.bz2#9cef1910395d1543527583e73dba30f1
https://conda.anaconda.org/cctbx202105/osx-64/pthread-stubs-0.4-hc929b4f_1001.tar.bz2#addd19059de62181cd11ae8f4ef26084
https://conda.anaconda.org/cctbx202105/osx-64/xz-5.2.5-haf1e3a3_1.tar.bz2#41116deb499e9bc58048c297d6403ce6
https://conda.anaconda.org/cctbx202105/osx-64/yaml-0.2.5-haf1e3a3_0.tar.bz2#84c2fc186995c25a43e86ed708065572
https://conda.anaconda.org/cctbx202105/osx-64/zlib-1.2.11-h7795811_1010.tar.bz2#7d39e47e16ed0107f37c7224d5b5be8b
https://conda.anaconda.org/cctbx202105/osx-64/expat-2.3.0-he49afe7_0.tar.bz2#da0de66781469d35a6358b4d1d1fbbf7
https://conda.anaconda.org/cctbx202105/osx-64/icu-68.1-h74dc148_0.tar.bz2#e4e7f8580abd1275ea2250fe606b66ac
https://conda.anaconda.org/cctbx202105/osx-64/libedit-3.1.20191231-h0678c8f_2.tar.bz2#6016a8a1d0e63cac3de2c352cd40208b
https://conda.anaconda.org/cctbx202105/osx-64/libffi-3.3-h046ec9c_2.tar.bz2#c7a196accaf92d40985d5c9b4d14f9cb
https://conda.anaconda.org/cctbx202105/osx-64/libgfortran5-9.3.0-h6c81a4c_22.tar.bz2#15c2a786898e345e3865008236d50799
https://conda.anaconda.org/cctbx202105/osx-64/libllvm11-11.1.0-hd011deb_2.tar.bz2#2fb85f4602db53d72af74732ac23df59
https://conda.anaconda.org/cctbx202105/osx-64/libpng-1.6.37-h7cec526_2.tar.bz2#9e52521faba2b53269672628d34e1513
https://conda.anaconda.org/cctbx202105/osx-64/libsvm-323-h046ec9c_1.tar.bz2#6b8722c98039c9769ad699435239a5d5
https://conda.anaconda.org/cctbx202105/osx-64/lz4-c-1.9.3-h046ec9c_0.tar.bz2#7f13d69c1b7989b85029efb6f3e35af9
https://conda.anaconda.org/cctbx202105/osx-64/nspr-4.30-hcd9eead_0.tar.bz2#47c2bc33545b08de4d808fca615178c6
https://conda.anaconda.org/cctbx202105/osx-64/openssl-1.1.1k-h0d85af4_0.tar.bz2#f9582eb16f4e3bc7932995e122f30a74
https://conda.anaconda.org/cctbx202105/osx-64/readline-8.1-h05e3726_0.tar.bz2#2832e9b6a7caa7cb192fcda6cfcd8871
https://conda.anaconda.org/cctbx202105/osx-64/tk-8.6.10-h0419947_1.tar.bz2#9a79a432473acddd936ff8bab8b86145
https://conda.anaconda.org/cctbx202105/osx-64/zeromq-4.3.4-h1c7c35f_0.tar.bz2#2af55e3523e9210b2b2dff5855fb5382
https://conda.anaconda.org/cctbx202105/osx-64/freetype-2.10.4-h4cff582_1.tar.bz2#5a136a432c6062362cd7990c514bd8d6
https://conda.anaconda.org/cctbx202105/osx-64/gettext-0.19.8.1-h7937167_1005.tar.bz2#52fd84c5cc5d61a6e05885f44d033efa
https://conda.anaconda.org/cctbx202105/osx-64/krb5-1.17.2-h60d9502_0.tar.bz2#abf2add2a1ade1920b25a8f3327a1aa0
https://conda.anaconda.org/cctbx202105/osx-64/libclang-11.1.0-default_he082bbe_0.tar.bz2#1d87f96ae4a671e9258ea711f4059713
https://conda.anaconda.org/cctbx202105/osx-64/libgfortran-5.0.0-9_3_0_h6c81a4c_22.tar.bz2#2a96d438e9b3b5ece940211a4259d3e3
https://conda.anaconda.org/cctbx202105/osx-64/libxml2-2.9.10-h93ec3fd_4.tar.bz2#65d5f634e962c4883184aa65902241fd
https://conda.anaconda.org/cctbx202105/osx-64/sqlite-3.35.5-h44b9ce1_0.tar.bz2#2c2013573c0ebe9eb400f483de607360
https://conda.anaconda.org/cctbx202105/osx-64/zstd-1.4.9-h582d3a0_0.tar.bz2#551e04087371339ee63524f2988faa62
https://conda.anaconda.org/cctbx202105/osx-64/libopenblas-0.3.15-openmp_h5e1b9a4_0.tar.bz2#525c7ad3ebfe59da22533ee7a086fec5
https://conda.anaconda.org/cctbx202105/osx-64/libpq-13.2-h052a64a_2.tar.bz2#732402ddc4a736fa03e778eb73a26a9d
https://conda.anaconda.org/cctbx202105/osx-64/libtiff-4.2.0-h7c11950_1.tar.bz2#2ee38232ee57a171f8699ee1ef528710
https://conda.anaconda.org/cctbx202105/osx-64/libxslt-1.1.33-h5739fc3_2.tar.bz2#14333dae9eef1116162a1bb6119d3537
https://conda.anaconda.org/cctbx202105/osx-64/boost-cpp-1.74.0-h43a636a_2.tar.bz2#547d7c5e9afe4b7164ebc0c7b6df5bf0
https://conda.anaconda.org/cctbx202105/osx-64/boost-1.74.0-py37h9bf10a3_3.tar.bz2#153dc1b2ecf44fc0cea0bc2330e23927
https://conda.anaconda.org/cctbx202105/osx-64/mysql-libs-8.0.23-hbeb7981_1.tar.bz2#ff177955a0219444fdb05bcecf0434c5
https://conda.anaconda.org/cctbx202105/osx-64/nss-3.64-h31e2bf1_0.tar.bz2#16eb7de472fd56e9528885600b8d579e
https://conda.anaconda.org/cctbx202105/osx-64/python-3.7.10-h7728216_100_cpython.tar.bz2#ba448dbd4b06c0776981a37a09786f1a
https://conda.anaconda.org/cctbx202105/noarch/alabaster-0.7.12-py_0.tar.bz2#2489a97287f90176ecdc3ca982b4b0a0
https://conda.anaconda.org/cctbx202105/noarch/attrs-20.3.0-pyhd3deb0d_0.tar.bz2#5b319abb055eefcfa344bc21378ca23f
https://conda.anaconda.org/cctbx202105/noarch/backcall-0.2.0-pyh9f0ad1d_0.tar.bz2#6006a6d08a3fa99268a2681c7fb55213
https://conda.anaconda.org/cctbx202105/noarch/backports-1.0-py_2.tar.bz2#0da16b293affa6ac31812376f8eb79dd
https://conda.anaconda.org/cctbx202105/noarch/colorama-0.4.4-pyh9f0ad1d_0.tar.bz2#c08b4c1326b880ed44f3ffb04803332f
https://conda.anaconda.org/cctbx202105/noarch/decorator-4.4.2-py_0.tar.bz2#d2eabb9cabd212e1ec6a9463bd846243
https://conda.anaconda.org/cctbx202105/noarch/idna-2.10-pyh9f0ad1d_0.tar.bz2#f95a12b4f435aae6680fe55ae2eb1b06
https://conda.anaconda.org/cctbx202105/noarch/imagesize-1.2.0-py_0.tar.bz2#5879bd2c4b399a5072468e5fe587bf1b
https://conda.anaconda.org/cctbx202105/noarch/iniconfig-1.1.1-pyh9f0ad1d_0.tar.bz2#39161f81cc5e5ca45b8226fbb06c6905
https://conda.anaconda.org/cctbx202105/noarch/ipython_genutils-0.2.0-py_1.tar.bz2#5071c982548b3a20caf70462f04f5287
https://conda.anaconda.org/cctbx202105/osx-64/lcms2-2.12-h577c468_0.tar.bz2#abce77b852b73670e85e104746b0ea1b
https://conda.anaconda.org/cctbx202105/osx-64/libblas-3.9.0-9_openblas.tar.bz2#18bd6d171a80f1fefbad09cfda003840
https://conda.anaconda.org/cctbx/noarch/libsvm_py-323-py_1.tar.bz2#14a0e74d5e994e308ca3c2e52641c106
https://conda.anaconda.org/cctbx202105/noarch/more-itertools-8.7.0-pyhd8ed1ab_1.tar.bz2#d51aa0bff3e4da989b2ab3a7f3e52dfc
https://conda.anaconda.org/cctbx202105/noarch/olefile-0.46-pyh9f0ad1d_1.tar.bz2#0b2e68acc8c78c8cc392b90983481f58
https://conda.anaconda.org/cctbx202105/osx-64/openjpeg-2.4.0-h6cbf5cd_0.tar.bz2#38e701cb94a7e667a19c287f2398f04b
https://conda.anaconda.org/cctbx202105/noarch/parso-0.8.2-pyhd8ed1ab_0.tar.bz2#fb40b157bd62b457a1cc82527b63f0b0
https://conda.anaconda.org/cctbx202105/noarch/pickleshare-0.7.5-py_1003.tar.bz2#415f0ebb6198cc2801c73438a9fb5761
https://conda.anaconda.org/cctbx202105/noarch/ptyprocess-0.7.0-pyhd3deb0d_0.tar.bz2#359eeb6536da0e687af562ed265ec263
https://conda.anaconda.org/cctbx202105/noarch/py-1.10.0-pyhd3deb0d_0.tar.bz2#88ca1328ecc79a070214aa24911bace8
https://conda.anaconda.org/cctbx202105/noarch/pycparser-2.20-pyh9f0ad1d_2.tar.bz2#aa798d50ffd182a0f6f31478c7f434f6
https://conda.anaconda.org/cctbx202105/noarch/pyparsing-2.4.7-pyh9f0ad1d_0.tar.bz2#626c4f20d5bf06dcec9cf2eaa31725c7
https://conda.anaconda.org/cctbx202105/noarch/pypubsub-4.0.3-py_0.tar.bz2#687d5d7bc59cb73a0e065323774c1f62
https://conda.anaconda.org/cctbx202105/osx-64/python_abi-3.7-1_cp37m.tar.bz2#d2cb192f8948ea603927a71f015574dd
https://conda.anaconda.org/cctbx202105/noarch/pytz-2021.1-pyhd8ed1ab_0.tar.bz2#3af2e9424d5eb0063824a3f9b850d411
https://conda.anaconda.org/cctbx202105/osx-64/qt-5.12.9-h126340a_4.tar.bz2#3fd8d112f817bc29a2ff8f508b815845
https://conda.anaconda.org/cctbx202105/noarch/six-1.15.0-pyh9f0ad1d_0.tar.bz2#1eec421f0f1f39e579e44e4a5ce646a2
https://conda.anaconda.org/cctbx202105/noarch/snowballstemmer-2.1.0-pyhd8ed1ab_0.tar.bz2#f1d64c0cf0eedf655a96ccdc1573c05a
https://conda.anaconda.org/cctbx202105/noarch/sphinxcontrib-applehelp-1.0.2-py_0.tar.bz2#20b2eaeaeea4ef9a9a0d99770620fd09
https://conda.anaconda.org/cctbx202105/noarch/sphinxcontrib-devhelp-1.0.2-py_0.tar.bz2#68e01cac9d38d0e717cd5c87bc3d2cc9
https://conda.anaconda.org/cctbx202105/noarch/sphinxcontrib-htmlhelp-1.0.3-py_0.tar.bz2#4508a40465ebf0105e52f7194f299411
https://conda.anaconda.org/cctbx202105/noarch/sphinxcontrib-jsmath-1.0.1-py_0.tar.bz2#67cd9d9c0382d37479b4d306c369a2d4
https://conda.anaconda.org/cctbx202105/noarch/sphinxcontrib-qthelp-1.0.3-py_0.tar.bz2#d01180388e6d1838c3e1ad029590aa7a
https://conda.anaconda.org/cctbx202105/noarch/sphinxcontrib-serializinghtml-1.1.4-py_0.tar.bz2#8ea6a8036e28dba8827d35c764709358
https://conda.anaconda.org/cctbx202105/noarch/toml-0.10.2-pyhd8ed1ab_0.tar.bz2#f832c45a477c78bebd107098db465095
https://conda.anaconda.org/cctbx202105/noarch/typing_extensions-3.7.4.3-py_0.tar.bz2#12b96e382730541a4b332420227055ae
https://conda.anaconda.org/cctbx202105/noarch/wheel-0.36.2-pyhd3deb0d_0.tar.bz2#768bfbe026426d0e76b377997d1f2b98
https://conda.anaconda.org/cctbx202105/noarch/zipp-3.4.1-pyhd8ed1ab_0.tar.bz2#a4fa30eb74a326092b3d8078b1f1aae1
https://conda.anaconda.org/cctbx202105/osx-64/appnope-0.1.2-py37hf985489_1.tar.bz2#1bee6125d3ade317803d5358ea3f0e83
https://conda.anaconda.org/cctbx202105/noarch/babel-2.9.1-pyh44b312d_0.tar.bz2#74136ed39bfea0832d338df1e58d013e
https://conda.anaconda.org/cctbx202105/osx-64/backports.lzma-0.0.14-py37hcd8ae14_3.tar.bz2#f87d78a3ce84a5acde1cda74a42bd3a3
https://conda.anaconda.org/cctbx202105/osx-64/certifi-2020.12.5-py37hf985489_1.tar.bz2#176e0bb42110e5090e859847d11cf5e6
https://conda.anaconda.org/cctbx202105/osx-64/cffi-1.14.5-py37h4d371b4_0.tar.bz2#fe873b3f987f3e9203bb4165197a1281
https://conda.anaconda.org/cctbx202105/osx-64/chardet-4.0.0-py37hf985489_1.tar.bz2#212f48113f4aa416eb58404fbece967b
https://conda.anaconda.org/cctbx202105/noarch/cycler-0.10.0-py_2.tar.bz2#f6d7c7e6d8f42cbbec7e07a8d879f91c
https://conda.anaconda.org/cctbx202105/osx-64/docutils-0.17.1-py37hf985489_0.tar.bz2#7b24667e6fd1b832fc9dc40951272ec1
https://conda.anaconda.org/cctbx202105/osx-64/future-0.18.2-py37hf985489_3.tar.bz2#5137794442657f0dbafb035a31627fc6
https://conda.anaconda.org/cctbx202105/osx-64/importlib-metadata-4.0.1-py37hf985489_0.tar.bz2#26a108a8737a3baad762e2fa78f1568c
https://conda.anaconda.org/cctbx202105/osx-64/jedi-0.18.0-py37hf985489_2.tar.bz2#8cf41e3992c9d1ae8549dfaf03d4bc14
https://conda.anaconda.org/cctbx202105/osx-64/kiwisolver-1.3.1-py37h70f7d40_1.tar.bz2#2b3639e4db0eab6a502a11ff8ca9a1e8
https://conda.anaconda.org/cctbx202105/osx-64/libcblas-3.9.0-9_openblas.tar.bz2#29ce1ba7a9eb9aff4f65fa9e63d89c81
https://conda.anaconda.org/cctbx202105/osx-64/liblapack-3.9.0-9_openblas.tar.bz2#4864f19fafd76c5ac7771f4942682bc1
https://conda.anaconda.org/cctbx202105/osx-64/markupsafe-1.1.1-py37hf967b71_3.tar.bz2#012d1704c4914ea54b2166c6c8123d2e
https://conda.anaconda.org/cctbx202105/noarch/networkx-2.5.1-pyhd8ed1ab_0.tar.bz2#c949bad9afedd108f9c6a00faa93e8e2
https://conda.anaconda.org/cctbx202105/noarch/packaging-20.9-pyh44b312d_0.tar.bz2#be69a38e912054a62dc82cc3c7711a64
https://conda.anaconda.org/cctbx202105/osx-64/pathlib2-2.3.5-py37hf985489_3.tar.bz2#c7bc4e95422af39df3173301316a318d
https://conda.anaconda.org/cctbx202105/noarch/pexpect-4.8.0-pyh9f0ad1d_2.tar.bz2#5909e7b978141dd80d28dbf9de627827
https://conda.anaconda.org/cctbx202105/osx-64/pillow-8.1.2-py37hd4e48bc_1.tar.bz2#8668b0f453bdef24f086253ec93fe15b
https://conda.anaconda.org/cctbx202105/osx-64/psutil-5.8.0-py37h271585c_1.tar.bz2#35d263c1450238f58a6f25a779762cf8
https://conda.anaconda.org/cctbx202105/osx-64/pyside2-5.13.2-py37h4dd2062_4.tar.bz2#fb65b3e9e32c05a0ba525a8eb9b8ab56
https://conda.anaconda.org/cctbx202105/osx-64/pysocks-1.7.1-py37hf985489_3.tar.bz2#02bf224638f91b6b695fec5de6bbd860
https://conda.anaconda.org/cctbx202105/noarch/python-dateutil-2.8.1-py_0.tar.bz2#0d0150ed9c2d25817f5324108d3f7571
https://conda.anaconda.org/cctbx202105/osx-64/python.app-1.3-py37hf967b71_4.tar.bz2#23c0992d5648a1cfb78ae00dea1f1f72
https://conda.anaconda.org/cctbx202105/osx-64/pyyaml-5.4.1-py37hf967b71_0.tar.bz2#3c96ec4a68120ccee37cda33192381a0
https://conda.anaconda.org/cctbx202105/osx-64/pyzmq-22.0.3-py37h8f778e5_1.tar.bz2#cc9996c40d8fa5d4242ae539e1464a16
https://conda.anaconda.org/cctbx202105/osx-64/scons-4.1.0.post1-py37hf985489_0.tar.bz2#e26f60ac3e5d990e7441089d85dee312
https://conda.anaconda.org/cctbx202105/osx-64/tornado-6.1-py37hf967b71_1.tar.bz2#b2ae53e0e2bfded281be471b4391cfdf
https://conda.anaconda.org/cctbx202105/noarch/traitlets-5.0.5-py_0.tar.bz2#99618ee9ab1323e40f231acdab92fe60
https://conda.anaconda.org/cctbx202105/osx-64/websockets-8.1-py37hf967b71_3.tar.bz2#104a8c8758b6a76688cb44dd946e4fd8
https://conda.anaconda.org/cctbx202105/osx-64/brotlipy-0.7.0-py37hf967b71_1001.tar.bz2#2e1016af5a81ba9e50d8bd25bf82b352
https://conda.anaconda.org/cctbx202105/osx-64/cryptography-3.4.7-py37hce4a858_0.tar.bz2#3d8dba99e6bba580b947da6daf8b1d94
https://conda.anaconda.org/cctbx202105/noarch/importlib_metadata-4.0.1-hd8ed1ab_0.tar.bz2#50c48f1394fba9705a76163409924628
https://conda.anaconda.org/cctbx202105/noarch/matplotlib-inline-0.1.2-pyhd8ed1ab_2.tar.bz2#0967e1db58b16e416464ca399f87df79
https://conda.anaconda.org/cctbx202105/osx-64/numpy-1.17.5-py37hec87de9_1.tar.bz2#36f30a9f22f3f9104d532d7c5faeb279
https://conda.anaconda.org/cctbx202105/osx-64/reportlab-3.5.67-py37h08983f2_0.tar.bz2#99384773d6999b1a7d60688485cf9767
https://conda.anaconda.org/cctbx202105/osx-64/setuptools-49.6.0-py37hf985489_3.tar.bz2#5030dea82548d67ec8b80882e8e4a099
https://conda.anaconda.org/cctbx202105/noarch/backports.functools_lru_cache-1.6.4-pyhd8ed1ab_0.tar.bz2#c5b3edc62d6309088f4970b3eaaa65a6
https://conda.anaconda.org/cctbx202105/osx-64/biopython-1.78-py37h271585c_2.tar.bz2#d01b292ddd272aa02b3f775b376aeeec
https://conda.anaconda.org/cctbx202105/noarch/jinja2-2.11.3-pyh44b312d_0.tar.bz2#1d4c3605d85a3655b1595e0694138eb6
https://conda.anaconda.org/cctbx202105/osx-64/matplotlib-base-3.4.1-py37hb018525_0.tar.bz2#c6d3dc14f8c47df8db282c063da6b2c2
https://conda.anaconda.org/cctbx202105/noarch/mrcfile-1.3.0-pyh44b312d_0.tar.bz2#69f79f12d6653c39e26ba0f3eaf4f20d
https://conda.anaconda.org/cctbx202105/noarch/pip-21.1.1-pyhd8ed1ab_0.tar.bz2#e0bad1330c3575222d221e7679a36a0a
https://conda.anaconda.org/cctbx202105/osx-64/pluggy-0.13.1-py37hf985489_4.tar.bz2#c06bd6917e033778e6c2f1a66dd7e159
https://conda.anaconda.org/cctbx202105/noarch/pygments-2.8.1-pyhd8ed1ab_0.tar.bz2#196e0cff141677f430fc06eb0d0ad94d
https://conda.anaconda.org/cctbx202105/noarch/pyopenssl-20.0.1-pyhd8ed1ab_0.tar.bz2#92371c25994d0f5d28a01c1fb75ebf86
https://conda.anaconda.org/cctbx202105/osx-64/bokeh-2.3.1-py37hf985489_0.tar.bz2#391b980997602ef2c17144b3e9e77dd2
https://conda.anaconda.org/cctbx202105/osx-64/pytest-6.2.4-py37hf985489_0.tar.bz2#d288fd568f143deb76b8dcd5f905fe1c
https://conda.anaconda.org/cctbx202105/noarch/urllib3-1.26.4-pyhd8ed1ab_0.tar.bz2#d7b20b328e23d993994ea02077c009c0
https://conda.anaconda.org/cctbx202105/noarch/wcwidth-0.2.5-pyh9f0ad1d_2.tar.bz2#5266fcd697043c59621fda522b3d78ee
https://conda.anaconda.org/cctbx202105/noarch/prompt-toolkit-3.0.18-pyha770c72_0.tar.bz2#aa44d0f71016061e83df1126764acdb7
https://conda.anaconda.org/cctbx202105/noarch/requests-2.25.1-pyhd3deb0d_0.tar.bz2#ae687aba31a1c400192a86a2e993ffdc
https://conda.anaconda.org/cctbx202105/osx-64/ipython-7.23.0-py37h85f7c60_0.tar.bz2#fa72ed9b85f8934493df9f8b333b5c25
https://conda.anaconda.org/cctbx202105/noarch/sphinx-3.5.3-pyhd8ed1ab_0.tar.bz2#015af130f899365b78116b8238c99cd8
https://conda.anaconda.org/cctbx202105/osx-64/wxpython-4.0.7.post2-py37hf8388d2_3.tar.bz2#2204bda6c02835294fc0e8b4edd93c99
https://conda.anaconda.org/cctbx202105/noarch/numpydoc-1.1.0-py_1.tar.bz2#ea475ac40a3b85e2976bf900199057b4
