(dp0
S'auto_pak_rnp_function'
p1
(dp2
S'SOLUTION_SCORES'
p3
ccopy_reg
_reconstructor
p4
(cphaser_regression.test_result
List
p5
c__builtin__
object
p6
Ntp7
Rp8
(dp9
S'values'
p10
(lp11
g4
(cphaser_regression.test_result
LLGScore
p12
g6
Ntp13
Rp14
(dp15
S'value'
p16
F1057.2536626508572
sbasbssS'vrms_refinement'
p17
(dp18
S'VRMS_ENSEMBLE'
p19
g4
(g5
g6
Ntp20
Rp21
(dp22
g10
(lp23
g4
(g5
g6
Ntp24
Rp25
(dp26
g10
(lp27
g4
(cphaser_regression.test_result
Text
p28
g6
Ntp29
Rp30
(dp31
g16
S'beta'
p32
sbag4
(g28
g6
Ntp33
Rp34
(dp35
g16
S'blip'
p36
sbasbasbsS'VRMS_RMS'
p37
g4
(g5
g6
Ntp38
Rp39
(dp40
g10
(lp41
g4
(g5
g6
Ntp42
Rp43
(dp44
g10
(lp45
g4
(g5
g6
Ntp46
Rp47
(dp48
g10
(lp49
g4
(cphaser_regression.test_result
VRMS
p50
g6
Ntp51
Rp52
(dp53
g16
F0.6729520435900245
sbasbag4
(g5
g6
Ntp54
Rp55
(dp56
g10
(lp57
g4
(g50
g6
Ntp58
Rp59
(dp60
g16
F0.8068226007801158
sbasbasbasbssS'Version'
p61
(dp62
S'Info'
p63
S'Phaser-2.8.1 (svn 8292)'
p64
ssS'symmetry_information'
p65
(dp66
S'UNIT_CELL'
p67
g4
(g5
g6
Ntp68
Rp69
(dp70
g10
(lp71
g4
(cphaser_regression.test_result
CellAxis
p72
g6
Ntp73
Rp74
(dp75
g16
F75.11000061035156
sbag4
(g72
g6
Ntp76
Rp77
(dp78
g16
F75.11000061035156
sbag4
(g72
g6
Ntp79
Rp80
(dp81
g16
F133.30999755859375
sbag4
(cphaser_regression.test_result
CellAngle
p82
g6
Ntp83
Rp84
(dp85
g16
F90.0
sbag4
(g82
g6
Ntp86
Rp87
(dp88
g16
F90.0
sbag4
(g82
g6
Ntp89
Rp90
(dp91
g16
F120.0
sbasbssS'solutions'
p92
(dp93
S'SOLUTION_ANNOTATIONS'
p94
g4
(g5
g6
Ntp95
Rp96
(dp97
g10
(lp98
g4
(g28
g6
Ntp99
Rp100
(dp101
g16
S' RFZ=10.3 TFZ=19.2 PAK=0 LLG=460 TFZ==23.7 RFZ=7.2 TFZ=26.7 PAK=0 LLG=1042 TFZ==30.0 LLG=1057 TFZ==30.2'
p102
sbasbsS'SOLUTION_COUNT'
p103
g4
(cphaser_regression.test_result
Integer
p104
g6
Ntp105
Rp106
(dp107
g16
I1
sbsS'BFACTOR'
p108
g4
(g5
g6
Ntp109
Rp110
(dp111
g10
(lp112
g4
(g5
g6
Ntp113
Rp114
(dp115
g10
(lp116
g4
(cphaser_regression.test_result
Bfactor
p117
g6
Ntp118
Rp119
(dp120
g16
F5.581869156654268
sbag4
(g117
g6
Ntp121
Rp122
(dp123
g16
F10.734039536300612
sbasbasbsS'SOLUTIONS'
p124
g4
(g5
g6
Ntp125
Rp126
(dp127
g10
(lp128
g4
(cphaser_regression.test_result
Solution
p129
g6
Ntp130
Rp131
(dp132
S'cell'
p133
(F75.11000061035156
F75.11000061035156
F133.30999755859375
F90.0
F90.0
F120.0
tp134
sS'space_group_hall'
p135
S' P 32 2"'
p136
sS'peaks'
p137
(lp138
(g4
(cphaser_regression.test_phaser_keyword
EnsembleModel
p139
g6
Ntp140
Rp141
(dp142
S'name'
p143
S'beta'
p144
sS'descriptions'
p145
(lp146
g4
(cphaser_regression.test_phaser_keyword
EnsemblePDBFile
p147
g6
Ntp148
Rp149
(dp150
S'module_name'
p151
S'phaser'
p152
sS'setter'
p153
S'addENSE_PDB_ID'
p154
sg16
F1.0
sS'keyword'
p155
S'IDENTITY'
p156
sS'file_name'
p157
S'/Users/randy/phenix/phenix_bootstrap/modules/phaser_regression/data/regression/beta.pdb'
p158
sbasb(F200.92531326219378
F41.26778532458616
F183.8974722352536
tp159
(F-0.4956050464389833
F-0.15815951462701625
F-0.2809062324346081
tp160
tp161
a(g4
(g139
g6
Ntp162
Rp163
(dp164
g143
S'blip'
p165
sg145
(lp166
g4
(g147
g6
Ntp167
Rp168
(dp169
g151
g152
sg153
g154
sg16
F1.0
sg155
g156
sg157
S'/Users/randy/phenix/phenix_bootstrap/modules/phaser_regression/data/regression/blip.pdb'
p170
sbasb(F43.87625871885115
F80.97412625292407
F117.29907885039205
tp171
(F-0.12351411154958317
F0.2937278897468268
F-0.09244225458216304
tp172
tp173
asbasbss.