(dp0
S'translation_function'
p1
(dp2
S'SOLUTION_Z_SCORES'
p3
ccopy_reg
_reconstructor
p4
(cphaser_regression.test_result
List
p5
c__builtin__
object
p6
Ntp7
Rp8
(dp9
S'values'
p10
(lp11
g4
(cphaser_regression.test_result
ZScore
p12
g6
Ntp13
Rp14
(dp15
S'value'
p16
F20.995830907702782
sbasbsS'SOLUTION_SCORES'
p17
g4
(g5
g6
Ntp18
Rp19
(dp20
g10
(lp21
g4
(cphaser_regression.test_result
TFScore
p22
g6
Ntp23
Rp24
(dp25
g16
F-2920.7030236594364
sbasbssS'Version'
p26
(dp27
S'Info'
p28
S'Phaser-2.8.1 (svn 8292)'
p29
ssS'symmetry_information'
p30
(dp31
S'UNIT_CELL'
p32
g4
(g5
g6
Ntp33
Rp34
(dp35
g10
(lp36
g4
(cphaser_regression.test_result
CellAxis
p37
g6
Ntp38
Rp39
(dp40
g16
F75.11000061035156
sbag4
(g37
g6
Ntp41
Rp42
(dp43
g16
F75.11000061035156
sbag4
(g37
g6
Ntp44
Rp45
(dp46
g16
F133.30999755859375
sbag4
(cphaser_regression.test_result
CellAngle
p47
g6
Ntp48
Rp49
(dp50
g16
F90.0
sbag4
(g47
g6
Ntp51
Rp52
(dp53
g16
F90.0
sbag4
(g47
g6
Ntp54
Rp55
(dp56
g16
F120.0
sbasbssS'solutions'
p57
(dp58
S'SOLUTION_ANNOTATIONS'
p59
g4
(g5
g6
Ntp60
Rp61
(dp62
g10
(lp63
g4
(cphaser_regression.test_result
Text
p64
g6
Ntp65
Rp66
(dp67
g16
S' RFZ=3.0 TFZ=21.0'
p68
sbasbsS'SOLUTION_COUNT'
p69
g4
(cphaser_regression.test_result
Integer
p70
g6
Ntp71
Rp72
(dp73
g16
I1
sbsS'BFACTOR'
p74
g4
(g5
g6
Ntp75
Rp76
(dp77
g10
(lp78
g4
(g5
g6
Ntp79
Rp80
(dp81
g10
(lp82
g4
(cphaser_regression.test_result
Bfactor
p83
g6
Ntp84
Rp85
(dp86
g16
F0.0
sbag4
(g83
g6
Ntp87
Rp88
(dp89
g16
F0.0
sbasbasbsS'SOLUTIONS'
p90
g4
(g5
g6
Ntp91
Rp92
(dp93
g10
(lp94
g4
(cphaser_regression.test_result
Solution
p95
g6
Ntp96
Rp97
(dp98
S'cell'
p99
(F75.11000061035156
F75.11000061035156
F133.30999755859375
F90.0
F90.0
F120.0
tp100
sS'space_group_hall'
p101
S' P 32 2"'
p102
sS'peaks'
p103
(lp104
(g4
(cphaser_regression.test_phaser_keyword
EnsembleModel
p105
g6
Ntp106
Rp107
(dp108
S'name'
p109
S'beta'
p110
sS'descriptions'
p111
(lp112
g4
(cphaser_regression.test_phaser_keyword
EnsemblePDBFile
p113
g6
Ntp114
Rp115
(dp116
S'module_name'
p117
S'phaser'
p118
sS'setter'
p119
S'addENSE_PDB_ID'
p120
sg16
F1.0
sS'keyword'
p121
S'IDENTITY'
p122
sS'file_name'
p123
S'/Users/randy/phenix/phenix_bootstrap/modules/phaser_regression/data/regression/beta.pdb'
p124
sbasb(F200.80699999999996
F41.33600000000001
F183.90899999999996
tp125
(F-0.49538
F-0.15798
F-0.28099
tp126
tp127
a(g4
(g105
g6
Ntp128
Rp129
(dp130
g109
S'blip'
p131
sg111
(lp132
g4
(g113
g6
Ntp133
Rp134
(dp135
g117
g118
sg119
g120
sg16
F1.0
sg121
g122
sg123
S'/Users/randy/phenix/phenix_bootstrap/modules/phaser_regression/data/regression/blip.pdb'
p136
sbasb(F43.69999999999999
F77.30000000000001
F116.69999999999999
tp137
(F0.9116466453067118
F0.3111988164851286
F0.906930941791005
tp138
tp139
asbasbss.