(dp0
S'auto_pak_rnp_function'
p1
(dp2
S'SOLUTION_SCORES'
p3
ccopy_reg
_reconstructor
p4
(cphaser_regression.test_result
List
p5
c__builtin__
object
p6
Ntp7
Rp8
(dp9
S'values'
p10
(lp11
g4
(cphaser_regression.test_result
LLGScore
p12
g6
Ntp13
Rp14
(dp15
S'value'
p16
F173.96338924150768
sbasbssS'vrms_refinement'
p17
(dp18
S'VRMS_ENSEMBLE'
p19
g4
(g5
g6
Ntp20
Rp21
(dp22
g10
(lp23
g4
(g5
g6
Ntp24
Rp25
(dp26
g10
(lp27
g4
(cphaser_regression.test_result
Text
p28
g6
Ntp29
Rp30
(dp31
g16
S'toxd'
p32
sbasbasbsS'VRMS_RMS'
p33
g4
(g5
g6
Ntp34
Rp35
(dp36
g10
(lp37
g4
(g5
g6
Ntp38
Rp39
(dp40
g10
(lp41
g4
(g5
g6
Ntp42
Rp43
(dp44
g10
(lp45
g4
(cphaser_regression.test_result
VRMS
p46
g6
Ntp47
Rp48
(dp49
g16
F0.9103347892393265
sbag4
(g46
g6
Ntp50
Rp51
(dp52
g16
F0.8897621519766965
sbasbasbasbssS'symmetry_information'
p53
(dp54
S'UNIT_CELL'
p55
g4
(g5
g6
Ntp56
Rp57
(dp58
g10
(lp59
g4
(cphaser_regression.test_result
CellAxis
p60
g6
Ntp61
Rp62
(dp63
g16
F73.58200073242188
sbag4
(g60
g6
Ntp64
Rp65
(dp66
g16
F38.733001708984375
sbag4
(g60
g6
Ntp67
Rp68
(dp69
g16
F23.18899917602539
sbag4
(cphaser_regression.test_result
CellAngle
p70
g6
Ntp71
Rp72
(dp73
g16
F90.0
sbag4
(g70
g6
Ntp74
Rp75
(dp76
g16
F90.0
sbag4
(g70
g6
Ntp77
Rp78
(dp79
g16
F90.0
sbasbssS'solutions'
p80
(dp81
S'SOLUTION_COUNT'
p82
g4
(cphaser_regression.test_result
Integer
p83
g6
Ntp84
Rp85
(dp86
g16
I1
sbsS'BFACTOR'
p87
g4
(g5
g6
Ntp88
Rp89
(dp90
g10
(lp91
g4
(g5
g6
Ntp92
Rp93
(dp94
g10
(lp95
g4
(cphaser_regression.test_result
Bfactor
p96
g6
Ntp97
Rp98
(dp99
g16
F0.07278085445306381
sbasbasbsS'SOLUTIONS'
p100
g4
(g5
g6
Ntp101
Rp102
(dp103
g10
(lp104
g4
(cphaser_regression.test_result
Solution
p105
g6
Ntp106
Rp107
(dp108
S'cell'
p109
(F73.58200073242188
F38.733001708984375
F23.18899917602539
F90.0
F90.0
F90.0
tp110
sS'space_group_hall'
p111
S' P 2ac 2ab'
p112
sS'peaks'
p113
(lp114
(g4
(cphaser_regression.test_phaser_keyword
EnsembleModel
p115
g6
Ntp116
Rp117
(dp118
S'name'
p119
S'toxd'
p120
sS'descriptions'
p121
(lp122
g4
(cphaser_regression.test_phaser_keyword
EnsemblePDBFile
p123
g6
Ntp124
Rp125
(dp126
S'module_name'
p127
S'phaser'
p128
sS'setter'
p129
S'addENSE_PDB_ID'
p130
sg16
F0.364
sS'keyword'
p131
S'IDENTITY'
p132
sS'file_name'
p133
S'c:\\busers\\oeffner\\phenix\\dev-2063-working\\modules\\phaser_regression\\data\\regression\\1d0d_b.pdb'
p134
sbag4
(g123
g6
Ntp135
Rp136
(dp137
g127
g128
sg129
g130
sg16
F0.377
sg131
g132
sg133
S'c:\\busers\\oeffner\\phenix\\dev-2063-working\\modules\\phaser_regression\\data\\regression\\1bik.pdb'
p138
sbasb(F323.1927096799169
F21.801576821383094
F202.43562782225573
tp139
(F0.6195693031755403
F-0.19897653923477185
F-0.5557755985656788
tp140
tp141
asbasbss.