(dp0
S'pruning_fraction'
p1
(dp2
S'PRUNE_FILE'
p3
ccopy_reg
_reconstructor
p4
(cphaser_regression.test_result
Text
p5
c__builtin__
object
p6
Ntp7
Rp8
(dp9
S'value'
p10
S'PHASER.1.pdb'
p11
sbsS'PRUNE_FRACTION'
p12
g4
(cphaser_regression.test_result
PruneFraction
p13
g6
Ntp14
Rp15
(dp16
g10
F0.6799248355778265
sbssS'pruning_scores'
p17
(dp18
S'PRUNING_SCORE'
p19
g4
(cphaser_regression.test_result
List
p20
g6
Ntp21
Rp22
(dp23
S'values'
p24
(lp25
g4
(cphaser_regression.test_result
LLGScore
p26
g6
Ntp27
Rp28
(dp29
g10
F90.34173303308262
sbasbss.