(dp0
S'Version'
p1
(dp2
S'Info'
p3
S'Phaser-2.8.1 (svn 8292)'
p4
ssS'ep_dataset_statistics'
p5
(dp6
S'MILLER_SIZE'
p7
ccopy_reg
_reconstructor
p8
(cphaser_regression.test_result
Integer
p9
c__builtin__
object
p10
Ntp11
Rp12
(dp13
S'value'
p14
I32226
sbssS'ep_phasing_statistics'
p15
(dp16
S'LLG'
p17
g8
(cphaser_regression.test_result
SAD_LLG
p18
g10
Ntp19
Rp20
(dp21
g14
F-4780.421947808446
sbsS'ATOMS_COUNT'
p22
g8
(g9
g10
Ntp23
Rp24
(dp25
g14
I110
sbsS'ATOMS'
p26
g8
(cphaser_regression.test_result
AtomSet
p27
g10
Ntp28
Rp29
(dp30
S'cell'
p31
(F45.810001373291016
F45.810001373291016
F48.97999954223633
F90.0
F90.0
F120.0
tp32
sS'space_group'
p33
S'P 32 2 1'
p34
sS'atoms'
p35
(lp36
g8
(cphaser_regression.test_result
Atom
p37
g10
Ntp38
Rp39
(dp40
S'uiso'
p41
F0.06664490670969409
sS'occupancy'
p42
F3.7692788990938277
sS'coordinates'
p43
(F0.9075304755795366
F0.3998861186874606
F0.3513296236782822
tp44
sS'element'
p45
S'S'
p46
sbag8
(g37
g10
Ntp47
Rp48
(dp49
g41
F0.08203914177015578
sg42
F0.9597323997054735
sg43
(F0.5213386216425578
F0.5717871706714364
F0.5135650595215198
tp50
sg45
g46
sbag8
(g37
g10
Ntp51
Rp52
(dp53
g41
F0.05552090831845918
sg42
F2.5426001225315047
sg43
(F0.08917566220226414
F0.5363057233848191
F0.288432954006565
tp54
sg45
S'N'
p55
sbag8
(g37
g10
Ntp56
Rp57
(dp58
g41
F0.03132906601595166
sg42
F0.8858854033512996
sg43
(F0.04383261027198288
F0.535926120072852
F0.37824380005567065
tp59
sg45
g55
sbag8
(g37
g10
Ntp60
Rp61
(dp62
g41
F0.037641440757620825
sg42
F0.6031192664925236
sg43
(F0.0411341676180661
F0.39454369015083407
F0.23915855201601618
tp63
sg45
g55
sbag8
(g37
g10
Ntp64
Rp65
(dp66
g41
F0.06993788621268227
sg42
F1.7713916243334769
sg43
(F0.24893776095207099
F0.5268669554056199
F0.3675286875740469
tp67
sg45
g55
sbag8
(g37
g10
Ntp68
Rp69
(dp70
g41
F0.04356649707269829
sg42
F1.151518302790168
sg43
(F0.26890425276043695
F0.6533919612397083
F0.5144203871052895
tp71
sg45
g55
sbag8
(g37
g10
Ntp72
Rp73
(dp74
g41
F0.07090218961377773
sg42
F1.5547566403362258
sg43
(F0.20156225998593927
F0.4868763790906685
F0.683017211791185
tp75
sg45
g55
sbag8
(g37
g10
Ntp76
Rp77
(dp78
g41
F0.05460169239972136
sg42
F1.3369939450453732
sg43
(F0.22029486577863244
F0.5910442064407003
F0.42782050301912866
tp79
sg45
g55
sbag8
(g37
g10
Ntp80
Rp81
(dp82
g41
F0.05880014419564965
sg42
F1.056474915445542
sg43
(F0.11371723530532958
F0.5309817552475428
F0.09304967853506849
tp83
sg45
g55
sbag8
(g37
g10
Ntp84
Rp85
(dp86
g41
F0.020202665994691102
sg42
F0.7455518357362916
sg43
(F0.2602044763787211
F0.6477292947973466
F0.18314187963567544
tp87
sg45
g55
sbag8
(g37
g10
Ntp88
Rp89
(dp90
g41
F0.0666566484240187
sg42
F1.4917795024456157
sg43
(F0.2608647557492696
F0.674441485952464
F0.4519648262546629
tp91
sg45
g55
sbag8
(g37
g10
Ntp92
Rp93
(dp94
g41
F0.08561364187324993
sg42
F1.5939745099688132
sg43
(F0.12825844091856667
F0.5651328461610704
F0.6836919084257104
tp95
sg45
g55
sbag8
(g37
g10
Ntp96
Rp97
(dp98
g41
F0.023851553025429267
sg42
F0.8711152867382387
sg43
(F0.16000361288636242
F0.5677980198843016
F0.47499833021836757
tp99
sg45
g55
sbag8
(g37
g10
Ntp100
Rp101
(dp102
g41
F0.06334847141937722
sg42
F1.4518810420007402
sg43
(F0.0740169202064523
F0.5192694002269899
F0.40414373062306
tp103
sg45
g55
sbag8
(g37
g10
Ntp104
Rp105
(dp106
g41
F0.0496954892330224
sg42
F1.1155922038031716
sg43
(F0.23031071138769843
F0.6038459154332092
F0.49204428848546133
tp107
sg45
g55
sbag8
(g37
g10
Ntp108
Rp109
(dp110
g41
F0.05414600801395465
sg42
F1.0743923294070634
sg43
(F0.15648128683437829
F0.527893872397267
F0.6620109351899673
tp111
sg45
g55
sbag8
(g37
g10
Ntp112
Rp113
(dp114
g41
F0.06528124912949987
sg42
F1.3297060266773257
sg43
(F0.08175134661625513
F0.4603499798788063
F0.3610932947654856
tp115
sg45
g55
sbag8
(g37
g10
Ntp116
Rp117
(dp118
g41
F0.08742205629592714
sg42
F1.648044860402244
sg43
(F0.014078646920709762
F0.5059146737541146
F0.26062640398172904
tp119
sg45
g55
sbag8
(g37
g10
Ntp120
Rp121
(dp122
g41
F0.09259570113200136
sg42
F1.724112248657526
sg43
(F0.04936445800634356
F0.47937194012271667
F0.3426942740761786
tp123
sg45
g55
sbag8
(g37
g10
Ntp124
Rp125
(dp126
g41
F0.038169259350430806
sg42
F0.5592719101822198
sg43
(F-0.003931473632497429
F0.448348731322372
F0.28082078526677035
tp127
sg45
g55
sbag8
(g37
g10
Ntp128
Rp129
(dp130
g41
F0.05307643245937904
sg42
F0.9256104693762174
sg43
(F0.16049769689347615
F0.5519363805266547
F0.41922392671674874
tp131
sg45
g55
sbag8
(g37
g10
Ntp132
Rp133
(dp134
g41
F0.07371239879674094
sg42
F1.5444708510403506
sg43
(F0.015194354438038309
F0.5344970979409267
F0.43741496067497304
tp135
sg45
g55
sbag8
(g37
g10
Ntp136
Rp137
(dp138
g41
F0.10352998717939943
sg42
F1.817956667474165
sg43
(F0.09806955312518631
F0.4882098265892598
F0.7086946025515022
tp139
sg45
g55
sbag8
(g37
g10
Ntp140
Rp141
(dp142
g41
F0.06872156717435937
sg42
F1.5430341533973262
sg43
(F0.16424372600673431
F0.5016638034095221
F0.6236575916780676
tp143
sg45
g55
sbag8
(g37
g10
Ntp144
Rp145
(dp146
g41
F0.05724230414513205
sg42
F0.923611894991777
sg43
(F0.1791225963578189
F0.5429569543575303
F0.3727182391047963
tp147
sg45
g55
sbag8
(g37
g10
Ntp148
Rp149
(dp150
g41
F0.01176096857844565
sg42
F0.4770857276006087
sg43
(F0.01116204166557816
F0.5285568873335341
F0.24450280558633442
tp151
sg45
g55
sbag8
(g37
g10
Ntp152
Rp153
(dp154
g41
F0.025777926542881774
sg42
F0.6574778125847357
sg43
(F0.3177019175745918
F0.642462611910369
F0.44097199316698005
tp155
sg45
g55
sbag8
(g37
g10
Ntp156
Rp157
(dp158
g41
F0.04387298383326359
sg42
F0.7006648086973957
sg43
(F0.04657650657299141
F0.39280070607487166
F0.4592181234110547
tp159
sg45
g55
sbag8
(g37
g10
Ntp160
Rp161
(dp162
g41
F0.055740155840387814
sg42
F1.18719291253019
sg43
(F0.13211563487732786
F0.5528869368571384
F0.4333907339749948
tp163
sg45
g55
sbag8
(g37
g10
Ntp164
Rp165
(dp166
g41
F0.10843671517939099
sg42
F1.8246284197736182
sg43
(F0.028755321523277415
F0.4428353620994002
F0.38286222166215583
tp167
sg45
g55
sbag8
(g37
g10
Ntp168
Rp169
(dp170
g41
F0.03961338644097977
sg42
F0.8784920093376443
sg43
(F0.22598022516341304
F0.5361686776198399
F0.8503544799935729
tp171
sg45
g55
sbag8
(g37
g10
Ntp172
Rp173
(dp174
g41
F0.0012665147955292222
sg42
F0.3653921509338737
sg43
(F0.08864647536761638
F0.43645556575586536
F0.2872244056031077
tp175
sg45
g55
sbag8
(g37
g10
Ntp176
Rp177
(dp178
g41
F0.04333487525126063
sg42
F1.0533096247863343
sg43
(F0.3109928747852113
F0.6276362637856314
F0.7943387137198205
tp179
sg45
g55
sbag8
(g37
g10
Ntp180
Rp181
(dp182
g41
F0.04005855550182802
sg42
F0.9227596466976631
sg43
(F0.27945104058405534
F0.6237078788240874
F0.8549038396438045
tp183
sg45
g55
sbag8
(g37
g10
Ntp184
Rp185
(dp186
g41
F0.03537605486319463
sg42
F0.6382020017122175
sg43
(F0.009114537709037996
F0.3688446997777881
F0.23151752182052898
tp187
sg45
g55
sbag8
(g37
g10
Ntp188
Rp189
(dp190
g41
F0.04169428722882938
sg42
F0.8189523109509036
sg43
(F0.0040593793672559445
F0.5570461898857212
F0.9926792440086767
tp191
sg45
g55
sbag8
(g37
g10
Ntp192
Rp193
(dp194
g41
F0.08275852116641133
sg42
F1.573756484243236
sg43
(F0.08287268071105923
F0.4482860276954552
F0.644657331688457
tp195
sg45
g55
sbag8
(g37
g10
Ntp196
Rp197
(dp198
g41
F0.07699366926429588
sg42
F1.4703768266515047
sg43
(F0.12489144891916547
F0.605979554623489
F0.3907315272594732
tp199
sg45
g55
sbag8
(g37
g10
Ntp200
Rp201
(dp202
g41
F0.05781401457065921
sg42
F0.8952225837625821
sg43
(F0.06174367426219053
F0.3750508548532455
F0.19765515116088223
tp203
sg45
g55
sbag8
(g37
g10
Ntp204
Rp205
(dp206
g41
F0.04728583071736228
sg42
F0.7637034059809394
sg43
(F0.012936363852640971
F0.4848346787578081
F0.40449223864609396
tp207
sg45
g55
sbag8
(g37
g10
Ntp208
Rp209
(dp210
g41
F0.05674827037662748
sg42
F0.964404624720009
sg43
(F0.06056544238780193
F0.44008558211982646
F0.29189392380108625
tp211
sg45
g55
sbag8
(g37
g10
Ntp212
Rp213
(dp214
g41
F0.09021464572261154
sg42
F1.2752878858393546
sg43
(F0.03514645854388511
F0.6318626423943964
F-0.0018074381959380839
tp215
sg45
g55
sbag8
(g37
g10
Ntp216
Rp217
(dp218
g41
F0.07126464860608409
sg42
F1.01074950439593
sg43
(F0.09047246329429308
F0.5010744968750699
F0.6410756704126986
tp219
sg45
g55
sbag8
(g37
g10
Ntp220
Rp221
(dp222
g41
F0.059680014172259
sg42
F0.9174587595178967
sg43
(F0.1452676654386657
F0.47112275448320684
F0.6934876278657697
tp223
sg45
g55
sbag8
(g37
g10
Ntp224
Rp225
(dp226
g41
F0.033721407641990914
sg42
F0.7786169826415911
sg43
(F0.2755832280576223
F0.5676091738596111
F0.8275051607603283
tp227
sg45
g55
sbag8
(g37
g10
Ntp228
Rp229
(dp230
g41
F0.0762672227965959
sg42
F1.840319803846678
sg43
(F0.30371233411164533
F0.6882994777263232
F0.8263039282236934
tp231
sg45
g55
sbag8
(g37
g10
Ntp232
Rp233
(dp234
g41
F0.0832986126572007
sg42
F1.3498410863834909
sg43
(F0.06544152454152419
F0.4758517949999185
F0.1257997985091032
tp235
sg45
g55
sbag8
(g37
g10
Ntp236
Rp237
(dp238
g41
F0.08744733307806182
sg42
F1.4322135912411886
sg43
(F0.024650926427291258
F0.3068797594222811
F0.21957314374969875
tp239
sg45
g55
sbag8
(g37
g10
Ntp240
Rp241
(dp242
g41
F0.07527007590870552
sg42
F1.1379397332990344
sg43
(F0.12705283825827077
F0.5465668523889347
F0.6109595765843568
tp243
sg45
g55
sbag8
(g37
g10
Ntp244
Rp245
(dp246
g41
F0.042379653056903346
sg42
F0.5781211328369827
sg43
(F0.008686334291384622
F0.5740475926513658
F0.6281079721384999
tp247
sg45
g55
sbag8
(g37
g10
Ntp248
Rp249
(dp250
g41
F0.0539616947916262
sg42
F1.1037460074371475
sg43
(F0.28581285824809943
F0.6204718729014659
F0.4562987168568557
tp251
sg45
g55
sbag8
(g37
g10
Ntp252
Rp253
(dp254
g41
F0.10763447856628824
sg42
F1.5099810099317887
sg43
(F0.2673664421058018
F0.6773289807815104
F0.3151126755017567
tp255
sg45
g55
sbag8
(g37
g10
Ntp256
Rp257
(dp258
g41
F0.08519039099496556
sg42
F1.1757449804891842
sg43
(F0.19027363374269854
F0.7246899272062631
F0.9601166728643719
tp259
sg45
g55
sbag8
(g37
g10
Ntp260
Rp261
(dp262
g41
F0.0994881237262216
sg42
F1.2559278180784545
sg43
(F0.02179387542966112
F0.5752200875965516
F0.16161733602214942
tp263
sg45
g55
sbag8
(g37
g10
Ntp264
Rp265
(dp266
g41
F0.00321559635072792
sg42
F0.37820003696367294
sg43
(F0.058736043628685064
F0.5782808428782804
F0.2004737585424359
tp267
sg45
g55
sbag8
(g37
g10
Ntp268
Rp269
(dp270
g41
F0.04611956077686126
sg42
F0.9990253713356791
sg43
(F0.18940913795922246
F0.6147426695566187
F0.4160573219608187
tp271
sg45
g55
sbag8
(g37
g10
Ntp272
Rp273
(dp274
g41
F0.046953138307812156
sg42
F0.7335195002133762
sg43
(F0.2320889222171419
F0.4778533596515487
F0.6159763344426008
tp275
sg45
g55
sbag8
(g37
g10
Ntp276
Rp277
(dp278
g41
F0.045787148313674336
sg42
F0.8860280483585796
sg43
(F-0.00039004543668140306
F0.40277248198098026
F0.20172350298680644
tp279
sg45
g55
sbag8
(g37
g10
Ntp280
Rp281
(dp282
g41
F0.05874695490826638
sg42
F0.8027578454216104
sg43
(F0.1377917780973959
F0.4359799283864129
F0.6974291562665293
tp283
sg45
g55
sbag8
(g37
g10
Ntp284
Rp285
(dp286
g41
F0.06719589685700922
sg42
F1.1775769791052122
sg43
(F0.22053218932725532
F0.7625637513791049
F0.9931385425501567
tp287
sg45
g55
sbag8
(g37
g10
Ntp288
Rp289
(dp290
g41
F0.022182696858937034
sg42
F0.5575455146363756
sg43
(F0.0901142008600207
F0.6207014591159473
F0.42894032159592477
tp291
sg45
g55
sbag8
(g37
g10
Ntp292
Rp293
(dp294
g41
F0.06591033921591663
sg42
F1.015340313005803
sg43
(F0.18969426180506022
F0.6355361423862159
F0.5171387087126433
tp295
sg45
g55
sbag8
(g37
g10
Ntp296
Rp297
(dp298
g41
F0.04523045418730498
sg42
F0.8815412457355184
sg43
(F0.15015639899505984
F0.5421918506471671
F0.3900752709273381
tp299
sg45
g55
sbag8
(g37
g10
Ntp300
Rp301
(dp302
g41
F0.09794951426638893
sg42
F1.5944412525293339
sg43
(F0.09658092773934296
F0.35505272367324886
F0.430213844738931
tp303
sg45
g55
sbag8
(g37
g10
Ntp304
Rp305
(dp306
g41
F0.02740726984113842
sg42
F0.7239146833187553
sg43
(F0.212929618528782
F0.6019053771458597
F0.740073300252461
tp307
sg45
g55
sbag8
(g37
g10
Ntp308
Rp309
(dp310
g41
F0.023132107773959437
sg42
F0.5370654604218558
sg43
(F0.3099014028837832
F0.6507729190083954
F0.41333846600358065
tp311
sg45
g55
sbag8
(g37
g10
Ntp312
Rp313
(dp314
g41
F0.04416237830932018
sg42
F0.7450756689925716
sg43
(F0.06893908071705213
F0.5900258817867347
F0.6680043837143346
tp315
sg45
g55
sbag8
(g37
g10
Ntp316
Rp317
(dp318
g41
F0.061554532994725186
sg42
F0.7762575648477721
sg43
(F0.14219643604417637
F0.7802703393227286
F0.9787669667321365
tp319
sg45
g55
sbag8
(g37
g10
Ntp320
Rp321
(dp322
g41
F0.027090421634348105
sg42
F0.5999141011572778
sg43
(F0.20945276039570107
F0.5880032595521956
F0.6927859018239922
tp323
sg45
g55
sbag8
(g37
g10
Ntp324
Rp325
(dp326
g41
F0.07485748233471895
sg42
F1.1565456587133414
sg43
(F0.011784514054852549
F0.3429307508193744
F0.49900257346572624
tp327
sg45
g55
sbag8
(g37
g10
Ntp328
Rp329
(dp330
g41
F0.04986719005890694
sg42
F0.669754395943801
sg43
(F0.2179653243039314
F0.748907008155689
F0.9685442250745788
tp331
sg45
g55
sbag8
(g37
g10
Ntp332
Rp333
(dp334
g41
F0.06905199182370508
sg42
F1.0978008353777657
sg43
(F0.15885784470532358
F0.4025649332251884
F0.674292693133734
tp335
sg45
g55
sbag8
(g37
g10
Ntp336
Rp337
(dp338
g41
F0.04690631524054936
sg42
F0.9609769434731571
sg43
(F0.21807705109302622
F0.6476133445801319
F0.7812348491160913
tp339
sg45
g55
sbag8
(g37
g10
Ntp340
Rp341
(dp342
g41
F0.07770993964377942
sg42
F1.2345514683437653
sg43
(F0.18806938336592827
F0.7483244858338295
F0.9000811243017718
tp343
sg45
g55
sbag8
(g37
g10
Ntp344
Rp345
(dp346
g41
F0.023095663001090172
sg42
F0.609902906200129
sg43
(F0.20773236569753398
F0.529179415588302
F0.5063839814188182
tp347
sg45
g55
sbag8
(g37
g10
Ntp348
Rp349
(dp350
g41
F0.0374538976388238
sg42
F0.715327934794008
sg43
(F0.2599435630725482
F0.7210856346004442
F0.9344487597004232
tp351
sg45
g55
sbag8
(g37
g10
Ntp352
Rp353
(dp354
g41
F0.045779051283270394
sg42
F0.5951034652306304
sg43
(F0.17337600355426921
F0.6546232251428047
F0.9325010612263863
tp355
sg45
g55
sbag8
(g37
g10
Ntp356
Rp357
(dp358
g41
F0.062126969592708664
sg42
F1.198236559234529
sg43
(F0.18955354388753098
F0.40930208217517966
F0.6101782647283521
tp359
sg45
g55
sbag8
(g37
g10
Ntp360
Rp361
(dp362
g41
F0.06013699932934599
sg42
F1.0677053530066165
sg43
(F0.020453195483551397
F0.3352352218100452
F0.3985348925803421
tp363
sg45
g55
sbag8
(g37
g10
Ntp364
Rp365
(dp366
g41
F0.0531098221645684
sg42
F0.9657863676466888
sg43
(F0.1368025201082797
F0.6295188286435892
F0.4594180809309078
tp367
sg45
g55
sbag8
(g37
g10
Ntp368
Rp369
(dp370
g41
F0.05730888461899401
sg42
F1.0823481496699556
sg43
(F0.2827817216187891
F0.6596403436916332
F0.36508100471993854
tp371
sg45
g55
sbag8
(g37
g10
Ntp372
Rp373
(dp374
g41
F0.04342453265248079
sg42
F0.918607301882722
sg43
(F0.2063404293280681
F0.6451279342419621
F0.4682814850277388
tp375
sg45
g55
sbag8
(g37
g10
Ntp376
Rp377
(dp378
g41
F0.03957893231876802
sg42
F0.7115433378845999
sg43
(F0.07135056211960161
F0.4173625440070909
F0.43763607198445514
tp379
sg45
g55
sbag8
(g37
g10
Ntp380
Rp381
(dp382
g41
F0.07603492446966478
sg42
F1.1648572137697186
sg43
(F0.14498415109385288
F0.694854843756329
F0.8933211426931462
tp383
sg45
g55
sbag8
(g37
g10
Ntp384
Rp385
(dp386
g41
F0.07228714724004409
sg42
F1.0686026680427867
sg43
(F0.24412231767074416
F0.5155602560329049
F0.6169434007654492
tp387
sg45
g55
sbag8
(g37
g10
Ntp388
Rp389
(dp390
g41
F0.03451997805426943
sg42
F0.8092799172413621
sg43
(F0.28656704026229446
F0.6105144645937053
F0.48150934273643947
tp391
sg45
g55
sbag8
(g37
g10
Ntp392
Rp393
(dp394
g41
F0.03002373005686676
sg42
F0.4524502309740022
sg43
(F0.17717285921517864
F0.49436344410044725
F0.6831150947340805
tp395
sg45
g55
sbag8
(g37
g10
Ntp396
Rp397
(dp398
g41
F0.07878356349341778
sg42
F0.922023617546869
sg43
(F0.04813726137019889
F0.36247784881155365
F0.4612564637793435
tp399
sg45
g55
sbag8
(g37
g10
Ntp400
Rp401
(dp402
g41
F0.04913322876422575
sg42
F0.8272819406012236
sg43
(F0.06306352761242001
F0.5307408180736122
F0.07214915581024381
tp403
sg45
g55
sbag8
(g37
g10
Ntp404
Rp405
(dp406
g41
F0.07706441604023526
sg42
F1.0243552692825668
sg43
(F0.0016640319680915386
F0.5798688939951244
F0.39827884201344216
tp407
sg45
g55
sbag8
(g37
g10
Ntp408
Rp409
(dp410
g41
F0.010323906438538907
sg42
F0.29629932882691723
sg43
(F0.1617248840908482
F0.5310645485197014
F0.9547113225605885
tp411
sg45
g55
sbag8
(g37
g10
Ntp412
Rp413
(dp414
g41
F0.05981770612620016
sg42
F0.9112223063038967
sg43
(F0.18497276227117262
F0.5275330144316207
F0.6758623920347496
tp415
sg45
g55
sbag8
(g37
g10
Ntp416
Rp417
(dp418
g41
F0.014175079830488463
sg42
F0.4821650989826506
sg43
(F0.01164686599113343
F0.5787546212179774
F0.9393584354592053
tp419
sg45
g55
sbag8
(g37
g10
Ntp420
Rp421
(dp422
g41
F0.006172375376227723
sg42
F0.4402378848322846
sg43
(F0.2302407933515498
F0.658130710380051
F0.4464305689005929
tp423
sg45
g55
sbag8
(g37
g10
Ntp424
Rp425
(dp426
g41
F0.033355343964831474
sg42
F0.5601014386954052
sg43
(F0.25419278857768024
F0.7200051867954805
F0.9066802059732217
tp427
sg45
g55
sbag8
(g37
g10
Ntp428
Rp429
(dp430
g41
F0.050915551720818936
sg42
F0.8278936381177598
sg43
(F0.1117943665029312
F0.5402436416053257
F0.16501102254284108
tp431
sg45
g55
sbag8
(g37
g10
Ntp432
Rp433
(dp434
g41
F0.06418002360295227
sg42
F1.1070149933961042
sg43
(F0.06890201917414576
F0.56088729623582
F0.20272627519358255
tp435
sg45
g55
sbag8
(g37
g10
Ntp436
Rp437
(dp438
g41
F0.0012665147955292222
sg42
F0.3806918221341137
sg43
(F0.11725523346731746
F0.5111822164737102
F0.6219703417540567
tp439
sg45
g55
sbag8
(g37
g10
Ntp440
Rp441
(dp442
g41
F0.040787284238713764
sg42
F0.71836306294936
sg43
(F0.21792752850724886
F0.6520505799386704
F0.4952601691043646
tp443
sg45
g55
sbag8
(g37
g10
Ntp444
Rp445
(dp446
g41
F0.07994887443010801
sg42
F0.8828460009625998
sg43
(F0.16260434793292103
F0.43174964634989144
F0.38966200035853715
tp447
sg45
g55
sbag8
(g37
g10
Ntp448
Rp449
(dp450
g41
F0.06231473764819073
sg42
F0.9092375609179237
sg43
(F0.16180466233250843
F0.551523660503103
F0.06640253304340596
tp451
sg45
g55
sbag8
(g37
g10
Ntp452
Rp453
(dp454
g41
F0.07768834197264798
sg42
F1.0647137548255032
sg43
(F0.14389225460411956
F0.7560841845106063
F0.9370295575562129
tp455
sg45
g55
sbag8
(g37
g10
Ntp456
Rp457
(dp458
g41
F0.03565215510293217
sg42
F0.5237868108894
sg43
(F0.038525504650237276
F0.566787117669106
F0.24989487974569813
tp459
sg45
g55
sbag8
(g37
g10
Ntp460
Rp461
(dp462
g41
F0.032090820224439626
sg42
F0.4847058159482378
sg43
(F0.17176060174917113
F0.7771194733203008
F0.9893239564381795
tp463
sg45
g55
sbag8
(g37
g10
Ntp464
Rp465
(dp466
g41
F0.05263710824816681
sg42
F0.7367879849519557
sg43
(F0.1930491209377113
F0.5502240377616774
F0.7016562332715818
tp467
sg45
g55
sbag8
(g37
g10
Ntp468
Rp469
(dp470
g41
F0.03675182557625167
sg42
F0.7816270498271317
sg43
(F0.3119984401999986
F0.6493993019145169
F0.19061710696411638
tp471
sg45
g55
sbag8
(g37
g10
Ntp472
Rp473
(dp474
g41
F0.05106852157313757
sg42
F0.11461796039468619
sg43
(F0.033657605285638145
F0.5214359681502407
F0.24136131860812393
tp475
sg45
g55
sbag8
(g37
g10
Ntp476
Rp477
(dp478
g41
F0.04773739459946176
sg42
F0.7495461644566727
sg43
(F0.04635336580444535
F0.46027006767366296
F0.6712520561229683
tp479
sg45
g55
sbag8
(g37
g10
Ntp480
Rp481
(dp482
g41
F0.0864571884826649
sg42
F0.8462491610177184
sg43
(F0.1527403262800183
F0.7637044057057925
F0.7930322043235086
tp483
sg45
g55
sbasbss.