Solution_name,Model,Docking_region,mapLLG,Z-score,Map-ModelSol-CC,Mtz-ModelSol-CC,Annotation,VRMS
283236177-882433541-rmr-1.coordinates.pdb,7nyuM.pdb,focus1_76681677007041_weighted_map_data,213.070218,72.893765, ND ,0.3950371116434942, RF=223/93%/5.1 RFR=4/98%/4.7 GYRE PTF=82/100%/72.9 POSE=85 PAK=0% RMR=126 RMR=127 RMR=213,2.2027196825742488
433080415-882433541-rmr-2.coordinates.pdb,7nyuM.pdb,focus2_76681677007041_weighted_map_data,148.301739,63.711381, ND ,0.27284477238892896, RF=210/88%/4.8 RFR=2/93%/3.8 GYRE PTF=37/86%/63.7 POSE=38 PAK=0% RMR=107 RMR=108 RMR=148,2.8375285020594947
