{
    "_comment:": "OS_PACKER_SOURCE_IMAGE_ID is the OpenStack Glance Image Id of the Ubuntu 18.04 image that has been already uploaded into glacee",
    "_comment:": "OS_NETWORKS_ID is the ID under the name of the nework located under Networks in the Horizion WebUI ",
    "_comment:": "OS_FLOATING_IP_POOL is the name of the OpenStack floating ip network to use",
    "variables": {
        "os_auth_url": "{{env `OS_AUTH_URL`}}",
        "os_username": "{{env `OS_USERNAME`}}",
        "os_password": "{{env `OS_PASSWORD`}}",
        "os_domain_name": "{{env `OS_DOMAIN_NAME`}}",
        "os_tenant_name": "{{env `OS_TENANT_NAME`}}",
        "os_source_image_id": "{{env `OS_SOURCE_IMAGE`}}",
        "os_networks_id": "{{env `OS_NETWORKS_ID`}}",
        "os_floating_ip_pool": "{{env `OS_FLOATING_IP_POOL`}}",
        "k3os_version": "v0.5.0",
        "iso_url": "https://github.com/rancher/k3os/releases/download/v0.5.0/k3os-amd64.iso"
    },
    "builders": [
        {
            "type": "openstack",
            "flavor": "C1.vss.tiny",
            "ssh_username": "ubuntu",
            "image_name": "k3OS-{{user `k3os_version`}}-amd64",
            "source_image": "{{user `os_source_image_id`}}",
            "networks": "{{user `os_networks_id`}}",
            "floating_ip_pool": "{{user `os_floating_ip_pool`}}",
            "use_floating_ip": true,
            "security_groups": [
                "default"
            ]
        }
    ],
    "provisioners": [
        {
            "type": "file",
            "source": "./openstack.yml",
            "destination": "/tmp/config.yaml"
        },
        {
            "type": "file",
            "source": "k3os/install.sh",
            "destination": "/tmp/"
        },
        {
            "type": "shell",
            "inline": [
                "sudo apt-get update -y",
                "sudo apt-get install -y dosfstools parted",
                "sudo bash -x /tmp/install.sh --takeover --debug --tty ttyS0 --config /tmp/config.yaml --no-format $(findmnt / -o SOURCE -n) \"{{user `iso_url`}}\" && sync"
            ]
        },
        {
            "type": "shell",
            "inline": [
                "set -x; sudo systemd-run --on-active=3 --timer-property=AccuracySec=100ms sudo systemctl reboot --force --force; sync; echo Rebooting"
            ]
        }
    ]
}