%FSLAX45Y45*%
G04 Gerber Fmt 4.5, Leading zero omitted, Abs format (unit mm)*
G04 Created by KiCad (PCBNEW (5.1.9)-1) date 2021-05-04 17:33:52*
%MOMM*%
%LPD*%
G01*
G04 APERTURE LIST*
%TA.AperFunction,Profile*%
%ADD10C,0.050000*%
%TD*%
%ADD11C,0.200000*%
%ADD12C,0.300000*%
G04 APERTURE END LIST*
D10*
X20400000Y-18200000D02*
G75*
G02*
X20800000Y-18600000I0J-400000D01*
G01*
X20000000Y-18200000D02*
X20400000Y-18200000D01*
X20800000Y-19000000D02*
X20800000Y-18600000D01*
X20000000Y-18200000D02*
X20000000Y-10800000D01*
X20800000Y-10400000D02*
G75*
G02*
X20400000Y-10800000I-400000J0D01*
G01*
X20800000Y-10000000D02*
X20800000Y-10400000D01*
X20000000Y-10800000D02*
X20400000Y-10800000D01*
X20800000Y-10000000D02*
X30200000Y-10000000D01*
X30600000Y-10800000D02*
G75*
G02*
X30200000Y-10400000I0J400000D01*
G01*
X31000000Y-10800000D02*
X30600000Y-10800000D01*
X30200000Y-10000000D02*
X30200000Y-10400000D01*
X31000000Y-10800000D02*
X31000000Y-18200000D01*
X30200000Y-18600000D02*
G75*
G02*
X30600000Y-18200000I400000J0D01*
G01*
X30200000Y-19000000D02*
X30200000Y-18600000D01*
X31000000Y-18200000D02*
X30600000Y-18200000D01*
X30200000Y-19000000D02*
X20800000Y-19000000D01*
D11*
X20315000Y-11115000D02*
X20585000Y-11385000D01*
X20585000Y-11115000D02*
X20315000Y-11385000D01*
X20315000Y-17615000D02*
X20585000Y-17885000D01*
X20585000Y-17615000D02*
X20315000Y-17885000D01*
X30415000Y-11115000D02*
X30685000Y-11385000D01*
X30685000Y-11115000D02*
X30415000Y-11385000D01*
X30415000Y-17615000D02*
X30685000Y-17885000D01*
X30685000Y-17615000D02*
X30415000Y-17885000D01*
D12*
X20283928Y-19468214D02*
X20283928Y-19168214D01*
X20355357Y-19168214D01*
X20398214Y-19182500D01*
X20426786Y-19211072D01*
X20441071Y-19239643D01*
X20455357Y-19296786D01*
X20455357Y-19339643D01*
X20441071Y-19396786D01*
X20426786Y-19425357D01*
X20398214Y-19453929D01*
X20355357Y-19468214D01*
X20283928Y-19468214D01*
X20583928Y-19468214D02*
X20583928Y-19268214D01*
X20583928Y-19325357D02*
X20598214Y-19296786D01*
X20612500Y-19282500D01*
X20641071Y-19268214D01*
X20669643Y-19268214D01*
X20769643Y-19468214D02*
X20769643Y-19268214D01*
X20769643Y-19168214D02*
X20755357Y-19182500D01*
X20769643Y-19196786D01*
X20783928Y-19182500D01*
X20769643Y-19168214D01*
X20769643Y-19196786D01*
X20955357Y-19468214D02*
X20926786Y-19453929D01*
X20912500Y-19425357D01*
X20912500Y-19168214D01*
X21112500Y-19468214D02*
X21083928Y-19453929D01*
X21069643Y-19425357D01*
X21069643Y-19168214D01*
X21455357Y-19468214D02*
X21455357Y-19168214D01*
X21555357Y-19382500D01*
X21655357Y-19168214D01*
X21655357Y-19468214D01*
X21926786Y-19468214D02*
X21926786Y-19311072D01*
X21912500Y-19282500D01*
X21883928Y-19268214D01*
X21826786Y-19268214D01*
X21798214Y-19282500D01*
X21926786Y-19453929D02*
X21898214Y-19468214D01*
X21826786Y-19468214D01*
X21798214Y-19453929D01*
X21783928Y-19425357D01*
X21783928Y-19396786D01*
X21798214Y-19368214D01*
X21826786Y-19353929D01*
X21898214Y-19353929D01*
X21926786Y-19339643D01*
X22069643Y-19268214D02*
X22069643Y-19568214D01*
X22069643Y-19282500D02*
X22098214Y-19268214D01*
X22155357Y-19268214D01*
X22183928Y-19282500D01*
X22198214Y-19296786D01*
X22212500Y-19325357D01*
X22212500Y-19411072D01*
X22198214Y-19439643D01*
X22183928Y-19453929D01*
X22155357Y-19468214D01*
X22098214Y-19468214D01*
X22069643Y-19453929D01*
X22341071Y-19439643D02*
X22355357Y-19453929D01*
X22341071Y-19468214D01*
X22326786Y-19453929D01*
X22341071Y-19439643D01*
X22341071Y-19468214D01*
X22341071Y-19282500D02*
X22355357Y-19296786D01*
X22341071Y-19311072D01*
X22326786Y-19296786D01*
X22341071Y-19282500D01*
X22341071Y-19311072D01*
X19727500Y-19827500D02*
X19997500Y-20097500D01*
X19997500Y-19827500D02*
X19727500Y-20097500D01*
X20269643Y-19826786D02*
X20283928Y-19812500D01*
X20312500Y-19798214D01*
X20383928Y-19798214D01*
X20412500Y-19812500D01*
X20426786Y-19826786D01*
X20441071Y-19855357D01*
X20441071Y-19883929D01*
X20426786Y-19926786D01*
X20255357Y-20098214D01*
X20441071Y-20098214D01*
X20569643Y-20069643D02*
X20583928Y-20083929D01*
X20569643Y-20098214D01*
X20555357Y-20083929D01*
X20569643Y-20069643D01*
X20569643Y-20098214D01*
X20683928Y-19798214D02*
X20883928Y-19798214D01*
X20755357Y-20098214D01*
X21055357Y-19798214D02*
X21083928Y-19798214D01*
X21112500Y-19812500D01*
X21126786Y-19826786D01*
X21141071Y-19855357D01*
X21155357Y-19912500D01*
X21155357Y-19983929D01*
X21141071Y-20041072D01*
X21126786Y-20069643D01*
X21112500Y-20083929D01*
X21083928Y-20098214D01*
X21055357Y-20098214D01*
X21026786Y-20083929D01*
X21012500Y-20069643D01*
X20998214Y-20041072D01*
X20983928Y-19983929D01*
X20983928Y-19912500D01*
X20998214Y-19855357D01*
X21012500Y-19826786D01*
X21026786Y-19812500D01*
X21055357Y-19798214D01*
X21283928Y-20098214D02*
X21283928Y-19898214D01*
X21283928Y-19926786D02*
X21298214Y-19912500D01*
X21326786Y-19898214D01*
X21369643Y-19898214D01*
X21398214Y-19912500D01*
X21412500Y-19941072D01*
X21412500Y-20098214D01*
X21412500Y-19941072D02*
X21426786Y-19912500D01*
X21455357Y-19898214D01*
X21498214Y-19898214D01*
X21526786Y-19912500D01*
X21541071Y-19941072D01*
X21541071Y-20098214D01*
X21683928Y-20098214D02*
X21683928Y-19898214D01*
X21683928Y-19926786D02*
X21698214Y-19912500D01*
X21726786Y-19898214D01*
X21769643Y-19898214D01*
X21798214Y-19912500D01*
X21812500Y-19941072D01*
X21812500Y-20098214D01*
X21812500Y-19941072D02*
X21826786Y-19912500D01*
X21855357Y-19898214D01*
X21898214Y-19898214D01*
X21926786Y-19912500D01*
X21941071Y-19941072D01*
X21941071Y-20098214D01*
X22526786Y-19783929D02*
X22269643Y-20169643D01*
X22912500Y-19798214D02*
X22941071Y-19798214D01*
X22969643Y-19812500D01*
X22983928Y-19826786D01*
X22998214Y-19855357D01*
X23012500Y-19912500D01*
X23012500Y-19983929D01*
X22998214Y-20041072D01*
X22983928Y-20069643D01*
X22969643Y-20083929D01*
X22941071Y-20098214D01*
X22912500Y-20098214D01*
X22883928Y-20083929D01*
X22869643Y-20069643D01*
X22855357Y-20041072D01*
X22841071Y-19983929D01*
X22841071Y-19912500D01*
X22855357Y-19855357D01*
X22869643Y-19826786D01*
X22883928Y-19812500D01*
X22912500Y-19798214D01*
X23141071Y-20069643D02*
X23155357Y-20083929D01*
X23141071Y-20098214D01*
X23126786Y-20083929D01*
X23141071Y-20069643D01*
X23141071Y-20098214D01*
X23441071Y-20098214D02*
X23269643Y-20098214D01*
X23355357Y-20098214D02*
X23355357Y-19798214D01*
X23326786Y-19841072D01*
X23298214Y-19869643D01*
X23269643Y-19883929D01*
X23626786Y-19798214D02*
X23655357Y-19798214D01*
X23683928Y-19812500D01*
X23698214Y-19826786D01*
X23712500Y-19855357D01*
X23726786Y-19912500D01*
X23726786Y-19983929D01*
X23712500Y-20041072D01*
X23698214Y-20069643D01*
X23683928Y-20083929D01*
X23655357Y-20098214D01*
X23626786Y-20098214D01*
X23598214Y-20083929D01*
X23583928Y-20069643D01*
X23569643Y-20041072D01*
X23555357Y-19983929D01*
X23555357Y-19912500D01*
X23569643Y-19855357D01*
X23583928Y-19826786D01*
X23598214Y-19812500D01*
X23626786Y-19798214D01*
X23983928Y-19798214D02*
X23926786Y-19798214D01*
X23898214Y-19812500D01*
X23883928Y-19826786D01*
X23855357Y-19869643D01*
X23841071Y-19926786D01*
X23841071Y-20041072D01*
X23855357Y-20069643D01*
X23869643Y-20083929D01*
X23898214Y-20098214D01*
X23955357Y-20098214D01*
X23983928Y-20083929D01*
X23998214Y-20069643D01*
X24012500Y-20041072D01*
X24012500Y-19969643D01*
X23998214Y-19941072D01*
X23983928Y-19926786D01*
X23955357Y-19912500D01*
X23898214Y-19912500D01*
X23869643Y-19926786D01*
X23855357Y-19941072D01*
X23841071Y-19969643D01*
X24126786Y-19798214D02*
X24126786Y-19855357D01*
X24241071Y-19798214D02*
X24241071Y-19855357D01*
X24683928Y-20212500D02*
X24669643Y-20198214D01*
X24641071Y-20155357D01*
X24626786Y-20126786D01*
X24612500Y-20083929D01*
X24598214Y-20012500D01*
X24598214Y-19955357D01*
X24612500Y-19883929D01*
X24626786Y-19841072D01*
X24641071Y-19812500D01*
X24669643Y-19769643D01*
X24683928Y-19755357D01*
X24926786Y-19898214D02*
X24926786Y-20098214D01*
X24855357Y-19783929D02*
X24783928Y-19998214D01*
X24969643Y-19998214D01*
X25312500Y-20098214D02*
X25312500Y-19798214D01*
X25441071Y-20098214D02*
X25441071Y-19941072D01*
X25426786Y-19912500D01*
X25398214Y-19898214D01*
X25355357Y-19898214D01*
X25326786Y-19912500D01*
X25312500Y-19926786D01*
X25626786Y-20098214D02*
X25598214Y-20083929D01*
X25583928Y-20069643D01*
X25569643Y-20041072D01*
X25569643Y-19955357D01*
X25583928Y-19926786D01*
X25598214Y-19912500D01*
X25626786Y-19898214D01*
X25669643Y-19898214D01*
X25698214Y-19912500D01*
X25712500Y-19926786D01*
X25726786Y-19955357D01*
X25726786Y-20041072D01*
X25712500Y-20069643D01*
X25698214Y-20083929D01*
X25669643Y-20098214D01*
X25626786Y-20098214D01*
X25898214Y-20098214D02*
X25869643Y-20083929D01*
X25855357Y-20055357D01*
X25855357Y-19798214D01*
X26126786Y-20083929D02*
X26098214Y-20098214D01*
X26041071Y-20098214D01*
X26012500Y-20083929D01*
X25998214Y-20055357D01*
X25998214Y-19941072D01*
X26012500Y-19912500D01*
X26041071Y-19898214D01*
X26098214Y-19898214D01*
X26126786Y-19912500D01*
X26141071Y-19941072D01*
X26141071Y-19969643D01*
X25998214Y-19998214D01*
X26255357Y-20083929D02*
X26283928Y-20098214D01*
X26341071Y-20098214D01*
X26369643Y-20083929D01*
X26383928Y-20055357D01*
X26383928Y-20041072D01*
X26369643Y-20012500D01*
X26341071Y-19998214D01*
X26298214Y-19998214D01*
X26269643Y-19983929D01*
X26255357Y-19955357D01*
X26255357Y-19941072D01*
X26269643Y-19912500D01*
X26298214Y-19898214D01*
X26341071Y-19898214D01*
X26369643Y-19912500D01*
X26483928Y-20212500D02*
X26498214Y-20198214D01*
X26526786Y-20155357D01*
X26541071Y-20126786D01*
X26555357Y-20083929D01*
X26569643Y-20012500D01*
X26569643Y-19955357D01*
X26555357Y-19883929D01*
X26541071Y-19841072D01*
X26526786Y-19812500D01*
X26498214Y-19769643D01*
X26483928Y-19755357D01*
X27026786Y-20212500D02*
X27012500Y-20198214D01*
X26983928Y-20155357D01*
X26969643Y-20126786D01*
X26955357Y-20083929D01*
X26941071Y-20012500D01*
X26941071Y-19955357D01*
X26955357Y-19883929D01*
X26969643Y-19841072D01*
X26983928Y-19812500D01*
X27012500Y-19769643D01*
X27026786Y-19755357D01*
X27141071Y-19898214D02*
X27141071Y-20098214D01*
X27141071Y-19926786D02*
X27155357Y-19912500D01*
X27183928Y-19898214D01*
X27226786Y-19898214D01*
X27255357Y-19912500D01*
X27269643Y-19941072D01*
X27269643Y-20098214D01*
X27455357Y-20098214D02*
X27426786Y-20083929D01*
X27412500Y-20069643D01*
X27398214Y-20041072D01*
X27398214Y-19955357D01*
X27412500Y-19926786D01*
X27426786Y-19912500D01*
X27455357Y-19898214D01*
X27498214Y-19898214D01*
X27526786Y-19912500D01*
X27541071Y-19926786D01*
X27555357Y-19955357D01*
X27555357Y-20041072D01*
X27541071Y-20069643D01*
X27526786Y-20083929D01*
X27498214Y-20098214D01*
X27455357Y-20098214D01*
X27641071Y-19898214D02*
X27755357Y-19898214D01*
X27683928Y-19798214D02*
X27683928Y-20055357D01*
X27698214Y-20083929D01*
X27726786Y-20098214D01*
X27755357Y-20098214D01*
X28083928Y-19898214D02*
X28083928Y-20198214D01*
X28083928Y-19912500D02*
X28112500Y-19898214D01*
X28169643Y-19898214D01*
X28198214Y-19912500D01*
X28212500Y-19926786D01*
X28226786Y-19955357D01*
X28226786Y-20041072D01*
X28212500Y-20069643D01*
X28198214Y-20083929D01*
X28169643Y-20098214D01*
X28112500Y-20098214D01*
X28083928Y-20083929D01*
X28398214Y-20098214D02*
X28369643Y-20083929D01*
X28355357Y-20055357D01*
X28355357Y-19798214D01*
X28641071Y-20098214D02*
X28641071Y-19941072D01*
X28626786Y-19912500D01*
X28598214Y-19898214D01*
X28541071Y-19898214D01*
X28512500Y-19912500D01*
X28641071Y-20083929D02*
X28612500Y-20098214D01*
X28541071Y-20098214D01*
X28512500Y-20083929D01*
X28498214Y-20055357D01*
X28498214Y-20026786D01*
X28512500Y-19998214D01*
X28541071Y-19983929D01*
X28612500Y-19983929D01*
X28641071Y-19969643D01*
X28741071Y-19898214D02*
X28855357Y-19898214D01*
X28783928Y-19798214D02*
X28783928Y-20055357D01*
X28798214Y-20083929D01*
X28826786Y-20098214D01*
X28855357Y-20098214D01*
X29069643Y-20083929D02*
X29041071Y-20098214D01*
X28983928Y-20098214D01*
X28955357Y-20083929D01*
X28941071Y-20055357D01*
X28941071Y-19941072D01*
X28955357Y-19912500D01*
X28983928Y-19898214D01*
X29041071Y-19898214D01*
X29069643Y-19912500D01*
X29083928Y-19941072D01*
X29083928Y-19969643D01*
X28941071Y-19998214D01*
X29341071Y-20098214D02*
X29341071Y-19798214D01*
X29341071Y-20083929D02*
X29312500Y-20098214D01*
X29255357Y-20098214D01*
X29226786Y-20083929D01*
X29212500Y-20069643D01*
X29198214Y-20041072D01*
X29198214Y-19955357D01*
X29212500Y-19926786D01*
X29226786Y-19912500D01*
X29255357Y-19898214D01*
X29312500Y-19898214D01*
X29341071Y-19912500D01*
X29455357Y-20212500D02*
X29469643Y-20198214D01*
X29498214Y-20155357D01*
X29512500Y-20126786D01*
X29526786Y-20083929D01*
X29541071Y-20012500D01*
X29541071Y-19955357D01*
X29526786Y-19883929D01*
X29512500Y-19841072D01*
X29498214Y-19812500D01*
X29469643Y-19769643D01*
X29455357Y-19755357D01*
M02*
