EESchema Schematic File Version 4
EELAYER 30 0
EELAYER END
$Descr A3 16535 11693
encoding utf-8
Sheet 1 1
Title "BREAKOUT BOARD"
Date "2022-05-25"
Rev ""
Comp "University of Cambridge"
Comment1 "Cavendish Laboratory"
Comment2 "Astrophysics Group"
Comment3 ""
Comment4 ""
$EndDescr
$Comp
L Reach-Breakout-rescue:Mounting_Hole-Mechanical MK1
U 1 1 5834FB2E
P 1000 10650
F 0 "MK1" H 1100 10696 50  0000 L CNN
F 1 "M2.5" H 1100 10605 50  0000 L CNN
F 2 "MountingHole:MountingHole_2.7mm_M2.5" H 1000 10650 60  0001 C CNN
F 3 "" H 1000 10650 60  0001 C CNN
	1    1000 10650
	1    0    0    -1  
$EndComp
$Comp
L Reach-Breakout-rescue:Mounting_Hole-Mechanical MK3
U 1 1 5834FBEF
P 1450 10650
F 0 "MK3" H 1550 10696 50  0000 L CNN
F 1 "M2.5" H 1550 10605 50  0000 L CNN
F 2 "MountingHole:MountingHole_2.7mm_M2.5" H 1450 10650 60  0001 C CNN
F 3 "" H 1450 10650 60  0001 C CNN
	1    1450 10650
	1    0    0    -1  
$EndComp
$Comp
L Reach-Breakout-rescue:Mounting_Hole-Mechanical MK2
U 1 1 5834FC19
P 1000 10850
F 0 "MK2" H 1100 10896 50  0000 L CNN
F 1 "M2.5" H 1100 10805 50  0000 L CNN
F 2 "MountingHole:MountingHole_2.7mm_M2.5" H 1000 10850 60  0001 C CNN
F 3 "" H 1000 10850 60  0001 C CNN
	1    1000 10850
	1    0    0    -1  
$EndComp
$Comp
L Reach-Breakout-rescue:Mounting_Hole-Mechanical MK4
U 1 1 5834FC4F
P 1450 10850
F 0 "MK4" H 1550 10896 50  0000 L CNN
F 1 "M2.5" H 1550 10805 50  0000 L CNN
F 2 "MountingHole:MountingHole_2.7mm_M2.5" H 1450 10850 60  0001 C CNN
F 3 "" H 1450 10850 60  0001 C CNN
	1    1450 10850
	1    0    0    -1  
$EndComp
Text Notes 1000 10500 0    50   ~ 0
Mounting Holes
$Comp
L power:GND #PWR07
U 1 1 6027570A
P 2450 3750
F 0 "#PWR07" H 2450 3500 50  0001 C CNN
F 1 "GND" H 2455 3577 50  0000 C CNN
F 2 "" H 2450 3750 50  0001 C CNN
F 3 "" H 2450 3750 50  0001 C CNN
	1    2450 3750
	1    0    0    -1  
$EndComp
Wire Wire Line
	2550 2000 2450 2000
Wire Wire Line
	2450 2000 2450 2300
Wire Wire Line
	2550 2300 2450 2300
Wire Wire Line
	2550 3700 2450 3700
Connection ~ 2450 3700
Wire Wire Line
	2450 3700 2450 3750
$Comp
L SamacSys_Parts:380-015-113L001 J4
U 1 1 6028E8D6
P 12950 5100
F 0 "J4" V 13000 4950 50  0000 L CNN
F 1 "MS3 4w" V 13100 4750 50  0000 L CNN
F 2 "380015113L001" H 14100 5400 50  0001 L CNN
F 3 "http://www.farnell.com/datasheets/1633170.pdf" H 14100 5300 50  0001 L CNN
F 4 "Norcomp 380, MICRO-D Series, 15 Way PCB D-sub Connector Plug, 1.27mm Pitch" H 14100 5200 50  0001 L CNN "Description"
F 5 "10.2" H 14100 5100 50  0001 L CNN "Height"
F 6 "NorComp" H 14100 5000 50  0001 L CNN "Manufacturer_Name"
F 7 "380-015-113L001" H 14100 4900 50  0001 L CNN "Manufacturer_Part_Number"
F 8 "636-380-015-113L001" H 14100 4800 50  0001 L CNN "Mouser Part Number"
F 9 "https://www.mouser.co.uk/ProductDetail/NorComp/380-015-113L001?qs=BKMrj6kJNGajQJrf%252BkD1Mg%3D%3D" H 14100 4700 50  0001 L CNN "Mouser Price/Stock"
F 10 "" H 14100 4600 50  0001 L CNN "Arrow Part Number"
F 11 "" H 14100 4500 50  0001 L CNN "Arrow Price/Stock"
	1    12950 5100
	0    -1   1    0   
$EndComp
$Comp
L SamacSys_Parts:CAY16-103J4LF RN1
U 1 1 602A352F
P 5600 2200
F 0 "RN1" H 5800 1650 50  0000 L CNN
F 1 "1k5" H 5800 1750 50  0000 L CNN
F 2 "CAY16-103J4LF" H 6550 2300 50  0001 L CNN
F 3 "http://uk.rs-online.com/web/p/products/5225585" H 6550 2200 50  0001 L CNN
F 4 "4-array convex 0603 LF resistor,10K Bourns CAY16 Series 10k +/-5% Isolated SMT Resistor Array, 4 Resistors, 0.25W total 1206 package Convex" H 6550 2100 50  0001 L CNN "Description"
F 5 "" H 6550 2000 50  0001 L CNN "Height"
F 6 "Bourns" H 6550 1900 50  0001 L CNN "Manufacturer_Name"
F 7 "CAY16-1501F4LF " H 6550 1800 50  0001 L CNN "Manufacturer_Part_Number"
	1    5600 2200
	1    0    0    1   
$EndComp
$Comp
L SamacSys_Parts:CAY16-103J4LF RN2
U 1 1 602BC101
P 5600 3700
F 0 "RN2" H 5800 3250 50  0000 L CNN
F 1 "1k5" H 5800 3150 50  0000 L CNN
F 2 "CAY16-103J4LF" H 6550 3800 50  0001 L CNN
F 3 "http://uk.rs-online.com/web/p/products/5225585" H 6550 3700 50  0001 L CNN
F 4 "4-array convex 0603 LF resistor,10K Bourns CAY16 Series 10k +/-5% Isolated SMT Resistor Array, 4 Resistors, 0.25W total 1206 package Convex" H 6550 3600 50  0001 L CNN "Description"
F 5 "" H 6550 3500 50  0001 L CNN "Height"
F 6 "Bourns" H 6550 3400 50  0001 L CNN "Manufacturer_Name"
F 7 "CAY16-1501F4LF " H 6550 3300 50  0001 L CNN "Manufacturer_Part_Number"
	1    5600 3700
	1    0    0    1   
$EndComp
$Comp
L SamacSys_Parts:CAY16-103J4LF RN5
U 1 1 602CAB17
P 10500 5700
F 0 "RN5" H 10700 5150 50  0000 L CNN
F 1 "1k5" H 10700 5250 50  0000 L CNN
F 2 "CAY16-103J4LF" H 11450 5800 50  0001 L CNN
F 3 "http://uk.rs-online.com/web/p/products/5225585" H 11450 5700 50  0001 L CNN
F 4 "4-array convex 0603 LF resistor,10K Bourns CAY16 Series 10k +/-5% Isolated SMT Resistor Array, 4 Resistors, 0.25W total 1206 package Convex" H 11450 5600 50  0001 L CNN "Description"
F 5 "" H 11450 5500 50  0001 L CNN "Height"
F 6 "Bourns" H 11450 5400 50  0001 L CNN "Manufacturer_Name"
F 7 "CAY16-1501F4LF " H 11450 5300 50  0001 L CNN "Manufacturer_Part_Number"
	1    10500 5700
	1    0    0    1   
$EndComp
$Comp
L SamacSys_Parts:W3A45C103KAT2A CN1
U 1 1 602D805C
P 6500 3000
F 0 "CN1" V 7150 2500 50  0000 L CNN
F 1 "10n x 4" V 7050 2350 50  0000 L CNN
F 2 "W3A45C103KAT2A" H 7150 3100 50  0001 L CNN
F 3 "https://www.mouser.com/datasheet/2/40/AutoCapArray-777041.pdf" H 7150 3000 50  0001 L CNN
F 4 "Capacitor Arrays & Networks 50volts 0.01uF 10% 4cap X7R" H 7150 2900 50  0001 L CNN "Description"
F 5 "1.35" H 7150 2800 50  0001 L CNN "Height"
F 6 "AVX" H 7150 2700 50  0001 L CNN "Manufacturer_Name"
F 7 "W3A41C103KAT2A" H 7150 2600 50  0001 L CNN "Manufacturer_Part_Number"
F 8 "581-W3A45C103KAT2A" H 7150 2500 50  0001 L CNN "Mouser Part Number"
F 9 "https://www.mouser.co.uk/ProductDetail/AVX/W3A45C103KAT2A?qs=DdDi5Yj9iRR741T2RhLfFg%3D%3D" H 7150 2400 50  0001 L CNN "Mouser Price/Stock"
F 10 "W3A45C103KAT2A" H 7150 2300 50  0001 L CNN "Arrow Part Number"
F 11 "https://www.arrow.com/en/products/w3a45c103kat2a/avx" H 7150 2200 50  0001 L CNN "Arrow Price/Stock"
	1    6500 3000
	0    -1   -1   0   
$EndComp
$Comp
L SamacSys_Parts:W3A45C103KAT2A CN5
U 1 1 60308FF9
P 11400 6500
F 0 "CN5" V 11950 5900 50  0000 L CNN
F 1 "10n x 4" V 11850 5750 50  0000 L CNN
F 2 "W3A45C103KAT2A" H 12050 6600 50  0001 L CNN
F 3 "https://www.mouser.com/datasheet/2/40/AutoCapArray-777041.pdf" H 12050 6500 50  0001 L CNN
F 4 "Capacitor Arrays & Networks 50volts 0.01uF 10% 4cap X7R" H 12050 6400 50  0001 L CNN "Description"
F 5 "1.35" H 12050 6300 50  0001 L CNN "Height"
F 6 "AVX" H 12050 6200 50  0001 L CNN "Manufacturer_Name"
F 7 "W3A41C103KAT2A" H 12050 6100 50  0001 L CNN "Manufacturer_Part_Number"
F 8 "581-W3A45C103KAT2A" H 12050 6000 50  0001 L CNN "Mouser Part Number"
F 9 "https://www.mouser.co.uk/ProductDetail/AVX/W3A45C103KAT2A?qs=DdDi5Yj9iRR741T2RhLfFg%3D%3D" H 12050 5900 50  0001 L CNN "Mouser Price/Stock"
F 10 "W3A45C103KAT2A" H 12050 5800 50  0001 L CNN "Arrow Part Number"
F 11 "https://www.arrow.com/en/products/w3a45c103kat2a/avx" H 12050 5700 50  0001 L CNN "Arrow Price/Stock"
	1    11400 6500
	0    -1   -1   0   
$EndComp
$Comp
L SamacSys_Parts:W3A45C103KAT2A CN2
U 1 1 6030AA2F
P 6500 4500
F 0 "CN2" V 7150 4000 50  0000 L CNN
F 1 "10n x 4" V 7050 3850 50  0000 L CNN
F 2 "W3A45C103KAT2A" H 7150 4600 50  0001 L CNN
F 3 "https://www.mouser.com/datasheet/2/40/AutoCapArray-777041.pdf" H 7150 4500 50  0001 L CNN
F 4 "Capacitor Arrays & Networks 50volts 0.01uF 10% 4cap X7R" H 7150 4400 50  0001 L CNN "Description"
F 5 "1.35" H 7150 4300 50  0001 L CNN "Height"
F 6 "AVX" H 7150 4200 50  0001 L CNN "Manufacturer_Name"
F 7 "W3A41C103KAT2A" H 7150 4100 50  0001 L CNN "Manufacturer_Part_Number"
F 8 "581-W3A45C103KAT2A" H 7150 4000 50  0001 L CNN "Mouser Part Number"
F 9 "https://www.mouser.co.uk/ProductDetail/AVX/W3A45C103KAT2A?qs=DdDi5Yj9iRR741T2RhLfFg%3D%3D" H 7150 3900 50  0001 L CNN "Mouser Price/Stock"
F 10 "W3A45C103KAT2A" H 7150 3800 50  0001 L CNN "Arrow Part Number"
F 11 "https://www.arrow.com/en/products/w3a45c103kat2a/avx" H 7150 3700 50  0001 L CNN "Arrow Price/Stock"
	1    6500 4500
	0    -1   -1   0   
$EndComp
Wire Wire Line
	6400 1900 6500 1900
Wire Wire Line
	6400 2000 6600 2000
Wire Wire Line
	6400 2100 6700 2100
Wire Wire Line
	6400 2200 6800 2200
Wire Wire Line
	6500 2300 6500 1900
Connection ~ 6500 1900
Wire Wire Line
	6500 1900 7500 1900
Connection ~ 6600 2000
Wire Wire Line
	6600 2000 7400 2000
Wire Wire Line
	6700 2300 6700 2100
Connection ~ 6700 2100
Wire Wire Line
	6700 2100 7300 2100
Wire Wire Line
	6800 2300 6800 2200
Connection ~ 6800 2200
Wire Wire Line
	6800 2200 7200 2200
$Comp
L power:GND #PWR01
U 1 1 6031192A
P 6800 3050
F 0 "#PWR01" H 6800 2800 50  0001 C CNN
F 1 "GND" H 6805 2877 50  0000 C CNN
F 2 "" H 6800 3050 50  0001 C CNN
F 3 "" H 6800 3050 50  0001 C CNN
	1    6800 3050
	1    0    0    -1  
$EndComp
Wire Wire Line
	6500 3000 6600 3000
Wire Wire Line
	6800 3000 6800 3050
Connection ~ 6800 3000
Connection ~ 6600 3000
Wire Wire Line
	6600 3000 6700 3000
Connection ~ 6700 3000
Wire Wire Line
	6700 3000 6800 3000
Wire Wire Line
	6600 2000 6600 2300
Wire Wire Line
	6400 3400 6500 3400
Wire Wire Line
	6400 3500 6600 3500
Wire Wire Line
	6400 3600 6700 3600
Wire Wire Line
	6400 3700 6800 3700
Wire Wire Line
	6500 3800 6500 3400
Connection ~ 6500 3400
Wire Wire Line
	6600 3800 6600 3500
Connection ~ 6600 3500
Wire Wire Line
	6700 3800 6700 3600
Connection ~ 6700 3600
Wire Wire Line
	6800 3800 6800 3700
Connection ~ 6800 3700
$Comp
L power:GND #PWR05
U 1 1 6032409E
P 6800 4550
F 0 "#PWR05" H 6800 4300 50  0001 C CNN
F 1 "GND" H 6805 4377 50  0000 C CNN
F 2 "" H 6800 4550 50  0001 C CNN
F 3 "" H 6800 4550 50  0001 C CNN
	1    6800 4550
	1    0    0    -1  
$EndComp
Wire Wire Line
	6800 4550 6800 4500
Wire Wire Line
	6500 4500 6600 4500
Connection ~ 6800 4500
Connection ~ 6600 4500
Wire Wire Line
	6600 4500 6700 4500
Connection ~ 6700 4500
Wire Wire Line
	6700 4500 6800 4500
Wire Wire Line
	7400 2000 7400 3100
Wire Wire Line
	7300 2100 7300 3200
Wire Wire Line
	7200 2200 7200 3300
Wire Wire Line
	6800 3700 7650 3700
Wire Wire Line
	6700 3600 7650 3600
Wire Wire Line
	6600 3500 7650 3500
Wire Wire Line
	6500 3400 7650 3400
Wire Wire Line
	7200 3300 7650 3300
Wire Wire Line
	7300 3200 7650 3200
Wire Wire Line
	7400 3100 7650 3100
Wire Wire Line
	7500 1900 7500 3000
Wire Wire Line
	11600 2300 11600 2100
Wire Wire Line
	11700 2300 11700 2200
$Comp
L power:GND #PWR06
U 1 1 603E7D76
P 11700 3050
F 0 "#PWR06" H 11700 2800 50  0001 C CNN
F 1 "GND" H 11705 2877 50  0000 C CNN
F 2 "" H 11700 3050 50  0001 C CNN
F 3 "" H 11700 3050 50  0001 C CNN
	1    11700 3050
	1    0    0    -1  
$EndComp
Wire Wire Line
	11400 3000 11500 3000
Wire Wire Line
	11700 3000 11700 3050
Connection ~ 11700 3000
Connection ~ 11500 3000
Wire Wire Line
	11500 3000 11600 3000
Connection ~ 11600 3000
Wire Wire Line
	11600 3000 11700 3000
Wire Wire Line
	11300 3400 11450 3400
Wire Wire Line
	11300 3500 11550 3500
$Comp
L power:GND #PWR010
U 1 1 603E7D90
P 11750 4550
F 0 "#PWR010" H 11750 4300 50  0001 C CNN
F 1 "GND" H 11755 4377 50  0000 C CNN
F 2 "" H 11750 4550 50  0001 C CNN
F 3 "" H 11750 4550 50  0001 C CNN
	1    11750 4550
	1    0    0    -1  
$EndComp
Wire Wire Line
	11750 4550 11750 4500
Wire Wire Line
	11450 4500 11550 4500
Connection ~ 11750 4500
Connection ~ 11550 4500
Wire Wire Line
	11550 4500 11650 4500
Connection ~ 11650 4500
Wire Wire Line
	11650 4500 11750 4500
Wire Wire Line
	12400 2200 12400 3300
Wire Wire Line
	11300 3700 11750 3700
Wire Wire Line
	11300 3600 11650 3600
Wire Wire Line
	12400 3300 12500 3300
Wire Wire Line
	12500 2100 12500 3200
$Comp
L SamacSys_Parts:380-015-113L001 J3
U 1 1 603E7DB0
P 12950 2900
F 0 "J3" V 13000 2750 50  0000 L CNN
F 1 "MS2 6w" V 13100 2550 50  0000 L CNN
F 2 "380015113L001" H 14100 3200 50  0001 L CNN
F 3 "http://www.farnell.com/datasheets/1633170.pdf" H 14100 3100 50  0001 L CNN
F 4 "Norcomp 380, MICRO-D Series, 15 Way PCB D-sub Connector Plug, 1.27mm Pitch" H 14100 3000 50  0001 L CNN "Description"
F 5 "10.2" H 14100 2900 50  0001 L CNN "Height"
F 6 "NorComp" H 14100 2800 50  0001 L CNN "Manufacturer_Name"
F 7 "380-015-113L001" H 14100 2700 50  0001 L CNN "Manufacturer_Part_Number"
F 8 "636-380-015-113L001" H 14100 2600 50  0001 L CNN "Mouser Part Number"
F 9 "https://www.mouser.co.uk/ProductDetail/NorComp/380-015-113L001?qs=BKMrj6kJNGajQJrf%252BkD1Mg%3D%3D" H 14100 2500 50  0001 L CNN "Mouser Price/Stock"
F 10 "" H 14100 2400 50  0001 L CNN "Arrow Part Number"
F 11 "" H 14100 2300 50  0001 L CNN "Arrow Price/Stock"
	1    12950 2900
	0    -1   1    0   
$EndComp
NoConn ~ 12500 3900
NoConn ~ 12500 3800
NoConn ~ 12500 6100
NoConn ~ 12500 6000
NoConn ~ 12500 5900
NoConn ~ 12500 5800
Wire Wire Line
	11300 5400 11400 5400
Wire Wire Line
	12500 5500 11500 5500
Wire Wire Line
	11300 5600 11600 5600
Wire Wire Line
	12500 5700 11700 5700
Wire Wire Line
	11400 5400 11400 5800
Connection ~ 11400 5400
Wire Wire Line
	11400 5400 12500 5400
Wire Wire Line
	11500 5800 11500 5500
Connection ~ 11500 5500
Wire Wire Line
	11500 5500 11300 5500
Wire Wire Line
	11600 5800 11600 5600
Connection ~ 11600 5600
Wire Wire Line
	11600 5600 12500 5600
Wire Wire Line
	11700 5800 11700 5700
Connection ~ 11700 5700
Wire Wire Line
	11700 5700 11300 5700
$Comp
L power:GND #PWR016
U 1 1 6042C5B5
P 11700 6550
F 0 "#PWR016" H 11700 6300 50  0001 C CNN
F 1 "GND" H 11705 6377 50  0000 C CNN
F 2 "" H 11700 6550 50  0001 C CNN
F 3 "" H 11700 6550 50  0001 C CNN
	1    11700 6550
	1    0    0    -1  
$EndComp
Wire Wire Line
	11700 6550 11700 6500
Wire Wire Line
	11400 6500 11500 6500
Connection ~ 11700 6500
Connection ~ 11500 6500
Wire Wire Line
	11500 6500 11600 6500
Connection ~ 11600 6500
Wire Wire Line
	11600 6500 11700 6500
$Comp
L power:GND #PWR02
U 1 1 6044780B
P 8800 4050
F 0 "#PWR02" H 8800 3800 50  0001 C CNN
F 1 "GND" H 8805 3877 50  0000 C CNN
F 2 "" H 8800 4050 50  0001 C CNN
F 3 "" H 8800 4050 50  0001 C CNN
	1    8800 4050
	1    0    0    -1  
$EndComp
$Comp
L power:GND #PWR015
U 1 1 60449AB2
P 13500 6450
F 0 "#PWR015" H 13500 6200 50  0001 C CNN
F 1 "GND" H 13505 6277 50  0000 C CNN
F 2 "" H 13500 6450 50  0001 C CNN
F 3 "" H 13500 6450 50  0001 C CNN
	1    13500 6450
	1    0    0    -1  
$EndComp
Wire Wire Line
	12950 5100 12950 5050
Wire Wire Line
	13500 6400 13500 6450
Wire Wire Line
	12950 2900 12950 2850
Wire Wire Line
	8100 2700 8100 2650
Wire Wire Line
	8800 4000 8800 4050
$Comp
L Connector_Generic:Conn_02x20_Odd_Even J2
U 1 1 6027171F
P 2850 2700
F 0 "J2" H 2750 3850 50  0000 L CNN
F 1 "Controller" H 2750 3750 50  0000 L CNN
F 2 "Connector_PinHeader_2.54mm:PinHeader_2x20_P2.54mm_Vertical" H 2850 2700 50  0001 C CNN
F 3 "~" H 2850 2700 50  0001 C CNN
	1    2850 2700
	-1   0    0    -1  
$EndComp
$Comp
L power:+12V #PWR03
U 1 1 6049714D
P 2450 1700
F 0 "#PWR03" H 2450 1550 50  0001 C CNN
F 1 "+12V" H 2465 1873 50  0000 C CNN
F 2 "" H 2450 1700 50  0001 C CNN
F 3 "" H 2450 1700 50  0001 C CNN
	1    2450 1700
	1    0    0    -1  
$EndComp
$Comp
L power:+24V #PWR04
U 1 1 60497A9F
P 3150 1700
F 0 "#PWR04" H 3150 1550 50  0001 C CNN
F 1 "+24V" H 3165 1873 50  0000 C CNN
F 2 "" H 3150 1700 50  0001 C CNN
F 3 "" H 3150 1700 50  0001 C CNN
	1    3150 1700
	1    0    0    -1  
$EndComp
Wire Wire Line
	2450 1700 2450 1800
Wire Wire Line
	2450 1800 2550 1800
Wire Wire Line
	3150 1700 3150 1800
Wire Wire Line
	3150 1800 3050 1800
$Comp
L Device:C C1
U 1 1 607596A4
P 2500 4900
F 0 "C1" H 2615 4946 50  0000 L CNN
F 1 "470n" H 2615 4855 50  0000 L CNN
F 2 "Capacitor_SMD:C_0805_2012Metric" H 2538 4750 50  0001 C CNN
F 3 "~" H 2500 4900 50  0001 C CNN
	1    2500 4900
	1    0    0    -1  
$EndComp
$Comp
L Device:C C2
U 1 1 6075C92E
P 3000 4900
F 0 "C2" H 3115 4946 50  0000 L CNN
F 1 "10n" H 3115 4855 50  0000 L CNN
F 2 "Capacitor_SMD:C_0603_1608Metric" H 3038 4750 50  0001 C CNN
F 3 "~" H 3000 4900 50  0001 C CNN
	1    3000 4900
	1    0    0    -1  
$EndComp
$Comp
L power:GND #PWR013
U 1 1 6075D10D
P 3000 5150
F 0 "#PWR013" H 3000 4900 50  0001 C CNN
F 1 "GND" H 3005 4977 50  0000 C CNN
F 2 "" H 3000 5150 50  0001 C CNN
F 3 "" H 3000 5150 50  0001 C CNN
	1    3000 5150
	1    0    0    -1  
$EndComp
Wire Wire Line
	2500 4750 2500 4700
Wire Wire Line
	2500 4700 3000 4700
Wire Wire Line
	3000 4700 3000 4750
$Comp
L power:+12V #PWR011
U 1 1 6077E191
P 2500 4650
F 0 "#PWR011" H 2500 4500 50  0001 C CNN
F 1 "+12V" H 2515 4823 50  0000 C CNN
F 2 "" H 2500 4650 50  0001 C CNN
F 3 "" H 2500 4650 50  0001 C CNN
	1    2500 4650
	1    0    0    -1  
$EndComp
Wire Wire Line
	3000 5050 3000 5100
Wire Wire Line
	2500 5050 2500 5100
Wire Wire Line
	2500 5100 3000 5100
Connection ~ 3000 5100
Wire Wire Line
	3000 5100 3000 5150
Wire Wire Line
	2500 4650 2500 4700
Connection ~ 2500 4700
$Comp
L Device:C C3
U 1 1 607AF12B
P 3550 4900
F 0 "C3" H 3665 4946 50  0000 L CNN
F 1 "470n" H 3665 4855 50  0000 L CNN
F 2 "Capacitor_SMD:C_0805_2012Metric" H 3588 4750 50  0001 C CNN
F 3 "~" H 3550 4900 50  0001 C CNN
	1    3550 4900
	1    0    0    -1  
$EndComp
$Comp
L Device:C C4
U 1 1 607AF131
P 4050 4900
F 0 "C4" H 4165 4946 50  0000 L CNN
F 1 "10n" H 4165 4855 50  0000 L CNN
F 2 "Capacitor_SMD:C_0603_1608Metric" H 4088 4750 50  0001 C CNN
F 3 "~" H 4050 4900 50  0001 C CNN
	1    4050 4900
	1    0    0    -1  
$EndComp
$Comp
L power:GND #PWR014
U 1 1 607AF137
P 4050 5150
F 0 "#PWR014" H 4050 4900 50  0001 C CNN
F 1 "GND" H 4055 4977 50  0000 C CNN
F 2 "" H 4050 5150 50  0001 C CNN
F 3 "" H 4050 5150 50  0001 C CNN
	1    4050 5150
	1    0    0    -1  
$EndComp
Wire Wire Line
	3550 4750 3550 4700
Wire Wire Line
	3550 4700 4050 4700
Wire Wire Line
	4050 4700 4050 4750
Wire Wire Line
	4050 5050 4050 5100
Wire Wire Line
	3550 5050 3550 5100
Wire Wire Line
	3550 5100 4050 5100
Connection ~ 4050 5100
Wire Wire Line
	4050 5100 4050 5150
Wire Wire Line
	3550 4650 3550 4700
Connection ~ 3550 4700
$Comp
L power:+24V #PWR012
U 1 1 607BB4E0
P 3550 4650
F 0 "#PWR012" H 3550 4500 50  0001 C CNN
F 1 "+24V" H 3565 4823 50  0000 C CNN
F 2 "" H 3550 4650 50  0001 C CNN
F 3 "" H 3550 4650 50  0001 C CNN
	1    3550 4650
	1    0    0    -1  
$EndComp
Wire Wire Line
	5600 3700 5100 3700
Wire Wire Line
	5600 3600 5100 3600
Wire Wire Line
	5600 3500 5100 3500
Wire Wire Line
	5600 3400 5100 3400
Wire Wire Line
	5600 2200 5100 2200
Wire Wire Line
	5600 2100 5100 2100
Wire Wire Line
	5600 2000 5100 2000
Wire Wire Line
	5600 1900 5100 1900
Wire Wire Line
	8800 4000 8100 4000
Wire Wire Line
	8800 2650 8800 3000
Connection ~ 8800 4000
Wire Wire Line
	8550 3000 8800 3000
Connection ~ 8800 3000
Wire Wire Line
	8800 3000 8800 3100
Wire Wire Line
	8550 3100 8800 3100
Connection ~ 8800 3100
Wire Wire Line
	8800 3100 8800 3200
Wire Wire Line
	8550 3200 8800 3200
Connection ~ 8800 3200
Wire Wire Line
	8800 3200 8800 3300
Wire Wire Line
	8550 3300 8800 3300
Connection ~ 8800 3300
Wire Wire Line
	8800 3300 8800 3400
Wire Wire Line
	8550 3400 8800 3400
Connection ~ 8800 3400
Wire Wire Line
	8800 3400 8800 4000
$Comp
L power:GND #PWR09
U 1 1 60449479
P 13500 4250
F 0 "#PWR09" H 13500 4000 50  0001 C CNN
F 1 "GND" H 13505 4077 50  0000 C CNN
F 2 "" H 13500 4250 50  0001 C CNN
F 3 "" H 13500 4250 50  0001 C CNN
	1    13500 4250
	1    0    0    -1  
$EndComp
Wire Wire Line
	13500 2850 13500 3200
Connection ~ 13500 4200
Wire Wire Line
	13500 4200 13500 4250
Wire Wire Line
	13400 3200 13500 3200
Connection ~ 13500 3200
Wire Wire Line
	13500 3200 13500 3300
Wire Wire Line
	13400 3300 13500 3300
Connection ~ 13500 3300
Wire Wire Line
	13500 3300 13500 3400
Wire Wire Line
	13400 3400 13500 3400
Connection ~ 13500 3400
Wire Wire Line
	13500 3400 13500 3500
Wire Wire Line
	13400 3500 13500 3500
Connection ~ 13500 3500
Wire Wire Line
	13500 3500 13500 3600
Wire Wire Line
	13400 3600 13500 3600
Connection ~ 13500 3600
Wire Wire Line
	13500 3600 13500 4200
Wire Wire Line
	13500 5050 13500 5400
Connection ~ 13500 6400
Wire Wire Line
	13400 5400 13500 5400
Connection ~ 13500 5400
Wire Wire Line
	13500 5400 13500 5500
Wire Wire Line
	13400 5500 13500 5500
Connection ~ 13500 5500
Wire Wire Line
	13500 5500 13500 5600
Wire Wire Line
	13400 5600 13500 5600
Connection ~ 13500 5600
Wire Wire Line
	13500 5600 13500 5700
Wire Wire Line
	13400 5700 13500 5700
Connection ~ 13500 5700
Wire Wire Line
	13500 5700 13500 5800
Wire Wire Line
	13400 5800 13500 5800
Connection ~ 13500 5800
Wire Wire Line
	13500 5800 13500 6400
$Comp
L power:+12V #PWR0101
U 1 1 60C6C63E
P 9000 3450
F 0 "#PWR0101" H 9000 3300 50  0001 C CNN
F 1 "+12V" H 9015 3623 50  0000 C CNN
F 2 "" H 9000 3450 50  0001 C CNN
F 3 "" H 9000 3450 50  0001 C CNN
	1    9000 3450
	1    0    0    -1  
$EndComp
$Comp
L power:+24V #PWR0102
U 1 1 60C6D3BC
P 9250 3450
F 0 "#PWR0102" H 9250 3300 50  0001 C CNN
F 1 "+24V" H 9265 3623 50  0000 C CNN
F 2 "" H 9250 3450 50  0001 C CNN
F 3 "" H 9250 3450 50  0001 C CNN
	1    9250 3450
	1    0    0    -1  
$EndComp
$Comp
L power:+24V #PWR0103
U 1 1 60C6EB6A
P 14000 3650
F 0 "#PWR0103" H 14000 3500 50  0001 C CNN
F 1 "+24V" H 14015 3823 50  0000 C CNN
F 2 "" H 14000 3650 50  0001 C CNN
F 3 "" H 14000 3650 50  0001 C CNN
	1    14000 3650
	1    0    0    -1  
$EndComp
$Comp
L power:+12V #PWR0104
U 1 1 60C6F3CD
P 13750 3650
F 0 "#PWR0104" H 13750 3500 50  0001 C CNN
F 1 "+12V" H 13765 3823 50  0000 C CNN
F 2 "" H 13750 3650 50  0001 C CNN
F 3 "" H 13750 3650 50  0001 C CNN
	1    13750 3650
	1    0    0    -1  
$EndComp
$Comp
L power:+12V #PWR0105
U 1 1 60C70541
P 13750 5850
F 0 "#PWR0105" H 13750 5700 50  0001 C CNN
F 1 "+12V" H 13765 6023 50  0000 C CNN
F 2 "" H 13750 5850 50  0001 C CNN
F 3 "" H 13750 5850 50  0001 C CNN
	1    13750 5850
	1    0    0    -1  
$EndComp
$Comp
L power:+24V #PWR0106
U 1 1 60C70C3E
P 14000 5850
F 0 "#PWR0106" H 14000 5700 50  0001 C CNN
F 1 "+24V" H 14015 6023 50  0000 C CNN
F 2 "" H 14000 5850 50  0001 C CNN
F 3 "" H 14000 5850 50  0001 C CNN
	1    14000 5850
	1    0    0    -1  
$EndComp
Wire Wire Line
	13750 5850 13750 5900
Wire Wire Line
	13750 5900 13400 5900
Wire Wire Line
	13400 6000 14000 6000
Wire Wire Line
	14000 6000 14000 5850
Wire Wire Line
	13400 3700 13750 3700
Wire Wire Line
	13750 3700 13750 3650
Wire Wire Line
	13400 3800 14000 3800
Wire Wire Line
	14000 3800 14000 3650
Wire Wire Line
	8550 3500 9000 3500
Wire Wire Line
	9000 3500 9000 3450
Wire Wire Line
	8550 3600 9250 3600
Wire Wire Line
	9250 3600 9250 3450
$Comp
L Connector:Conn_Coaxial_Power J5
U 1 1 602B2B78
P 10750 9700
F 0 "J5" H 10838 9696 50  0000 L CNN
F 1 "Transfer Switch" H 10838 9605 50  0000 L CNN
F 2 "myLibrary:SMB_Jack_Vertical_Wurth" H 10750 9650 50  0001 C CNN
F 3 "~" H 10750 9650 50  0001 C CNN
F 4 "Wurth Electronik" H 10750 9700 50  0001 C CNN "Manufacturer"
F 5 "61612042121504" H 10750 9700 50  0001 C CNN "Manufacturer_Part_Number"
	1    10750 9700
	1    0    0    -1  
$EndComp
$Comp
L power:GND #PWR0107
U 1 1 602EC51A
P 10750 10000
F 0 "#PWR0107" H 10750 9750 50  0001 C CNN
F 1 "GND" H 10755 9827 50  0000 C CNN
F 2 "" H 10750 10000 50  0001 C CNN
F 3 "" H 10750 10000 50  0001 C CNN
	1    10750 10000
	1    0    0    -1  
$EndComp
Wire Wire Line
	10750 9900 10750 10000
$Comp
L Device:Ferrite_Bead L1
U 1 1 60353EEF
P 10450 9400
F 0 "L1" V 10150 9300 50  0000 L CNN
F 1 "MFB-201209" V 10250 9300 50  0000 L CNN
F 2 "Inductor_SMD:L_0805_2012Metric" V 10380 9400 50  0001 C CNN
F 3 "~" H 10450 9400 50  0001 C CNN
F 4 "MEC MARCOM" V 10450 9400 50  0001 C CNN "Manufacturer"
F 5 "MFB-201209-0600PN" V 10450 9400 50  0001 C CNN "Manufacturer_Part_Number"
	1    10450 9400
	0    1    1    0   
$EndComp
Wire Wire Line
	10750 9600 10750 9400
Wire Wire Line
	10750 9400 10600 9400
Wire Wire Line
	10300 9400 10000 9400
Wire Wire Line
	10500 3700 10000 3700
Wire Wire Line
	10000 3400 10500 3400
Wire Wire Line
	10500 2200 10000 2200
Wire Wire Line
	10500 2100 10000 2100
Text Label 3150 1900 0    50   ~ 0
MS1-1
Text Label 3150 2000 0    50   ~ 0
MS1-2
Text Label 3150 2100 0    50   ~ 0
MS1-3
Text Label 3150 2200 0    50   ~ 0
MS1-4
Text Label 3150 2300 0    50   ~ 0
MS1-5
Text Label 3150 2400 0    50   ~ 0
MS1-6
Text Label 3150 2500 0    50   ~ 0
MS1-7
Text Label 3150 2600 0    50   ~ 0
MS1-8
Text Label 3150 2700 0    50   ~ 0
MS2-1
Text Label 3150 2800 0    50   ~ 0
MS2-2
Text Label 3150 2900 0    50   ~ 0
MS2-3
Text Label 3150 3000 0    50   ~ 0
MS2-4
Text Label 3150 3100 0    50   ~ 0
MS2-5
Text Label 3150 3200 0    50   ~ 0
MS2-6
Text Label 3150 3300 0    50   ~ 0
MS3-1
Text Label 3150 3400 0    50   ~ 0
MS3-2
Text Label 3150 3500 0    50   ~ 0
MS3-3
Text Label 3150 3600 0    50   ~ 0
MS3-4
Text Label 3150 3700 0    50   ~ 0
MSX-1
$Comp
L power:+3V3 #PWR0108
U 1 1 62BBB3D5
P 2200 1700
F 0 "#PWR0108" H 2200 1550 50  0001 C CNN
F 1 "+3V3" H 2215 1873 50  0000 C CNN
F 2 "" H 2200 1700 50  0001 C CNN
F 3 "" H 2200 1700 50  0001 C CNN
	1    2200 1700
	1    0    0    -1  
$EndComp
Wire Wire Line
	2200 1700 2200 1900
Wire Wire Line
	2200 1900 2550 1900
$Comp
L SamacSys_Parts:380-015-113L001 J1
U 1 1 6028AC5B
P 8100 2700
F 0 "J1" V 8150 2550 50  0000 L CNN
F 1 "MS1 8w" V 8250 2350 50  0000 L CNN
F 2 "380015113L001" H 9250 3000 50  0001 L CNN
F 3 "http://www.farnell.com/datasheets/1633170.pdf" H 9250 2900 50  0001 L CNN
F 4 "Norcomp 380, MICRO-D Series, 15 Way PCB D-sub Connector Plug, 1.27mm Pitch" H 9250 2800 50  0001 L CNN "Description"
F 5 "10.2" H 9250 2700 50  0001 L CNN "Height"
F 6 "NorComp" H 9250 2600 50  0001 L CNN "Manufacturer_Name"
F 7 "380-015-113L001" H 9250 2500 50  0001 L CNN "Manufacturer_Part_Number"
F 8 "636-380-015-113L001" H 9250 2400 50  0001 L CNN "Mouser Part Number"
F 9 "https://www.mouser.co.uk/ProductDetail/NorComp/380-015-113L001?qs=BKMrj6kJNGajQJrf%252BkD1Mg%3D%3D" H 9250 2300 50  0001 L CNN "Mouser Price/Stock"
F 10 "" H 9250 2200 50  0001 L CNN "Arrow Part Number"
F 11 "" H 9250 2100 50  0001 L CNN "Arrow Price/Stock"
	1    8100 2700
	0    -1   1    0   
$EndComp
Text Label 5500 1900 2    50   ~ 0
MS1-1
Text Label 5500 2000 2    50   ~ 0
MS1-2
Text Label 5500 2100 2    50   ~ 0
MS1-3
Text Label 5500 2200 2    50   ~ 0
MS1-4
Text Label 5500 3400 2    50   ~ 0
MS1-5
Text Label 5500 3500 2    50   ~ 0
MS1-6
Text Label 5500 3600 2    50   ~ 0
MS1-7
Text Label 5500 3700 2    50   ~ 0
MS1-8
Text Label 10400 2100 2    50   ~ 0
MS2-1
Text Label 10400 2200 2    50   ~ 0
MS2-2
Text Label 10400 3400 2    50   ~ 0
MS2-3
Text Label 10400 3500 2    50   ~ 0
MS2-4
Text Label 10400 3600 2    50   ~ 0
MS2-5
Text Label 10400 3700 2    50   ~ 0
MS2-6
Text Label 10400 5400 2    50   ~ 0
MS3-1
Text Label 10400 5500 2    50   ~ 0
MS3-2
Text Label 10400 5600 2    50   ~ 0
MS3-3
Text Label 10400 5700 2    50   ~ 0
MS3-4
Text Label 10300 9400 2    50   ~ 0
MSX-1
Wire Bus Line
	3600 1500 3750 1350
Wire Bus Line
	9750 1350 9900 1500
Entry Wire Line
	5000 1800 5100 1900
Entry Wire Line
	5000 1900 5100 2000
Entry Wire Line
	5000 2000 5100 2100
Entry Wire Line
	5000 2100 5100 2200
Entry Wire Line
	5000 3300 5100 3400
Entry Wire Line
	5000 3400 5100 3500
Entry Wire Line
	5000 3500 5100 3600
Entry Wire Line
	5000 3600 5100 3700
Entry Wire Line
	9900 2000 10000 2100
Entry Wire Line
	9900 2100 10000 2200
Entry Wire Line
	9900 3300 10000 3400
Entry Wire Line
	9900 3400 10000 3500
Entry Wire Line
	9900 3500 10000 3600
Entry Wire Line
	9900 3600 10000 3700
Entry Wire Line
	9900 5300 10000 5400
Entry Wire Line
	9900 5400 10000 5500
Entry Wire Line
	9900 5500 10000 5600
Entry Wire Line
	9900 5600 10000 5700
Entry Wire Line
	9900 9300 10000 9400
Wire Wire Line
	10500 3500 10000 3500
Wire Wire Line
	10500 3600 10000 3600
Wire Wire Line
	10500 5400 10000 5400
Wire Wire Line
	10000 5500 10500 5500
Wire Wire Line
	10500 5600 10000 5600
Wire Wire Line
	10000 5700 10500 5700
$Comp
L SamacSys_Parts:380-015-113L001 J6
U 1 1 60F33CAA
P 12950 7050
F 0 "J6" V 13000 6900 50  0000 L CNN
F 1 "MS4 4w" V 13100 6700 50  0000 L CNN
F 2 "380015113L001" H 14100 7350 50  0001 L CNN
F 3 "http://www.farnell.com/datasheets/1633170.pdf" H 14100 7250 50  0001 L CNN
F 4 "Norcomp 380, MICRO-D Series, 15 Way PCB D-sub Connector Plug, 1.27mm Pitch" H 14100 7150 50  0001 L CNN "Description"
F 5 "10.2" H 14100 7050 50  0001 L CNN "Height"
F 6 "NorComp" H 14100 6950 50  0001 L CNN "Manufacturer_Name"
F 7 "380-015-113L001" H 14100 6850 50  0001 L CNN "Manufacturer_Part_Number"
F 8 "636-380-015-113L001" H 14100 6750 50  0001 L CNN "Mouser Part Number"
F 9 "https://www.mouser.co.uk/ProductDetail/NorComp/380-015-113L001?qs=BKMrj6kJNGajQJrf%252BkD1Mg%3D%3D" H 14100 6650 50  0001 L CNN "Mouser Price/Stock"
F 10 "" H 14100 6550 50  0001 L CNN "Arrow Part Number"
F 11 "" H 14100 6450 50  0001 L CNN "Arrow Price/Stock"
	1    12950 7050
	0    -1   1    0   
$EndComp
NoConn ~ 12500 8050
NoConn ~ 12500 7950
NoConn ~ 12500 7850
NoConn ~ 12500 7750
Wire Wire Line
	11300 7350 11400 7350
Wire Wire Line
	11300 7550 11600 7550
Wire Wire Line
	11400 7350 11400 7750
Connection ~ 11400 7350
Wire Wire Line
	11500 7750 11500 7450
Connection ~ 11500 7450
Wire Wire Line
	11500 7450 11300 7450
Wire Wire Line
	11600 7750 11600 7550
Connection ~ 11600 7550
Wire Wire Line
	11700 7750 11700 7650
Connection ~ 11700 7650
Wire Wire Line
	11700 7650 11300 7650
$Comp
L power:GND #PWR0109
U 1 1 60F33CDC
P 11700 8500
F 0 "#PWR0109" H 11700 8250 50  0001 C CNN
F 1 "GND" H 11705 8327 50  0000 C CNN
F 2 "" H 11700 8500 50  0001 C CNN
F 3 "" H 11700 8500 50  0001 C CNN
	1    11700 8500
	1    0    0    -1  
$EndComp
Wire Wire Line
	11700 8500 11700 8450
$Comp
L power:GND #PWR0110
U 1 1 60F33CE9
P 13500 8400
F 0 "#PWR0110" H 13500 8150 50  0001 C CNN
F 1 "GND" H 13505 8227 50  0000 C CNN
F 2 "" H 13500 8400 50  0001 C CNN
F 3 "" H 13500 8400 50  0001 C CNN
	1    13500 8400
	1    0    0    -1  
$EndComp
Wire Wire Line
	12950 7050 12950 7000
Wire Wire Line
	13500 8350 13500 8400
Wire Wire Line
	13500 7000 13500 7350
Connection ~ 13500 8350
Wire Wire Line
	13400 7350 13500 7350
Connection ~ 13500 7350
Wire Wire Line
	13500 7350 13500 7450
Wire Wire Line
	13400 7450 13500 7450
Connection ~ 13500 7450
Wire Wire Line
	13500 7450 13500 7550
Wire Wire Line
	13400 7550 13500 7550
Connection ~ 13500 7550
Wire Wire Line
	13500 7550 13500 7650
Wire Wire Line
	13400 7650 13500 7650
Connection ~ 13500 7650
Wire Wire Line
	13500 7650 13500 7750
Wire Wire Line
	13400 7750 13500 7750
Connection ~ 13500 7750
Wire Wire Line
	13500 7750 13500 8350
$Comp
L power:+12V #PWR0111
U 1 1 60F33D04
P 13750 7800
F 0 "#PWR0111" H 13750 7650 50  0001 C CNN
F 1 "+12V" H 13765 7973 50  0000 C CNN
F 2 "" H 13750 7800 50  0001 C CNN
F 3 "" H 13750 7800 50  0001 C CNN
	1    13750 7800
	1    0    0    -1  
$EndComp
$Comp
L power:+24V #PWR0112
U 1 1 60F33D0A
P 14000 7800
F 0 "#PWR0112" H 14000 7650 50  0001 C CNN
F 1 "+24V" H 14015 7973 50  0000 C CNN
F 2 "" H 14000 7800 50  0001 C CNN
F 3 "" H 14000 7800 50  0001 C CNN
	1    14000 7800
	1    0    0    -1  
$EndComp
Wire Wire Line
	13750 7800 13750 7850
Wire Wire Line
	13750 7850 13400 7850
Wire Wire Line
	13400 7950 14000 7950
Wire Wire Line
	14000 7950 14000 7800
Wire Bus Line
	1850 3900 2000 4050
Wire Bus Line
	2000 4050 3450 4050
Entry Wire Line
	9900 7250 10000 7350
Entry Wire Line
	10000 7450 9900 7350
Entry Wire Line
	10000 7550 9900 7450
Entry Wire Line
	10000 7650 9900 7550
Wire Wire Line
	10500 7650 10000 7650
Wire Wire Line
	10500 7550 10000 7550
Wire Wire Line
	10000 7450 10500 7450
Wire Wire Line
	10500 7350 10000 7350
Text Label 10150 7350 0    50   ~ 0
MS4-1
Text Label 10150 7450 0    50   ~ 0
MS4-2
Text Label 10150 7550 0    50   ~ 0
MS4-3
Text Label 10150 7650 0    50   ~ 0
MS4-4
Entry Wire Line
	1850 3400 1950 3300
Entry Wire Line
	1850 3500 1950 3400
Entry Wire Line
	1850 3600 1950 3500
Entry Wire Line
	1850 3700 1950 3600
Wire Wire Line
	1950 3300 2550 3300
Wire Wire Line
	1950 3400 2550 3400
Wire Wire Line
	1950 3500 2550 3500
Wire Wire Line
	1950 3600 2550 3600
Text Label 2050 3300 0    50   ~ 0
MS4-1
Text Label 2050 3400 0    50   ~ 0
MS4-2
Text Label 2050 3500 0    50   ~ 0
MS4-3
Text Label 2050 3600 0    50   ~ 0
MS4-4
Wire Wire Line
	3050 1900 3500 1900
Wire Wire Line
	3050 2000 3500 2000
Wire Wire Line
	3050 2100 3500 2100
Wire Wire Line
	3050 2300 3500 2300
Wire Wire Line
	3050 2200 3500 2200
Wire Wire Line
	3050 2400 3500 2400
Wire Wire Line
	3050 2500 3500 2500
Wire Wire Line
	3050 2600 3500 2600
Wire Wire Line
	3050 2700 3500 2700
Wire Wire Line
	3050 2800 3500 2800
Wire Wire Line
	3050 3300 3500 3300
Wire Wire Line
	3050 2900 3500 2900
Wire Wire Line
	3050 3000 3500 3000
Wire Wire Line
	3050 3100 3500 3100
Wire Wire Line
	3050 3200 3500 3200
Wire Wire Line
	3050 3400 3500 3400
Wire Wire Line
	3050 3500 3500 3500
Wire Wire Line
	3050 3600 3500 3600
Wire Wire Line
	3050 3700 3500 3700
Wire Bus Line
	3450 4050 3600 3900
Entry Wire Line
	3600 1800 3500 1900
Entry Wire Line
	3500 2000 3600 1900
Entry Wire Line
	3600 2000 3500 2100
Entry Wire Line
	3600 2200 3500 2300
Entry Wire Line
	3500 2200 3600 2100
Entry Wire Line
	3600 2300 3500 2400
Entry Wire Line
	3600 2400 3500 2500
Entry Wire Line
	3600 2500 3500 2600
Entry Wire Line
	3600 2600 3500 2700
Entry Wire Line
	3600 2700 3500 2800
Entry Wire Line
	3600 3200 3500 3300
Entry Wire Line
	3600 2800 3500 2900
Entry Wire Line
	3500 3000 3600 2900
Entry Wire Line
	3500 3100 3600 3000
Entry Wire Line
	3500 3200 3600 3100
Entry Wire Line
	3500 3400 3600 3300
Entry Wire Line
	3500 3500 3600 3400
Entry Wire Line
	3500 3600 3600 3500
Entry Wire Line
	3500 3700 3600 3600
Wire Notes Line style dotted
	9750 8800 14200 8800
Text Notes 12950 6800 0    50   ~ 0
MS3 4 WAY RF SWITCH DRIVER
Wire Notes Line style dotted
	9750 1550 9750 8800
Wire Notes Line style dotted
	14200 1550 14200 8800
Text Notes 12950 8750 0    50   ~ 0
MS4 4 WAY RF SWITCH DRIVER
Wire Notes Line style dotted
	14200 6850 9750 6850
Text Notes 12950 4800 0    50   ~ 0
MS2 6 WAY RF SWITCH DRIVER
Wire Notes Line style dotted
	4850 1550 4850 4850
Text Notes 8200 4800 0    50   ~ 0
MS1 8 WAY RF SWITCH DRIVER
Wire Notes Line style dotted
	9750 4850 14200 4850
Wire Notes Line style dotted
	14200 1550 9750 1550
Wire Notes Line style dotted
	9450 4850 4850 4850
Wire Notes Line style dotted
	9450 4850 9450 1550
Wire Notes Line style dotted
	9450 1550 4850 1550
Text Label 2050 3100 0    50   ~ 0
GPIO3
Text Label 2050 3200 0    50   ~ 0
GPIO4
Text Label 2050 3000 0    50   ~ 0
TEC_EN
Connection ~ 2450 2300
Wire Wire Line
	2450 2300 2450 3700
Text Label 2050 2900 0    50   ~ 0
TEC_RX
Text Label 2050 2800 0    50   ~ 0
TEC_TX
Text Label 2050 2600 0    50   ~ 0
SCL0
Text Label 2050 2700 0    50   ~ 0
SDA0
Text Label 2050 2500 0    50   ~ 0
NS_PWR
Text Label 2050 2400 0    50   ~ 0
INT_FAN
Text Label 2050 2200 0    50   ~ 0
+6V_B
Text Label 2050 2100 0    50   ~ 0
+6V_A
Entry Wire Line
	1950 2100 1850 2200
Entry Wire Line
	1950 2200 1850 2300
Entry Wire Line
	1850 2500 1950 2400
Entry Wire Line
	1850 2600 1950 2500
Entry Wire Line
	1850 2700 1950 2600
Entry Wire Line
	1850 2800 1950 2700
Entry Wire Line
	1850 2900 1950 2800
Entry Wire Line
	1850 3000 1950 2900
Entry Wire Line
	1850 3100 1950 3000
Entry Wire Line
	1850 3200 1950 3100
Entry Wire Line
	1850 3300 1950 3200
Wire Wire Line
	1950 2100 2550 2100
Wire Wire Line
	2550 2200 1950 2200
Wire Wire Line
	1950 2400 2550 2400
Wire Wire Line
	1950 2500 2550 2500
Wire Wire Line
	2550 2600 1950 2600
Wire Wire Line
	1950 2700 2550 2700
Wire Wire Line
	2550 2800 1950 2800
Wire Wire Line
	1950 2900 2550 2900
Wire Wire Line
	2550 3000 1950 3000
Wire Wire Line
	1950 3100 2550 3100
Wire Wire Line
	2550 3200 1950 3200
$Comp
L Device:LED D1
U 1 1 61596E97
P 2100 6800
F 0 "D1" V 2139 6682 50  0000 R CNN
F 1 "RED" V 2048 6682 50  0000 R CNN
F 2 "LED_SMD:LED_0603_1608Metric_Pad1.05x0.95mm_HandSolder" H 2100 6800 50  0001 C CNN
F 3 "~" H 2100 6800 50  0001 C CNN
	1    2100 6800
	0    -1   -1   0   
$EndComp
$Comp
L Device:LED D2
U 1 1 6159AA3B
P 2500 6800
F 0 "D2" V 2539 6682 50  0000 R CNN
F 1 "LED" V 2448 6682 50  0001 R CNN
F 2 "LED_SMD:LED_0603_1608Metric_Pad1.05x0.95mm_HandSolder" H 2500 6800 50  0001 C CNN
F 3 "~" H 2500 6800 50  0001 C CNN
	1    2500 6800
	0    -1   -1   0   
$EndComp
$Comp
L Device:LED D3
U 1 1 615B3A64
P 2900 6800
F 0 "D3" V 2939 6682 50  0000 R CNN
F 1 "LED" V 2848 6682 50  0001 R CNN
F 2 "LED_SMD:LED_0603_1608Metric_Pad1.05x0.95mm_HandSolder" H 2900 6800 50  0001 C CNN
F 3 "~" H 2900 6800 50  0001 C CNN
	1    2900 6800
	0    -1   -1   0   
$EndComp
$Comp
L Device:LED D4
U 1 1 615B3A6A
P 3300 6800
F 0 "D4" V 3339 6682 50  0000 R CNN
F 1 "LED" V 3248 6682 50  0001 R CNN
F 2 "LED_SMD:LED_0603_1608Metric_Pad1.05x0.95mm_HandSolder" H 3300 6800 50  0001 C CNN
F 3 "~" H 3300 6800 50  0001 C CNN
	1    3300 6800
	0    -1   -1   0   
$EndComp
$Comp
L Device:LED D5
U 1 1 615CC3BD
P 3700 6800
F 0 "D5" V 3739 6682 50  0000 R CNN
F 1 "LED" V 3648 6682 50  0001 R CNN
F 2 "LED_SMD:LED_0603_1608Metric_Pad1.05x0.95mm_HandSolder" H 3700 6800 50  0001 C CNN
F 3 "~" H 3700 6800 50  0001 C CNN
	1    3700 6800
	0    -1   -1   0   
$EndComp
$Comp
L Device:LED D8
U 1 1 615CC3CF
P 4100 6800
F 0 "D8" V 4139 6682 50  0000 R CNN
F 1 "LED" V 4048 6682 50  0001 R CNN
F 2 "LED_SMD:LED_0603_1608Metric_Pad1.05x0.95mm_HandSolder" H 4100 6800 50  0001 C CNN
F 3 "~" H 4100 6800 50  0001 C CNN
	1    4100 6800
	0    -1   -1   0   
$EndComp
$Comp
L Device:R R1
U 1 1 615FDE54
P 2100 6400
F 0 "R1" H 2170 6446 50  0000 L CNN
F 1 "1k3" H 2170 6355 50  0000 L CNN
F 2 "Resistor_SMD:R_0603_1608Metric_Pad1.05x0.95mm_HandSolder" V 2030 6400 50  0001 C CNN
F 3 "~" H 2100 6400 50  0001 C CNN
	1    2100 6400
	1    0    0    -1  
$EndComp
$Comp
L Device:R R2
U 1 1 61600231
P 2500 6400
F 0 "R2" H 2570 6446 50  0000 L CNN
F 1 "3k9" H 2570 6355 50  0000 L CNN
F 2 "Resistor_SMD:R_0603_1608Metric_Pad1.05x0.95mm_HandSolder" V 2430 6400 50  0001 C CNN
F 3 "~" H 2500 6400 50  0001 C CNN
	1    2500 6400
	1    0    0    -1  
$EndComp
$Comp
L Device:R R3
U 1 1 61603E02
P 2900 6400
F 0 "R3" H 2970 6446 50  0000 L CNN
F 1 "3k9" H 2970 6355 50  0000 L CNN
F 2 "Resistor_SMD:R_0603_1608Metric_Pad1.05x0.95mm_HandSolder" V 2830 6400 50  0001 C CNN
F 3 "~" H 2900 6400 50  0001 C CNN
	1    2900 6400
	1    0    0    -1  
$EndComp
$Comp
L Device:R R4
U 1 1 61603E08
P 3300 6400
F 0 "R4" H 3370 6446 50  0000 L CNN
F 1 "10k" H 3370 6355 50  0000 L CNN
F 2 "Resistor_SMD:R_0603_1608Metric_Pad1.05x0.95mm_HandSolder" V 3230 6400 50  0001 C CNN
F 3 "~" H 3300 6400 50  0001 C CNN
	1    3300 6400
	1    0    0    -1  
$EndComp
$Comp
L Device:R R5
U 1 1 6161C7C9
P 3700 6400
F 0 "R5" H 3770 6446 50  0000 L CNN
F 1 "22k" H 3770 6355 50  0000 L CNN
F 2 "Resistor_SMD:R_0805_2012Metric_Pad1.15x1.40mm_HandSolder" V 3630 6400 50  0001 C CNN
F 3 "~" H 3700 6400 50  0001 C CNN
	1    3700 6400
	1    0    0    -1  
$EndComp
$Comp
L Device:R R8
U 1 1 6161C7DB
P 4100 6400
F 0 "R8" H 4170 6446 50  0000 L CNN
F 1 "27k" H 4170 6355 50  0000 L CNN
F 2 "Resistor_SMD:R_0805_2012Metric_Pad1.15x1.40mm_HandSolder" V 4030 6400 50  0001 C CNN
F 3 "~" H 4100 6400 50  0001 C CNN
	1    4100 6400
	1    0    0    -1  
$EndComp
Wire Wire Line
	2100 6550 2100 6650
Wire Wire Line
	2500 6550 2500 6650
Wire Wire Line
	2900 6550 2900 6650
Wire Wire Line
	3300 6550 3300 6650
Wire Wire Line
	3700 6550 3700 6650
Wire Wire Line
	4100 6550 4100 6650
$Comp
L power:+3V3 #PWR0113
U 1 1 616D1715
P 2100 6250
F 0 "#PWR0113" H 2100 6100 50  0001 C CNN
F 1 "+3V3" H 2115 6423 50  0000 C CNN
F 2 "" H 2100 6250 50  0001 C CNN
F 3 "" H 2100 6250 50  0001 C CNN
	1    2100 6250
	1    0    0    -1  
$EndComp
$Comp
L power:+12V #PWR0114
U 1 1 616F83A7
P 3300 6250
F 0 "#PWR0114" H 3300 6100 50  0001 C CNN
F 1 "+12V" H 3315 6423 50  0000 C CNN
F 2 "" H 3300 6250 50  0001 C CNN
F 3 "" H 3300 6250 50  0001 C CNN
	1    3300 6250
	1    0    0    -1  
$EndComp
$Comp
L power:+24V #PWR0115
U 1 1 616F83AD
P 3700 6250
F 0 "#PWR0115" H 3700 6100 50  0001 C CNN
F 1 "+24V" H 3715 6423 50  0000 C CNN
F 2 "" H 3700 6250 50  0001 C CNN
F 3 "" H 3700 6250 50  0001 C CNN
	1    3700 6250
	1    0    0    -1  
$EndComp
Wire Bus Line
	1850 3900 1850 5700
Wire Bus Line
	1850 5700 2000 5850
Connection ~ 1850 3900
Entry Wire Line
	2400 5850 2500 5950
Entry Wire Line
	2800 5850 2900 5950
Wire Wire Line
	2900 5950 2900 6250
Wire Wire Line
	2500 5950 2500 6250
Text Label 2500 6250 1    50   ~ 0
+6V_A
Text Label 2900 6250 1    50   ~ 0
+6V_B
$Comp
L power:GND #PWR0116
U 1 1 6187885A
P 4100 7150
F 0 "#PWR0116" H 4100 6900 50  0001 C CNN
F 1 "GND" H 4105 6977 50  0000 C CNN
F 2 "" H 4100 7150 50  0001 C CNN
F 3 "" H 4100 7150 50  0001 C CNN
	1    4100 7150
	1    0    0    -1  
$EndComp
Wire Wire Line
	4100 7150 4100 7100
Wire Wire Line
	2100 7100 2100 6950
Wire Wire Line
	2500 6950 2500 7100
Connection ~ 2500 7100
Wire Wire Line
	2500 7100 2100 7100
Wire Wire Line
	2900 7100 2900 6950
Connection ~ 2900 7100
Wire Wire Line
	2900 7100 2500 7100
Wire Wire Line
	3300 6950 3300 7100
Connection ~ 3300 7100
Wire Wire Line
	3300 7100 2900 7100
Wire Wire Line
	3700 6950 3700 7100
Connection ~ 3700 7100
Wire Wire Line
	3700 7100 3300 7100
Wire Wire Line
	4100 6950 4100 7100
Connection ~ 4100 7100
$Comp
L Connector:Conn_Coaxial_Power J8
U 1 1 619F2541
P 5200 7100
F 0 "J8" H 5288 7096 50  0000 L CNN
F 1 "Internal Fan" H 5288 7005 50  0000 L CNN
F 2 "myLibrary:SMB_Jack_Vertical_Wurth" H 5200 7050 50  0001 C CNN
F 3 "~" H 5200 7050 50  0001 C CNN
F 4 "Wurth Electronik" H 5200 7100 50  0001 C CNN "Manufacturer"
F 5 "61612042121504" H 5200 7100 50  0001 C CNN "Manufacturer_Part_Number"
	1    5200 7100
	1    0    0    -1  
$EndComp
$Comp
L power:GND #PWR0117
U 1 1 619F2547
P 5200 7350
F 0 "#PWR0117" H 5200 7100 50  0001 C CNN
F 1 "GND" H 5205 7177 50  0000 C CNN
F 2 "" H 5200 7350 50  0001 C CNN
F 3 "" H 5200 7350 50  0001 C CNN
	1    5200 7350
	1    0    0    -1  
$EndComp
Wire Wire Line
	5200 7300 5200 7350
$Comp
L Device:Ferrite_Bead L2
U 1 1 619F2550
P 5200 6400
F 0 "L2" H 5000 6450 50  0000 L CNN
F 1 "MFB-201209" H 4600 6350 50  0000 L CNN
F 2 "Inductor_SMD:L_0805_2012Metric" V 5130 6400 50  0001 C CNN
F 3 "~" H 5200 6400 50  0001 C CNN
F 4 "MEC MARCOM" V 5200 6400 50  0001 C CNN "Manufacturer"
F 5 "MFB-201209-0600PN" V 5200 6400 50  0001 C CNN "Manufacturer_Part_Number"
	1    5200 6400
	-1   0    0    -1  
$EndComp
Wire Wire Line
	5200 6550 5200 6600
Wire Wire Line
	5200 6250 5200 5950
Text Label 5200 6250 1    50   ~ 0
INT_FAN
Entry Wire Line
	5100 5850 5200 5950
Wire Wire Line
	12950 7000 13500 7000
Wire Wire Line
	12950 8350 13500 8350
Wire Wire Line
	12950 5050 13500 5050
Wire Wire Line
	12950 6400 13500 6400
Wire Wire Line
	12950 2850 13500 2850
Wire Wire Line
	12950 4200 13500 4200
Wire Wire Line
	8100 2650 8800 2650
Connection ~ 5000 1350
Wire Bus Line
	5000 1350 9750 1350
Wire Bus Line
	9150 5850 9300 6000
$Comp
L SamacSys_Parts:TPS7A4001MDGNREP U1
U 1 1 62E3A5B5
P 6800 8150
F 0 "U1" H 7000 8400 50  0000 L CNN
F 1 "TPS7A4001MDGNREP" H 7000 8300 50  0000 L CNN
F 2 "SOP65P490X110-9N" H 7850 8250 50  0001 L CNN
F 3 "http://www.ti.com/lit/gpn/tps7a4001-ep" H 7850 8150 50  0001 L CNN
F 4 "100V Input Voltage, 50mA Single Output Low Dropout Linear Regulator" H 7850 8050 50  0001 L CNN "Description"
F 5 "1.1" H 7850 7950 50  0001 L CNN "Height"
F 6 "Texas Instruments" H 7850 7850 50  0001 L CNN "Manufacturer_Name"
F 7 "TPS7A4001MDGNREP" H 7850 7750 50  0001 L CNN "Manufacturer_Part_Number"
	1    6800 8150
	1    0    0    -1  
$EndComp
$Comp
L Device:C C8
U 1 1 62EB5EDB
P 8350 8350
F 0 "C8" H 8465 8441 50  0000 L CNN
F 1 "4u7" H 8465 8350 50  0000 L CNN
F 2 "Capacitor_SMD:C_1210_3225Metric" H 8388 8200 50  0001 C CNN
F 3 "~" H 8350 8350 50  0001 C CNN
F 4 "100V" H 8465 8259 50  0000 L CNN "Voltage"
	1    8350 8350
	1    0    0    -1  
$EndComp
$Comp
L Device:C C11
U 1 1 62EBB27D
P 5200 8600
F 0 "C11" H 5315 8691 50  0000 L CNN
F 1 "4u7" H 5315 8600 50  0000 L CNN
F 2 "Capacitor_SMD:C_1206_3216Metric" H 5238 8450 50  0001 C CNN
F 3 "~" H 5200 8600 50  0001 C CNN
F 4 "50V" H 5315 8509 50  0000 L CNN "Voltage"
	1    5200 8600
	1    0    0    -1  
$EndComp
$Comp
L Device:C C10
U 1 1 62EDD4BF
P 5600 8500
F 0 "C10" H 5715 8591 50  0000 L CNN
F 1 "4u7" H 5715 8500 50  0000 L CNN
F 2 "Capacitor_SMD:C_1206_3216Metric" H 5638 8350 50  0001 C CNN
F 3 "~" H 5600 8500 50  0001 C CNN
F 4 "50V" H 5715 8409 50  0000 L CNN "Voltage"
	1    5600 8500
	1    0    0    -1  
$EndComp
$Comp
L Device:R R10
U 1 1 62F4FB7C
P 6000 8350
F 0 "R10" H 6070 8396 50  0000 L CNN
F 1 "820k" H 6070 8305 50  0000 L CNN
F 2 "Resistor_SMD:R_0805_2012Metric" V 5930 8350 50  0001 C CNN
F 3 "~" H 6000 8350 50  0001 C CNN
	1    6000 8350
	1    0    0    -1  
$EndComp
$Comp
L Device:R R11
U 1 1 62F50529
P 6000 8750
F 0 "R11" H 6070 8796 50  0000 L CNN
F 1 "36k" H 6070 8705 50  0000 L CNN
F 2 "Resistor_SMD:R_0805_2012Metric" V 5930 8750 50  0001 C CNN
F 3 "~" H 6000 8750 50  0001 C CNN
	1    6000 8750
	1    0    0    -1  
$EndComp
$Comp
L Device:C C7
U 1 1 62F51390
P 6350 8350
F 0 "C7" H 6465 8441 50  0000 L CNN
F 1 "10n" H 6465 8350 50  0000 L CNN
F 2 "Capacitor_SMD:C_0805_2012Metric" H 6388 8200 50  0001 C CNN
F 3 "~" H 6350 8350 50  0001 C CNN
F 4 "50V" H 6465 8259 50  0000 L CNN "Voltage"
	1    6350 8350
	1    0    0    -1  
$EndComp
NoConn ~ 6800 8350
$Comp
L power:GND #PWR0119
U 1 1 62F98849
P 7400 8950
F 0 "#PWR0119" H 7400 8700 50  0001 C CNN
F 1 "GND" H 7405 8777 50  0000 C CNN
F 2 "" H 7400 8950 50  0001 C CNN
F 3 "" H 7400 8950 50  0001 C CNN
	1    7400 8950
	1    0    0    -1  
$EndComp
$Comp
L power:GND #PWR0120
U 1 1 62F99124
P 6800 8950
F 0 "#PWR0120" H 6800 8700 50  0001 C CNN
F 1 "GND" H 6805 8777 50  0000 C CNN
F 2 "" H 6800 8950 50  0001 C CNN
F 3 "" H 6800 8950 50  0001 C CNN
	1    6800 8950
	1    0    0    -1  
$EndComp
Wire Wire Line
	6800 8950 6800 8450
Wire Wire Line
	8000 8450 8100 8450
Wire Wire Line
	8100 8450 8100 8150
Wire Wire Line
	8100 8150 8000 8150
NoConn ~ 8000 8350
NoConn ~ 8000 8250
Wire Wire Line
	6000 8500 6000 8550
Wire Wire Line
	6000 8550 6350 8550
Wire Wire Line
	6700 8550 6700 8250
Wire Wire Line
	6700 8250 6800 8250
Connection ~ 6000 8550
Wire Wire Line
	6000 8550 6000 8600
Wire Wire Line
	5200 8150 5200 8450
Wire Wire Line
	5600 8150 5600 8350
Wire Wire Line
	5600 8150 6000 8150
Wire Wire Line
	6000 8200 6000 8150
Connection ~ 6000 8150
Wire Wire Line
	6000 8150 6350 8150
Wire Wire Line
	6350 8150 6350 8200
Connection ~ 6350 8150
Wire Wire Line
	6350 8150 6800 8150
Wire Wire Line
	6350 8500 6350 8550
Connection ~ 6350 8550
Wire Wire Line
	6350 8550 6700 8550
Wire Wire Line
	8100 8150 8350 8150
Wire Wire Line
	8350 8150 8350 8200
Connection ~ 8100 8150
$Comp
L power:GND #PWR0121
U 1 1 6319E246
P 8350 8500
F 0 "#PWR0121" H 8350 8250 50  0001 C CNN
F 1 "GND" H 8355 8327 50  0000 C CNN
F 2 "" H 8350 8500 50  0001 C CNN
F 3 "" H 8350 8500 50  0001 C CNN
	1    8350 8500
	1    0    0    -1  
$EndComp
Wire Wire Line
	6000 8900 6000 8950
Wire Wire Line
	6000 8950 6800 8950
Wire Wire Line
	5200 8750 5200 8950
Wire Wire Line
	5200 8950 5600 8950
Connection ~ 6000 8950
Wire Wire Line
	5600 8650 5600 8950
Connection ~ 5600 8950
Wire Wire Line
	5600 8950 6000 8950
Connection ~ 6800 8950
Entry Wire Line
	9300 8050 9200 8150
Connection ~ 8350 8150
Text Label 8900 8150 0    50   ~ 0
NS_PWR
$Comp
L Device:Ferrite_Bead L4
U 1 1 634FE744
P 8700 8150
F 0 "L4" V 8400 8050 50  0000 L CNN
F 1 "MFB-201209" V 8500 8050 50  0000 L CNN
F 2 "Inductor_SMD:L_0805_2012Metric" V 8630 8150 50  0001 C CNN
F 3 "~" H 8700 8150 50  0001 C CNN
F 4 "MEC MARCOM" V 8700 8150 50  0001 C CNN "Manufacturer"
F 5 "MFB-201209-0600PN" V 8700 8150 50  0001 C CNN "Manufacturer_Part_Number"
	1    8700 8150
	0    1    1    0   
$EndComp
Wire Wire Line
	9200 8150 8850 8150
$Comp
L Device:R R9
U 1 1 6372BC55
P 5000 8150
F 0 "R9" V 4800 8050 50  0000 L CNN
F 1 "15R" V 4900 8050 50  0000 L CNN
F 2 "Resistor_SMD:R_0805_2012Metric" V 4930 8150 50  0001 C CNN
F 3 "~" H 5000 8150 50  0001 C CNN
	1    5000 8150
	0    1    1    0   
$EndComp
Wire Wire Line
	5150 8150 5200 8150
$Comp
L Device:C C9
U 1 1 63759A2C
P 4800 8500
F 0 "C9" H 4915 8591 50  0000 L CNN
F 1 "4u7" H 4915 8500 50  0000 L CNN
F 2 "Capacitor_SMD:C_1206_3216Metric" H 4838 8350 50  0001 C CNN
F 3 "~" H 4800 8500 50  0001 C CNN
F 4 "50V" H 4915 8409 50  0000 L CNN "Voltage"
	1    4800 8500
	1    0    0    -1  
$EndComp
Wire Wire Line
	4800 8650 4800 8950
Wire Wire Line
	4850 8150 4800 8150
Wire Wire Line
	4800 8150 4800 8350
$Comp
L Connector:Conn_Coaxial_Power J9
U 1 1 63805BF1
P 4450 8450
F 0 "J9" H 4538 8446 50  0000 L CNN
F 1 "NS" H 4538 8355 50  0000 L CNN
F 2 "myLibrary:SMB_Jack_Vertical_Wurth" H 4450 8400 50  0001 C CNN
F 3 "~" H 4450 8400 50  0001 C CNN
F 4 "Wurth Electronik" H 4450 8450 50  0001 C CNN "Manufacturer"
F 5 "61612042121504" H 4450 8450 50  0001 C CNN "Manufacturer_Part_Number"
F 6 "28V" H 4600 8250 50  0000 C CNN "Voltage"
	1    4450 8450
	1    0    0    -1  
$EndComp
Wire Wire Line
	4450 8650 4450 8950
Wire Wire Line
	4450 8950 4800 8950
Wire Wire Line
	4450 8350 4450 8150
Connection ~ 4800 8150
Wire Wire Line
	8350 8150 8550 8150
$Comp
L Device:R R15
U 1 1 639A51CB
P 8700 9600
F 0 "R15" V 8500 9500 50  0000 L CNN
F 1 "4R7" V 8600 9500 50  0000 L CNN
F 2 "Resistor_SMD:R_0805_2012Metric" V 8630 9600 50  0001 C CNN
F 3 "~" H 8700 9600 50  0001 C CNN
	1    8700 9600
	0    1    1    0   
$EndComp
Entry Wire Line
	9300 9500 9200 9600
Wire Wire Line
	9200 9600 8850 9600
Text Label 8900 9600 0    50   ~ 0
NS_PWR
$Comp
L Device:C C17
U 1 1 63A6CD4D
P 8450 9850
F 0 "C17" H 8565 9941 50  0000 L CNN
F 1 "3u3" H 8565 9850 50  0000 L CNN
F 2 "Capacitor_SMD:C_1210_3225Metric" H 8488 9700 50  0001 C CNN
F 3 "~" H 8450 9850 50  0001 C CNN
F 4 "100V" H 8565 9759 50  0000 L CNN "Voltage"
	1    8450 9850
	1    0    0    -1  
$EndComp
Wire Wire Line
	8450 9600 8450 9700
$Comp
L power:GND #PWR0122
U 1 1 63A6CD54
P 8450 10000
F 0 "#PWR0122" H 8450 9750 50  0001 C CNN
F 1 "GND" H 8455 9827 50  0000 C CNN
F 2 "" H 8450 10000 50  0001 C CNN
F 3 "" H 8450 10000 50  0001 C CNN
	1    8450 10000
	1    0    0    -1  
$EndComp
Wire Wire Line
	8350 9600 8450 9600
Connection ~ 8450 9600
Wire Wire Line
	8450 9600 8550 9600
$Comp
L Device:R R14
U 1 1 63AF0DD1
P 8200 9600
F 0 "R14" V 8000 9500 50  0000 L CNN
F 1 "4R7" V 8100 9500 50  0000 L CNN
F 2 "Resistor_SMD:R_0805_2012Metric" V 8130 9600 50  0001 C CNN
F 3 "~" H 8200 9600 50  0001 C CNN
	1    8200 9600
	0    1    1    0   
$EndComp
$Comp
L Device:C C16
U 1 1 63AF0DD8
P 7950 9850
F 0 "C16" H 8065 9941 50  0000 L CNN
F 1 "3u3" H 8065 9850 50  0000 L CNN
F 2 "Capacitor_SMD:C_1210_3225Metric" H 7988 9700 50  0001 C CNN
F 3 "~" H 7950 9850 50  0001 C CNN
F 4 "100V" H 8065 9759 50  0000 L CNN "Voltage"
	1    7950 9850
	1    0    0    -1  
$EndComp
Wire Wire Line
	7950 9600 7950 9700
$Comp
L power:GND #PWR0123
U 1 1 63AF0DDF
P 7950 10000
F 0 "#PWR0123" H 7950 9750 50  0001 C CNN
F 1 "GND" H 7955 9827 50  0000 C CNN
F 2 "" H 7950 10000 50  0001 C CNN
F 3 "" H 7950 10000 50  0001 C CNN
	1    7950 10000
	1    0    0    -1  
$EndComp
Connection ~ 7950 9600
Wire Wire Line
	7950 9600 8050 9600
Wire Wire Line
	7850 9600 7950 9600
$Comp
L Device:R R13
U 1 1 63C2EE16
P 7700 9600
F 0 "R13" V 7500 9500 50  0000 L CNN
F 1 "4R7" V 7600 9500 50  0000 L CNN
F 2 "Resistor_SMD:R_0805_2012Metric" V 7630 9600 50  0001 C CNN
F 3 "~" H 7700 9600 50  0001 C CNN
	1    7700 9600
	0    1    1    0   
$EndComp
$Comp
L Device:C C15
U 1 1 63C2EE1D
P 7450 9850
F 0 "C15" H 7565 9941 50  0000 L CNN
F 1 "3u3" H 7565 9850 50  0000 L CNN
F 2 "Capacitor_SMD:C_1210_3225Metric" H 7488 9700 50  0001 C CNN
F 3 "~" H 7450 9850 50  0001 C CNN
F 4 "100V" H 7565 9759 50  0000 L CNN "Voltage"
	1    7450 9850
	1    0    0    -1  
$EndComp
Wire Wire Line
	7450 9600 7450 9700
$Comp
L power:GND #PWR0124
U 1 1 63C2EE24
P 7450 10000
F 0 "#PWR0124" H 7450 9750 50  0001 C CNN
F 1 "GND" H 7455 9827 50  0000 C CNN
F 2 "" H 7450 10000 50  0001 C CNN
F 3 "" H 7450 10000 50  0001 C CNN
	1    7450 10000
	1    0    0    -1  
$EndComp
Wire Wire Line
	7350 9600 7450 9600
Connection ~ 7450 9600
Wire Wire Line
	7450 9600 7550 9600
$Comp
L Device:R R12
U 1 1 63C2EE2D
P 7200 9600
F 0 "R12" V 7000 9500 50  0000 L CNN
F 1 "4R7" V 7100 9500 50  0000 L CNN
F 2 "Resistor_SMD:R_0805_2012Metric" V 7130 9600 50  0001 C CNN
F 3 "~" H 7200 9600 50  0001 C CNN
	1    7200 9600
	0    1    1    0   
$EndComp
$Comp
L Device:C C14
U 1 1 63C2EE34
P 6950 9850
F 0 "C14" H 7065 9941 50  0000 L CNN
F 1 "3u3" H 7065 9850 50  0000 L CNN
F 2 "Capacitor_SMD:C_1210_3225Metric" H 6988 9700 50  0001 C CNN
F 3 "~" H 6950 9850 50  0001 C CNN
F 4 "100V" H 7065 9759 50  0000 L CNN "Voltage"
	1    6950 9850
	1    0    0    -1  
$EndComp
Wire Wire Line
	6950 9600 6950 9700
$Comp
L power:GND #PWR0125
U 1 1 63C2EE3B
P 6950 10000
F 0 "#PWR0125" H 6950 9750 50  0001 C CNN
F 1 "GND" H 6955 9827 50  0000 C CNN
F 2 "" H 6950 10000 50  0001 C CNN
F 3 "" H 6950 10000 50  0001 C CNN
	1    6950 10000
	1    0    0    -1  
$EndComp
Connection ~ 6950 9600
Wire Wire Line
	6950 9600 7050 9600
$Comp
L power:GND #PWR0126
U 1 1 63C5E96A
P 4800 8950
F 0 "#PWR0126" H 4800 8700 50  0001 C CNN
F 1 "GND" H 4805 8777 50  0000 C CNN
F 2 "" H 4800 8950 50  0001 C CNN
F 3 "" H 4800 8950 50  0001 C CNN
	1    4800 8950
	1    0    0    -1  
$EndComp
Connection ~ 4800 8950
$Comp
L Connector:Conn_Coaxial_Power J10
U 1 1 63CDABE7
P 6500 9800
F 0 "J10" H 6588 9796 50  0000 L CNN
F 1 "Heater" H 6588 9705 50  0000 L CNN
F 2 "myLibrary:SMB_Jack_Vertical_Wurth" H 6500 9750 50  0001 C CNN
F 3 "~" H 6500 9750 50  0001 C CNN
F 4 "Wurth Electronik" H 6500 9800 50  0001 C CNN "Manufacturer"
F 5 "61612042121504" H 6500 9800 50  0001 C CNN "Manufacturer_Part_Number"
	1    6500 9800
	1    0    0    -1  
$EndComp
Wire Wire Line
	6500 9700 6500 9600
Wire Wire Line
	6500 9600 6950 9600
$Comp
L power:GND #PWR0127
U 1 1 63D6F489
P 6500 10000
F 0 "#PWR0127" H 6500 9750 50  0001 C CNN
F 1 "GND" H 6505 9827 50  0000 C CNN
F 2 "" H 6500 10000 50  0001 C CNN
F 3 "" H 6500 10000 50  0001 C CNN
	1    6500 10000
	1    0    0    -1  
$EndComp
$Comp
L Connector:Conn_Coaxial_Power J12
U 1 1 63DB3EC8
P 3450 9100
F 0 "J12" H 3538 9096 50  0000 L CNN
F 1 "+6V_B" H 3538 9005 50  0000 L CNN
F 2 "myLibrary:SMB_Jack_Vertical_Wurth" H 3450 9050 50  0001 C CNN
F 3 "~" H 3450 9050 50  0001 C CNN
F 4 "Wurth Electronik" H 3450 9100 50  0001 C CNN "Manufacturer"
F 5 "61612042121504" H 3450 9100 50  0001 C CNN "Manufacturer_Part_Number"
	1    3450 9100
	1    0    0    -1  
$EndComp
$Comp
L power:GND #PWR0128
U 1 1 63DB3ECE
P 3450 9400
F 0 "#PWR0128" H 3450 9150 50  0001 C CNN
F 1 "GND" H 3455 9227 50  0000 C CNN
F 2 "" H 3450 9400 50  0001 C CNN
F 3 "" H 3450 9400 50  0001 C CNN
	1    3450 9400
	1    0    0    -1  
$EndComp
$Comp
L Connector:Conn_Coaxial_Power J11
U 1 1 63DE265C
P 3450 7900
F 0 "J11" H 3538 7896 50  0000 L CNN
F 1 "+6V_A" H 3538 7805 50  0000 L CNN
F 2 "myLibrary:SMB_Jack_Vertical_Wurth" H 3450 7850 50  0001 C CNN
F 3 "~" H 3450 7850 50  0001 C CNN
F 4 "Wurth Electronik" H 3450 7900 50  0001 C CNN "Manufacturer"
F 5 "61612042121504" H 3450 7900 50  0001 C CNN "Manufacturer_Part_Number"
	1    3450 7900
	1    0    0    -1  
$EndComp
$Comp
L power:GND #PWR0129
U 1 1 63DE2662
P 3450 8200
F 0 "#PWR0129" H 3450 7950 50  0001 C CNN
F 1 "GND" H 3455 8027 50  0000 C CNN
F 2 "" H 3450 8200 50  0001 C CNN
F 3 "" H 3450 8200 50  0001 C CNN
	1    3450 8200
	1    0    0    -1  
$EndComp
Connection ~ 1850 5700
Entry Wire Line
	1850 7650 1950 7750
Entry Wire Line
	1850 8850 1950 8950
$Comp
L Device:Ferrite_Bead L3
U 1 1 63E92716
P 2350 7750
F 0 "L3" V 2050 7650 50  0000 L CNN
F 1 "MFB-201209" V 2150 7650 50  0000 L CNN
F 2 "Inductor_SMD:L_0805_2012Metric" V 2280 7750 50  0001 C CNN
F 3 "~" H 2350 7750 50  0001 C CNN
F 4 "MEC MARCOM" V 2350 7750 50  0001 C CNN "Manufacturer"
F 5 "MFB-201209-0600PN" V 2350 7750 50  0001 C CNN "Manufacturer_Part_Number"
	1    2350 7750
	0    1    1    0   
$EndComp
$Comp
L Device:Ferrite_Bead L5
U 1 1 63EBFC90
P 2350 8950
F 0 "L5" V 2050 8850 50  0000 L CNN
F 1 "MFB-201209" V 2150 8850 50  0000 L CNN
F 2 "Inductor_SMD:L_0805_2012Metric" V 2280 8950 50  0001 C CNN
F 3 "~" H 2350 8950 50  0001 C CNN
F 4 "MEC MARCOM" V 2350 8950 50  0001 C CNN "Manufacturer"
F 5 "MFB-201209-0600PN" V 2350 8950 50  0001 C CNN "Manufacturer_Part_Number"
	1    2350 8950
	0    1    1    0   
$EndComp
Text Label 1950 7750 0    50   ~ 0
+6V_A
Text Label 1950 8950 0    50   ~ 0
+6V_B
Wire Wire Line
	2200 7750 1950 7750
Wire Wire Line
	1950 8950 2200 8950
$Comp
L Device:C C5
U 1 1 63FD482F
P 2600 7950
F 0 "C5" H 2715 8041 50  0000 L CNN
F 1 "47u" H 2715 7950 50  0000 L CNN
F 2 "Capacitor_SMD:C_1206_3216Metric" H 2638 7800 50  0001 C CNN
F 3 "~" H 2600 7950 50  0001 C CNN
F 4 "10V" H 2715 7859 50  0000 L CNN "Voltage"
	1    2600 7950
	1    0    0    -1  
$EndComp
$Comp
L Device:C C12
U 1 1 64038D59
P 2600 9150
F 0 "C12" H 2715 9241 50  0000 L CNN
F 1 "47u" H 2715 9150 50  0000 L CNN
F 2 "Capacitor_SMD:C_1206_3216Metric" H 2638 9000 50  0001 C CNN
F 3 "~" H 2600 9150 50  0001 C CNN
F 4 "10V" H 2715 9059 50  0000 L CNN "Voltage"
	1    2600 9150
	1    0    0    -1  
$EndComp
$Comp
L Device:C C6
U 1 1 640682AF
P 3050 7950
F 0 "C6" H 3165 7996 50  0000 L CNN
F 1 "100n" H 3165 7905 50  0000 L CNN
F 2 "Capacitor_SMD:C_0805_2012Metric" H 3088 7800 50  0001 C CNN
F 3 "~" H 3050 7950 50  0001 C CNN
	1    3050 7950
	1    0    0    -1  
$EndComp
$Comp
L Device:C C13
U 1 1 6406A243
P 3050 9150
F 0 "C13" H 3165 9196 50  0000 L CNN
F 1 "100n" H 3165 9105 50  0000 L CNN
F 2 "Capacitor_SMD:C_0805_2012Metric" H 3088 9000 50  0001 C CNN
F 3 "~" H 3050 9150 50  0001 C CNN
	1    3050 9150
	1    0    0    -1  
$EndComp
Wire Wire Line
	2500 7750 2600 7750
Wire Wire Line
	3450 7750 3450 7800
Wire Wire Line
	3050 7800 3050 7750
Connection ~ 3050 7750
Wire Wire Line
	3050 7750 3450 7750
Wire Wire Line
	2600 7750 2600 7800
Connection ~ 2600 7750
Wire Wire Line
	2600 7750 3050 7750
Wire Wire Line
	2500 8950 2600 8950
Wire Wire Line
	3450 8950 3450 9000
Wire Wire Line
	3050 9000 3050 8950
Connection ~ 3050 8950
Wire Wire Line
	3050 8950 3450 8950
Wire Wire Line
	2600 8950 2600 9000
Connection ~ 2600 8950
Wire Wire Line
	2600 8950 3050 8950
Wire Wire Line
	2600 9300 2600 9350
Wire Wire Line
	2600 9350 3050 9350
Wire Wire Line
	3450 9350 3450 9300
Wire Wire Line
	3450 9400 3450 9350
Connection ~ 3450 9350
Wire Wire Line
	3050 9300 3050 9350
Connection ~ 3050 9350
Wire Wire Line
	3050 9350 3450 9350
Wire Wire Line
	2600 8100 2600 8150
Wire Wire Line
	2600 8150 3050 8150
Wire Wire Line
	3450 8150 3450 8200
Wire Wire Line
	3450 8100 3450 8150
Connection ~ 3450 8150
Wire Wire Line
	3050 8100 3050 8150
Connection ~ 3050 8150
Wire Wire Line
	3050 8150 3450 8150
Wire Wire Line
	4100 6150 4100 6250
Wire Wire Line
	12500 7650 11700 7650
Wire Wire Line
	11600 7550 12500 7550
Wire Wire Line
	12500 7450 11500 7450
Wire Wire Line
	11400 7350 12500 7350
$Comp
L SamacSys_Parts:CAY16-103J4LF RN6
U 1 1 60F33CB4
P 11300 7350
F 0 "RN6" H 11750 7600 50  0000 L CNN
F 1 "1k5" H 11750 7500 50  0000 L CNN
F 2 "CAY16-103J4LF" H 12250 7450 50  0001 L CNN
F 3 "http://uk.rs-online.com/web/p/products/5225585" H 12250 7350 50  0001 L CNN
F 4 "4-array convex 0603 LF resistor,10K Bourns CAY16 Series 10k +/-5% Isolated SMT Resistor Array, 4 Resistors, 0.25W total 1206 package Convex" H 12250 7250 50  0001 L CNN "Description"
F 5 "" H 12250 7150 50  0001 L CNN "Height"
F 6 "Bourns" H 12250 7050 50  0001 L CNN "Manufacturer_Name"
F 7 "CAY16-1501F4LF " H 12250 6950 50  0001 L CNN "Manufacturer_Part_Number"
	1    11300 7350
	-1   0    0    -1  
$EndComp
$Comp
L SamacSys_Parts:W3A45C103KAT2A CN6
U 1 1 60F33CC2
P 11400 8450
F 0 "CN6" V 11950 7850 50  0000 L CNN
F 1 "10n x 4" V 11850 7700 50  0000 L CNN
F 2 "W3A45C103KAT2A" H 12050 8550 50  0001 L CNN
F 3 "https://www.mouser.com/datasheet/2/40/AutoCapArray-777041.pdf" H 12050 8450 50  0001 L CNN
F 4 "Capacitor Arrays & Networks 50volts 0.01uF 10% 4cap X7R" H 12050 8350 50  0001 L CNN "Description"
F 5 "1.35" H 12050 8250 50  0001 L CNN "Height"
F 6 "AVX" H 12050 8150 50  0001 L CNN "Manufacturer_Name"
F 7 "W3A41C103KAT2A" H 12050 8050 50  0001 L CNN "Manufacturer_Part_Number"
F 8 "581-W3A45C103KAT2A" H 12050 7950 50  0001 L CNN "Mouser Part Number"
F 9 "https://www.mouser.co.uk/ProductDetail/AVX/W3A45C103KAT2A?qs=DdDi5Yj9iRR741T2RhLfFg%3D%3D" H 12050 7850 50  0001 L CNN "Mouser Price/Stock"
F 10 "W3A45C103KAT2A" H 12050 7750 50  0001 L CNN "Arrow Part Number"
F 11 "https://www.arrow.com/en/products/w3a45c103kat2a/avx" H 12050 7650 50  0001 L CNN "Arrow Price/Stock"
	1    11400 8450
	0    -1   -1   0   
$EndComp
Connection ~ 11700 8450
Wire Wire Line
	11400 8450 11500 8450
Wire Wire Line
	11700 8450 11600 8450
Connection ~ 11500 8450
Connection ~ 11600 8450
Wire Wire Line
	11600 8450 11500 8450
$Comp
L SamacSys_Parts:W3A45C103KAT2A CN4
U 1 1 603E7D61
P 11450 4500
F 0 "CN4" V 12000 3900 50  0000 L CNN
F 1 "10n x 4" V 11900 3750 50  0000 L CNN
F 2 "W3A45C103KAT2A" H 12100 4600 50  0001 L CNN
F 3 "https://www.mouser.com/datasheet/2/40/AutoCapArray-777041.pdf" H 12100 4500 50  0001 L CNN
F 4 "Capacitor Arrays & Networks 50volts 0.01uF 10% 4cap X7R" H 12100 4400 50  0001 L CNN "Description"
F 5 "1.35" H 12100 4300 50  0001 L CNN "Height"
F 6 "AVX" H 12100 4200 50  0001 L CNN "Manufacturer_Name"
F 7 "W3A41C103KAT2A" H 12100 4100 50  0001 L CNN "Manufacturer_Part_Number"
F 8 "581-W3A45C103KAT2A" H 12100 4000 50  0001 L CNN "Mouser Part Number"
F 9 "https://www.mouser.co.uk/ProductDetail/AVX/W3A45C103KAT2A?qs=DdDi5Yj9iRR741T2RhLfFg%3D%3D" H 12100 3900 50  0001 L CNN "Mouser Price/Stock"
F 10 "W3A45C103KAT2A" H 12100 3800 50  0001 L CNN "Arrow Part Number"
F 11 "https://www.arrow.com/en/products/w3a45c103kat2a/avx" H 12100 3700 50  0001 L CNN "Arrow Price/Stock"
	1    11450 4500
	0    -1   -1   0   
$EndComp
$Comp
L SamacSys_Parts:W3A45C103KAT2A CN3
U 1 1 603E7D53
P 11400 3000
F 0 "CN3" V 11950 2400 50  0000 L CNN
F 1 "10n x 4" V 11850 2250 50  0000 L CNN
F 2 "W3A45C103KAT2A" H 12050 3100 50  0001 L CNN
F 3 "https://www.mouser.com/datasheet/2/40/AutoCapArray-777041.pdf" H 12050 3000 50  0001 L CNN
F 4 "Capacitor Arrays & Networks 50volts 0.01uF 10% 4cap X7R" H 12050 2900 50  0001 L CNN "Description"
F 5 "1.35" H 12050 2800 50  0001 L CNN "Height"
F 6 "AVX" H 12050 2700 50  0001 L CNN "Manufacturer_Name"
F 7 "W3A41C103KAT2A" H 12050 2600 50  0001 L CNN "Manufacturer_Part_Number"
F 8 "581-W3A45C103KAT2A" H 12050 2500 50  0001 L CNN "Mouser Part Number"
F 9 "https://www.mouser.co.uk/ProductDetail/AVX/W3A45C103KAT2A?qs=DdDi5Yj9iRR741T2RhLfFg%3D%3D" H 12050 2400 50  0001 L CNN "Mouser Price/Stock"
F 10 "W3A45C103KAT2A" H 12050 2300 50  0001 L CNN "Arrow Part Number"
F 11 "https://www.arrow.com/en/products/w3a45c103kat2a/avx" H 12050 2200 50  0001 L CNN "Arrow Price/Stock"
	1    11400 3000
	0    -1   -1   0   
$EndComp
$Comp
L SamacSys_Parts:CAY16-103J4LF RN4
U 1 1 603E7D45
P 10500 3700
F 0 "RN4" H 10700 3250 50  0000 L CNN
F 1 "1k5" H 10700 3150 50  0000 L CNN
F 2 "CAY16-103J4LF" H 11450 3800 50  0001 L CNN
F 3 "http://uk.rs-online.com/web/p/products/5225585" H 11450 3700 50  0001 L CNN
F 4 "4-array convex 0603 LF resistor,10K Bourns CAY16 Series 10k +/-5% Isolated SMT Resistor Array, 4 Resistors, 0.25W total 1206 package Convex" H 11450 3600 50  0001 L CNN "Description"
F 5 "" H 11450 3500 50  0001 L CNN "Height"
F 6 "Bourns" H 11450 3400 50  0001 L CNN "Manufacturer_Name"
F 7 "CAY16-1501F4LF " H 11450 3300 50  0001 L CNN "Manufacturer_Part_Number"
	1    10500 3700
	1    0    0    1   
$EndComp
NoConn ~ 10500 2000
NoConn ~ 10500 1900
$Comp
L SamacSys_Parts:CAY16-103J4LF RN3
U 1 1 603E7D37
P 10500 2200
F 0 "RN3" H 10700 1750 50  0000 L CNN
F 1 "1k5" H 10700 1650 50  0000 L CNN
F 2 "CAY16-103J4LF" H 11450 2300 50  0001 L CNN
F 3 "http://uk.rs-online.com/web/p/products/5225585" H 11450 2200 50  0001 L CNN
F 4 "4-array convex 0603 LF resistor,10K Bourns CAY16 Series 10k +/-5% Isolated SMT Resistor Array, 4 Resistors, 0.25W total 1206 package Convex" H 11450 2100 50  0001 L CNN "Description"
F 5 "" H 11450 2000 50  0001 L CNN "Height"
F 6 "Bourns" H 11450 1900 50  0001 L CNN "Manufacturer_Name"
F 7 "CAY16-1501F4LF " H 11450 1800 50  0001 L CNN "Manufacturer_Part_Number"
	1    10500 2200
	1    0    0    1   
$EndComp
Wire Wire Line
	11300 2100 11600 2100
Wire Wire Line
	11300 2200 11700 2200
Connection ~ 11600 2100
Wire Wire Line
	11600 2100 12500 2100
Connection ~ 11700 2200
Wire Wire Line
	11700 2200 12400 2200
NoConn ~ 11400 2300
NoConn ~ 11500 2300
NoConn ~ 11300 1900
NoConn ~ 11300 2000
Wire Wire Line
	11750 3800 11750 3700
Connection ~ 11750 3700
Wire Wire Line
	11750 3700 12500 3700
Wire Wire Line
	11650 3800 11650 3600
Connection ~ 11650 3600
Wire Wire Line
	11650 3600 12500 3600
Wire Wire Line
	11550 3800 11550 3500
Connection ~ 11550 3500
Wire Wire Line
	11550 3500 12500 3500
Wire Wire Line
	11450 3800 11450 3400
Connection ~ 11450 3400
Wire Wire Line
	11450 3400 12500 3400
Wire Wire Line
	5600 8150 5200 8150
Connection ~ 5600 8150
Connection ~ 5200 8150
Connection ~ 4450 8150
Wire Wire Line
	4450 8150 4800 8150
Wire Wire Line
	7250 6750 7250 7200
Wire Wire Line
	7750 6750 7250 6750
Wire Wire Line
	7350 6850 7350 7300
Wire Wire Line
	7350 7300 7250 7300
$Comp
L SamacSys_Parts:380-009-113L001 J7
U 1 1 623F7C93
P 8200 6450
F 0 "J7" V 8250 6350 50  0000 L CNN
F 1 "GPIO" V 8350 6250 50  0000 L CNN
F 2 "SamacSys_Parts:380009113L001" H 9350 6750 50  0001 L CNN
F 3 "http://www.farnell.com/datasheets/1633170.pdf" H 9350 6650 50  0001 L CNN
F 4 "Norcomp 380, MICRO-D Series, 9 Way PCB D-sub Connector Plug, 1.27mm Pitch" H 9350 6550 50  0001 L CNN "Description"
F 5 "10.2" H 9350 6450 50  0001 L CNN "Height"
F 6 "NorComp" H 9350 6350 50  0001 L CNN "Manufacturer_Name"
F 7 "380-009-113L001" H 9350 6250 50  0001 L CNN "Manufacturer_Part_Number"
	1    8200 6450
	0    -1   1    0   
$EndComp
$Comp
L power:GND #PWR0118
U 1 1 6240EB24
P 8200 7550
F 0 "#PWR0118" H 8200 7300 50  0001 C CNN
F 1 "GND" H 8205 7377 50  0000 C CNN
F 2 "" H 8200 7550 50  0001 C CNN
F 3 "" H 8200 7550 50  0001 C CNN
	1    8200 7550
	1    0    0    -1  
$EndComp
Wire Wire Line
	7250 6650 7550 6650
Wire Wire Line
	7550 6650 7550 6300
Wire Wire Line
	7550 6300 8850 6300
Wire Wire Line
	8850 6300 8850 6750
Wire Wire Line
	8850 6750 8650 6750
Wire Wire Line
	7250 6550 7450 6550
Wire Wire Line
	7450 6550 7450 6200
Wire Wire Line
	7450 6200 8950 6200
Wire Wire Line
	8950 6200 8950 6850
Wire Wire Line
	8950 6850 8650 6850
Wire Wire Line
	7250 7400 7450 7400
Wire Wire Line
	7450 6950 7750 6950
Wire Wire Line
	7250 7500 7550 7500
Wire Wire Line
	7550 7500 7550 7050
Wire Wire Line
	7550 7050 7750 7050
Wire Wire Line
	8200 7500 7650 7500
Wire Wire Line
	7650 7500 7650 7150
Wire Wire Line
	8200 6400 8650 6400
Wire Wire Line
	8200 6450 8200 6400
Wire Wire Line
	7450 7400 7450 6950
Wire Wire Line
	7350 6850 7750 6850
Wire Wire Line
	8650 6400 8650 6450
$Comp
L power:GND #PWR0130
U 1 1 62887C45
P 8650 6450
F 0 "#PWR0130" H 8650 6200 50  0001 C CNN
F 1 "GND" H 8655 6277 50  0000 C CNN
F 2 "" H 8650 6450 50  0001 C CNN
F 3 "" H 8650 6450 50  0001 C CNN
	1    8650 6450
	1    0    0    -1  
$EndComp
Wire Wire Line
	8200 7550 8200 7500
Connection ~ 8200 7500
Wire Wire Line
	8200 7500 8200 7450
Text Label 6200 7300 0    50   ~ 0
TEC_EN
Text Label 6200 7200 0    50   ~ 0
TEC_RX
Text Label 6200 6650 0    50   ~ 0
TEC_TX
Wire Wire Line
	6150 7300 6450 7300
Wire Wire Line
	6150 7200 6450 7200
Wire Wire Line
	6150 6650 6450 6650
Wire Wire Line
	6450 6550 6150 6550
Wire Wire Line
	6450 7500 6150 7500
Entry Wire Line
	6050 7200 6150 7300
Entry Wire Line
	6050 7100 6150 7200
Text Label 6200 7500 0    50   ~ 0
GPIO4
Text Label 6200 7400 0    50   ~ 0
GPIO3
Text Label 6200 6550 0    50   ~ 0
SDA0
Text Label 6200 6450 0    50   ~ 0
SCL0
Wire Wire Line
	6150 6450 6450 6450
Wire Wire Line
	6150 7400 6450 7400
$Comp
L SamacSys_Parts:CAY16-103J4LF RN8
U 1 1 6296A388
P 6450 6350
F 0 "RN8" H 6650 6600 50  0000 L CNN
F 1 "330R" H 6650 6500 50  0000 L CNN
F 2 "CAY16-103J4LF" H 7400 6450 50  0001 L CNN
F 3 "http://uk.rs-online.com/web/p/products/5225585" H 7400 6350 50  0001 L CNN
F 4 "4-array convex 0603 LF resistor,10K Bourns CAY16 Series 10k +/-5% Isolated SMT Resistor Array, 4 Resistors, 0.25W total 1206 package Convex" H 7400 6250 50  0001 L CNN "Description"
F 5 "" H 7400 6150 50  0001 L CNN "Height"
F 6 "Bourns" H 7400 6050 50  0001 L CNN "Manufacturer_Name"
F 7 "CAY16-1501F4LF " H 7400 5950 50  0001 L CNN "Manufacturer_Part_Number"
	1    6450 6350
	1    0    0    -1  
$EndComp
$Comp
L SamacSys_Parts:CAY16-103J4LF RN7
U 1 1 6249B520
P 6450 7200
F 0 "RN7" H 6650 7450 50  0000 L CNN
F 1 "330R" H 6650 7350 50  0000 L CNN
F 2 "CAY16-103J4LF" H 7400 7300 50  0001 L CNN
F 3 "http://uk.rs-online.com/web/p/products/5225585" H 7400 7200 50  0001 L CNN
F 4 "4-array convex 0603 LF resistor,10K Bourns CAY16 Series 10k +/-5% Isolated SMT Resistor Array, 4 Resistors, 0.25W total 1206 package Convex" H 7400 7100 50  0001 L CNN "Description"
F 5 "" H 7400 7000 50  0001 L CNN "Height"
F 6 "Bourns" H 7400 6900 50  0001 L CNN "Manufacturer_Name"
F 7 "CAY16-1501F4LF " H 7400 6800 50  0001 L CNN "Manufacturer_Part_Number"
	1    6450 7200
	1    0    0    -1  
$EndComp
Entry Wire Line
	6050 6550 6150 6650
Entry Wire Line
	6050 6450 6150 6550
Entry Wire Line
	6050 6350 6150 6450
Entry Wire Line
	6050 7400 6150 7500
Entry Wire Line
	6050 7300 6150 7400
Wire Bus Line
	5900 5850 6050 6000
Connection ~ 5900 5850
Wire Bus Line
	5900 5850 9150 5850
Wire Wire Line
	8650 6950 9050 6950
Wire Wire Line
	9050 6950 9050 6100
Wire Wire Line
	9050 6100 7350 6100
Wire Wire Line
	7350 6100 7350 6450
Wire Wire Line
	7350 6450 7250 6450
NoConn ~ 6450 6350
NoConn ~ 7250 6350
Wire Wire Line
	3700 7100 4100 7100
Wire Wire Line
	4450 6150 4450 8150
Wire Wire Line
	4450 6150 4100 6150
Text Notes 4050 6100 0    50   ~ 0
NS
$Comp
L Device:R R6
U 1 1 611B0DC5
P 5200 6750
F 0 "R6" H 5270 6796 50  0000 L CNN
F 1 "10R" H 5270 6705 50  0000 L CNN
F 2 "Resistor_SMD:R_2512_6332Metric_Pad1.52x3.35mm_HandSolder" V 5130 6750 50  0001 C CNN
F 3 "~" H 5200 6750 50  0001 C CNN
	1    5200 6750
	1    0    0    -1  
$EndComp
$Comp
L Device:C C18
U 1 1 6125B671
P 4800 7200
F 0 "C18" H 4915 7246 50  0000 L CNN
F 1 "100n" H 4915 7155 50  0000 L CNN
F 2 "Capacitor_SMD:C_0805_2012Metric" H 4838 7050 50  0001 C CNN
F 3 "~" H 4800 7200 50  0001 C CNN
	1    4800 7200
	1    0    0    -1  
$EndComp
Wire Wire Line
	5200 6900 5200 6950
Wire Wire Line
	5200 6950 4800 6950
Wire Wire Line
	4800 6950 4800 7050
Connection ~ 5200 6950
Wire Wire Line
	5200 6950 5200 7000
$Comp
L power:GND #PWR08
U 1 1 612BFCC8
P 4800 7350
F 0 "#PWR08" H 4800 7100 50  0001 C CNN
F 1 "GND" H 4805 7177 50  0000 C CNN
F 2 "" H 4800 7350 50  0001 C CNN
F 3 "" H 4800 7350 50  0001 C CNN
	1    4800 7350
	1    0    0    -1  
$EndComp
Text Notes 7600 6750 0    50   ~ 0
BLK
Text Notes 7600 6850 0    50   ~ 0
BRN
Text Notes 7600 6950 0    50   ~ 0
RED
Text Notes 7600 7050 0    50   ~ 0
ORA
Wire Wire Line
	7750 7150 7650 7150
Text Notes 7600 7150 0    50   ~ 0
YEL
$Comp
L power:+3.3V #PWR?
U 1 1 61A11FC1
P 8900 7250
F 0 "#PWR?" H 8900 7100 50  0001 C CNN
F 1 "+3.3V" H 8915 7423 50  0000 C CNN
F 2 "" H 8900 7250 50  0001 C CNN
F 3 "" H 8900 7250 50  0001 C CNN
	1    8900 7250
	1    0    0    -1  
$EndComp
Wire Wire Line
	8650 7050 8750 7050
Wire Wire Line
	8750 7050 8750 7250
Wire Wire Line
	8750 7250 8900 7250
Text Notes 8650 6750 0    50   ~ 0
GRN
Text Notes 8650 6850 0    50   ~ 0
BLU
Text Notes 8650 6950 0    50   ~ 0
VLT
Text Notes 8650 7050 0    50   ~ 0
GRY
Text Notes 7500 3000 0    50   ~ 0
BLK
Text Notes 7500 3100 0    50   ~ 0
BRN
Text Notes 7500 3200 0    50   ~ 0
RED
Text Notes 7500 3300 0    50   ~ 0
ORA
Text Notes 7500 3400 0    50   ~ 0
YEL
Text Notes 7500 3500 0    50   ~ 0
GRN
Wire Wire Line
	7500 3000 7650 3000
Text Notes 7500 3600 0    50   ~ 0
BLU
Text Notes 7500 3700 0    50   ~ 0
VIO
Wire Bus Line
	3750 1350 5000 1350
Text Notes 8550 3000 0    50   ~ 0
GRY
Text Notes 8550 3100 0    50   ~ 0
WHI
Text Notes 8550 3200 0    50   ~ 0
PNK
Text Notes 8550 3300 0    50   ~ 0
L/GN
Text Notes 8550 3400 0    50   ~ 0
BK/W
Text Notes 8550 3500 0    50   ~ 0
BR/W
Text Notes 8550 3600 0    50   ~ 0
RD/W
Wire Bus Line
	9300 6000 9300 9600
Wire Bus Line
	1850 5700 1850 8950
Wire Bus Line
	2000 5850 5900 5850
Wire Bus Line
	5000 1350 5000 3700
Wire Bus Line
	6050 6000 6050 7550
Wire Bus Line
	9900 1500 9900 9400
Wire Bus Line
	3600 1500 3600 3900
Wire Bus Line
	1850 2100 1850 3900
$EndSCHEMATC
