EESchema Schematic File Version 4
EELAYER 30 0
EELAYER END
$Descr A4 11693 8268
encoding utf-8
Sheet 2 3
Title "MAIN CONTROLLER"
Date "February 2021"
Rev "1.1"
Comp "Astrophysics Group Cavendish Laboratory"
Comment1 ""
Comment2 ""
Comment3 ""
Comment4 "Digital Power Supplies"
$EndDescr
Wire Wire Line
	7300 5350 7750 5350
Wire Wire Line
	7300 5150 7300 5350
Wire Wire Line
	7750 4950 7750 5000
Wire Wire Line
	7300 4950 7750 4950
$Comp
L power:GND #PWR?
U 1 1 62CF084F
P 7750 5350
AR Path="/62CF084F" Ref="#PWR?"  Part="1" 
AR Path="/62CB939A/62CF084F" Ref="#PWR0115"  Part="1" 
F 0 "#PWR0115" H 7750 5100 50  0001 C CNN
F 1 "GND" H 7755 5177 50  0000 C CNN
F 2 "" H 7750 5350 50  0001 C CNN
F 3 "" H 7750 5350 50  0001 C CNN
	1    7750 5350
	-1   0    0    -1  
$EndComp
$Comp
L Device:C C?
U 1 1 62CF0856
P 7750 5150
AR Path="/62CF0856" Ref="C?"  Part="1" 
AR Path="/62CB939A/62CF0856" Ref="C1"  Part="1" 
F 0 "C1" H 7865 5196 50  0000 L CNN
F 1 "10u" H 7865 5105 50  0000 L CNN
F 2 "Capacitor_SMD:C_1210_3225Metric" H 7788 5000 50  0001 C CNN
F 3 "~" H 7750 5150 50  0001 C CNN
	1    7750 5150
	-1   0    0    -1  
$EndComp
Wire Wire Line
	6500 5050 6250 5050
NoConn ~ 7300 5050
NoConn ~ 7300 3950
Wire Wire Line
	6300 5450 5800 5450
Wire Wire Line
	5800 4350 5800 4300
Connection ~ 5800 3850
Wire Wire Line
	5800 4000 5800 3850
Wire Wire Line
	5800 4950 5700 4950
Wire Wire Line
	6500 4950 5800 4950
Connection ~ 5800 4950
Wire Wire Line
	5800 4950 5800 5100
Wire Wire Line
	5800 5450 5800 5400
Wire Wire Line
	6500 5150 6300 5150
$Comp
L Device:Ferrite_Bead FB?
U 1 1 62CF08B3
P 5550 3850
AR Path="/62CF08B3" Ref="FB?"  Part="1" 
AR Path="/62CB939A/62CF08B3" Ref="L9"  Part="1" 
F 0 "L9" V 5750 3850 50  0000 L CNN
F 1 "MFB-201209-0600PN" V 5400 3750 50  0001 L CNN
F 2 "Inductor_SMD:L_0805_2012Metric" V 5480 3850 50  0001 C CNN
F 3 "~" H 5550 3850 50  0001 C CNN
	1    5550 3850
	0    -1   -1   0   
$EndComp
$Comp
L Device:C C?
U 1 1 62CF08B9
P 5800 5250
AR Path="/62CF08B9" Ref="C?"  Part="1" 
AR Path="/62CB939A/62CF08B9" Ref="C2"  Part="1" 
F 0 "C2" H 5915 5296 50  0000 L CNN
F 1 "1u0" H 5915 5205 50  0000 L CNN
F 2 "Capacitor_SMD:C_1206_3216Metric" H 5838 5100 50  0001 C CNN
F 3 "~" H 5800 5250 50  0001 C CNN
	1    5800 5250
	1    0    0    -1  
$EndComp
$Comp
L Device:C C?
U 1 1 62CF08BF
P 5800 4150
AR Path="/62CF08BF" Ref="C?"  Part="1" 
AR Path="/62CB939A/62CF08BF" Ref="C6"  Part="1" 
F 0 "C6" H 5600 4200 50  0000 L CNN
F 1 "1u0" H 5550 4100 50  0000 L CNN
F 2 "Capacitor_SMD:C_1206_3216Metric" H 5838 4000 50  0001 C CNN
F 3 "~" H 5800 4150 50  0001 C CNN
	1    5800 4150
	-1   0    0    -1  
$EndComp
$Comp
L myLibrary:Converter_DCDC_RDE20 U?
U 1 1 62CF08FA
P 6900 5050
AR Path="/62CF08FA" Ref="U?"  Part="1" 
AR Path="/62CB939A/62CF08FA" Ref="U4"  Part="1" 
F 0 "U4" H 7200 5400 50  0000 R CNN
F 1 "RDE2024D12" H 7200 5300 50  0000 R CNN
F 2 "myLibrary:Converter_DCDC_RDE20" H 6900 5050 50  0001 C CNN
F 3 "" H 6900 5050 50  0001 C CNN
	1    6900 5050
	1    0    0    -1  
$EndComp
$Comp
L myLibrary:Converter_DCDC_RDE20 U?
U 1 1 62CF0900
P 6900 3950
AR Path="/62CF0900" Ref="U?"  Part="1" 
AR Path="/62CB939A/62CF0900" Ref="U5"  Part="1" 
F 0 "U5" H 7200 4300 50  0000 R CNN
F 1 "RDE2024S12" H 7200 4200 50  0000 R CNN
F 2 "myLibrary:Converter_DCDC_RDE20" H 6900 3950 50  0001 C CNN
F 3 "" H 6900 3950 50  0001 C CNN
	1    6900 3950
	1    0    0    -1  
$EndComp
Wire Wire Line
	7750 5300 7750 5350
Connection ~ 7750 5350
Wire Wire Line
	7950 4950 7750 4950
Connection ~ 7750 4950
Text HLabel 7950 4950 2    50   Output ~ 0
+24V
Text HLabel 6250 5050 0    50   Input ~ 0
24V_EN
$Comp
L power:GND #PWR0116
U 1 1 605DBA8D
P 5850 2900
F 0 "#PWR0116" H 5850 2650 50  0001 C CNN
F 1 "GND" H 5855 2727 50  0000 C CNN
F 2 "" H 5850 2900 50  0001 C CNN
F 3 "" H 5850 2900 50  0001 C CNN
	1    5850 2900
	1    0    0    -1  
$EndComp
Wire Wire Line
	5950 2650 5850 2650
Wire Wire Line
	5850 2650 5850 2750
Wire Wire Line
	5950 2750 5850 2750
Connection ~ 5850 2750
Wire Wire Line
	5850 2750 5850 2900
$Comp
L Device:CP C29
U 1 1 605ECD27
P 8400 2100
F 0 "C29" H 8518 2146 50  0000 L CNN
F 1 "100u" H 8518 2055 50  0000 L CNN
F 2 "Capacitor_SMD:CP_Elec_10x10" H 8438 1950 50  0001 C CNN
F 3 "~" H 8400 2100 50  0001 C CNN
F 4 "4741PHCT-ND" H 8400 2100 50  0001 C CNN "DigiKey_Part_Number"
F 5 "Vishay Beyschlag/Draloric/BC Components" H 8400 2100 50  0001 C CNN "Manufacturer"
F 6 "MAL215099702E3" H 8400 2100 50  0001 C CNN "Manufacturer_Part_Number"
	1    8400 2100
	1    0    0    -1  
$EndComp
Wire Wire Line
	7450 1900 7800 1900
Wire Wire Line
	7800 2250 7800 2300
Wire Wire Line
	7800 2300 8400 2300
Wire Wire Line
	8400 2300 8400 2250
Wire Wire Line
	8400 1950 8400 1900
Connection ~ 7800 1900
Wire Wire Line
	7800 1900 7800 1950
$Comp
L power:GND #PWR0118
U 1 1 6060B69B
P 8400 2300
F 0 "#PWR0118" H 8400 2050 50  0001 C CNN
F 1 "GND" H 8405 2127 50  0000 C CNN
F 2 "" H 8400 2300 50  0001 C CNN
F 3 "" H 8400 2300 50  0001 C CNN
	1    8400 2300
	1    0    0    -1  
$EndComp
Connection ~ 8400 2300
Wire Wire Line
	7500 2750 7400 2750
$Comp
L SamacSys_Parts:RDD0824S05 U8
U 1 1 605D0846
P 5950 2550
F 0 "U8" H 6150 2800 50  0000 L CNN
F 1 "RDD0824S05" H 6150 2700 50  0000 L CNN
F 2 "RDD0824S05" H 7500 2650 50  0001 L CNN
F 3 "https://www.xppower.com/Portals/0/pdfs/SF_RDD08.pdf" H 7500 2550 50  0001 L CNN
F 4 "XP Power Through Hole 8W Isolated DC-DC Converter, Vin 13  70 V dc Railway Approved" H 7500 2450 50  0001 L CNN "Description"
F 5 "11.2" H 7500 2350 50  0001 L CNN "Height"
F 6 "XP POWER" H 7500 2250 50  0001 L CNN "Manufacturer"
F 7 "RDD0824S05" H 7500 2150 50  0001 L CNN "Manufacturer_Part_Number"
	1    5950 2550
	1    0    0    -1  
$EndComp
Wire Wire Line
	6850 1900 7450 1900
Wire Wire Line
	7450 2650 7400 2650
Wire Wire Line
	7400 2550 7450 2550
Connection ~ 7450 2550
Wire Wire Line
	7450 2550 7450 2650
Wire Wire Line
	8400 1900 7800 1900
Text HLabel 5850 2550 0    50   Input ~ 0
5V_EN
$Comp
L power:GND #PWR0119
U 1 1 60618360
P 9000 3200
F 0 "#PWR0119" H 9000 2950 50  0001 C CNN
F 1 "GND" H 9005 3027 50  0000 C CNN
F 2 "" H 9000 3200 50  0001 C CNN
F 3 "" H 9000 3200 50  0001 C CNN
	1    9000 3200
	1    0    0    -1  
$EndComp
$Comp
L Device:C C?
U 1 1 60652E63
P 8500 2950
AR Path="/60652E63" Ref="C?"  Part="1" 
AR Path="/62CB939A/60652E63" Ref="C30"  Part="1" 
F 0 "C30" H 8615 2996 50  0000 L CNN
F 1 "10u" H 8615 2905 50  0000 L CNN
F 2 "Capacitor_SMD:C_0805_2012Metric" H 8538 2800 50  0001 C CNN
F 3 "~" H 8500 2950 50  0001 C CNN
	1    8500 2950
	1    0    0    -1  
$EndComp
Text HLabel 9200 2750 2    50   Output ~ 0
+5V
Wire Wire Line
	7400 2850 7600 2850
$Comp
L Device:L L8
U 1 1 60C74934
P 8750 2750
F 0 "L8" V 8950 2750 50  0000 L CNN
F 1 "22u" V 8850 2700 50  0000 L CNN
F 2 "myLibrary:L_Bourns_SRP6540" H 8750 2750 50  0001 C CNN
F 3 "~" H 8750 2750 50  0001 C CNN
F 4 "Bourns Inc" V 8750 2750 50  0001 C CNN "Manufacturer"
F 5 "SRP6540-220M" V 8750 2750 50  0001 C CNN "Manufacturer_Part_Number"
	1    8750 2750
	0    -1   -1   0   
$EndComp
$Comp
L Device:C C31
U 1 1 60C75DF4
P 9000 2950
F 0 "C31" H 9115 2996 50  0000 L CNN
F 1 "1u0" H 9115 2905 50  0000 L CNN
F 2 "Capacitor_SMD:C_0805_2012Metric" H 9038 2800 50  0001 C CNN
F 3 "~" H 9000 2950 50  0001 C CNN
	1    9000 2950
	1    0    0    -1  
$EndComp
Wire Wire Line
	8050 2750 8500 2750
Wire Wire Line
	8900 2750 9000 2750
Wire Wire Line
	9000 2750 9000 2800
Connection ~ 9000 2750
Wire Wire Line
	9000 2750 9200 2750
Wire Wire Line
	8500 2800 8500 2750
Connection ~ 8500 2750
Wire Wire Line
	8500 2750 8600 2750
Wire Wire Line
	8200 2950 8200 3150
Wire Wire Line
	8200 3150 8500 3150
Wire Wire Line
	9000 3150 9000 3100
Wire Wire Line
	9000 3150 9000 3200
Connection ~ 9000 3150
Wire Wire Line
	8500 3100 8500 3150
Connection ~ 8500 3150
Wire Wire Line
	8500 3150 9000 3150
$Comp
L power:GND #PWR0120
U 1 1 60C8F175
P 9050 4300
F 0 "#PWR0120" H 9050 4050 50  0001 C CNN
F 1 "GND" H 9055 4127 50  0000 C CNN
F 2 "" H 9050 4300 50  0001 C CNN
F 3 "" H 9050 4300 50  0001 C CNN
	1    9050 4300
	1    0    0    -1  
$EndComp
$Comp
L Device:C C?
U 1 1 60C8F17B
P 8550 4050
AR Path="/60C8F17B" Ref="C?"  Part="1" 
AR Path="/62CB939A/60C8F17B" Ref="C3"  Part="1" 
F 0 "C3" H 8665 4096 50  0000 L CNN
F 1 "10u" H 8665 4005 50  0000 L CNN
F 2 "Capacitor_SMD:C_0805_2012Metric" H 8588 3900 50  0001 C CNN
F 3 "~" H 8550 4050 50  0001 C CNN
	1    8550 4050
	1    0    0    -1  
$EndComp
Text HLabel 9250 3850 2    50   Output ~ 0
+12V
$Comp
L Device:C C32
U 1 1 60C8F196
P 9050 4050
F 0 "C32" H 9165 4096 50  0000 L CNN
F 1 "1u0" H 9165 4005 50  0000 L CNN
F 2 "Capacitor_SMD:C_0805_2012Metric" H 9088 3900 50  0001 C CNN
F 3 "~" H 9050 4050 50  0001 C CNN
	1    9050 4050
	1    0    0    -1  
$EndComp
Wire Wire Line
	8050 3850 8550 3850
Wire Wire Line
	8950 3850 9050 3850
Wire Wire Line
	9050 3850 9050 3900
Connection ~ 9050 3850
Wire Wire Line
	9050 3850 9250 3850
Wire Wire Line
	8550 3900 8550 3850
Connection ~ 8550 3850
Wire Wire Line
	8550 3850 8650 3850
Wire Wire Line
	8200 4050 8200 4250
Wire Wire Line
	8200 4250 8550 4250
Wire Wire Line
	9050 4250 9050 4200
Wire Wire Line
	9050 4250 9050 4300
Connection ~ 9050 4250
Wire Wire Line
	8550 4200 8550 4250
Connection ~ 8550 4250
Wire Wire Line
	8550 4250 9050 4250
$Comp
L power:GND #PWR0129
U 1 1 60CB2970
P 5800 5450
F 0 "#PWR0129" H 5800 5200 50  0001 C CNN
F 1 "GND" H 5805 5277 50  0000 C CNN
F 2 "" H 5800 5450 50  0001 C CNN
F 3 "" H 5800 5450 50  0001 C CNN
	1    5800 5450
	-1   0    0    -1  
$EndComp
Connection ~ 5800 5450
$Comp
L power:GND #PWR0131
U 1 1 60CB498E
P 5800 4350
F 0 "#PWR0131" H 5800 4100 50  0001 C CNN
F 1 "GND" H 5805 4177 50  0000 C CNN
F 2 "" H 5800 4350 50  0001 C CNN
F 3 "" H 5800 4350 50  0001 C CNN
	1    5800 4350
	1    0    0    -1  
$EndComp
Connection ~ 5800 4350
Wire Wire Line
	7300 3850 7650 3850
Text HLabel 6250 3950 0    50   Input ~ 0
12V_EN
Wire Wire Line
	6250 3950 6500 3950
Text Notes 9300 2900 0    50   ~ 0
Ext only
Text Notes 9350 4000 0    50   ~ 0
Int & Ext
Text Notes 8300 5100 2    50   ~ 0
Int only
Wire Wire Line
	7450 1900 7450 2550
Wire Wire Line
	5700 3850 5800 3850
$Comp
L Device:L L11
U 1 1 60EED838
P 8800 3850
F 0 "L11" V 9000 3850 50  0000 L CNN
F 1 "22u" V 8900 3850 50  0000 L CNN
F 2 "myLibrary:L_Bourns_SRP6540" H 8800 3850 50  0001 C CNN
F 3 "~" H 8800 3850 50  0001 C CNN
F 4 "Bourns Inc" V 8800 3850 50  0001 C CNN "Manufacturer"
F 5 "SRP6540-220M" V 8800 3850 50  0001 C CNN "Manufacturer_Part_Number"
	1    8800 3850
	0    -1   -1   0   
$EndComp
$Comp
L Device:L_Core_Ferrite_Coupled_1423 L7
U 1 1 6069987E
P 7850 2850
F 0 "L7" H 7650 3150 50  0000 L CNN
F 1 "ACM4520-142" H 7650 3050 50  0000 L CNN
F 2 "SamacSys_Parts:ACM4520" H 7850 2850 50  0001 C CNN
F 3 "~" H 7850 2850 50  0001 C CNN
F 4 "TDK" H 7850 2850 50  0001 C CNN "Manufacturer"
F 5 "ACM4520-142-2P-T000" H 7850 2850 50  0001 C CNN "Manufacturer_Part_Number"
F 6 "445-6136-1-ND" H 7850 2850 50  0001 C CNN "DigiKey_Part_Number"
	1    7850 2850
	1    0    0    -1  
$EndComp
Wire Wire Line
	8200 2950 8050 2950
Wire Wire Line
	7600 2850 7600 2750
Wire Wire Line
	7600 2750 7650 2750
Wire Wire Line
	7300 4050 7650 4050
Wire Wire Line
	8200 4050 8050 4050
Wire Wire Line
	6500 4050 6300 4050
Wire Wire Line
	6300 4050 6300 4350
$Comp
L Device:L_Core_Ferrite_Coupled_1423 L10
U 1 1 60728D99
P 7850 3950
F 0 "L10" H 7650 4250 50  0000 L CNN
F 1 "ACM4520-142" H 7650 4150 50  0000 L CNN
F 2 "SamacSys_Parts:ACM4520" H 7850 3950 50  0001 C CNN
F 3 "~" H 7850 3950 50  0001 C CNN
F 4 "TDK" H 7850 3950 50  0001 C CNN "Manufacturer"
F 5 "ACM4520-142-2P-T000" H 7850 3950 50  0001 C CNN "Manufacturer_Part_Number"
F 6 "445-6136-1-ND" H 7850 3950 50  0001 C CNN "DigiKey_Part_Number"
	1    7850 3950
	1    0    0    -1  
$EndComp
$Comp
L Device:CP C28
U 1 1 60746C18
P 7800 2100
F 0 "C28" H 7918 2146 50  0000 L CNN
F 1 "100u" H 7918 2055 50  0000 L CNN
F 2 "Capacitor_SMD:CP_Elec_10x10" H 7838 1950 50  0001 C CNN
F 3 "~" H 7800 2100 50  0001 C CNN
F 4 "4741PHCT-ND" H 7800 2100 50  0001 C CNN "DigiKey_Part_Number"
F 5 "Vishay Beyschlag/Draloric/BC Components" H 7800 2100 50  0001 C CNN "Manufacturer"
F 6 "MAL215099702E3" H 7800 2100 50  0001 C CNN "Manufacturer_Part_Number"
	1    7800 2100
	1    0    0    -1  
$EndComp
Wire Wire Line
	5850 2550 5950 2550
Wire Wire Line
	5400 4950 5250 4950
$Comp
L Device:Ferrite_Bead FB?
U 1 1 62CF08C5
P 5550 4950
AR Path="/62CF08C5" Ref="FB?"  Part="1" 
AR Path="/62CB939A/62CF08C5" Ref="L4"  Part="1" 
F 0 "L4" V 5750 4950 50  0000 L CNN
F 1 "MFB-201209-0600PN" V 5400 4850 50  0001 L CNN
F 2 "Inductor_SMD:L_0805_2012Metric" V 5480 4950 50  0001 C CNN
F 3 "~" H 5550 4950 50  0001 C CNN
	1    5550 4950
	0    -1   -1   0   
$EndComp
Wire Wire Line
	6300 4350 5800 4350
Wire Wire Line
	6500 3850 5800 3850
Wire Wire Line
	6300 5150 6300 5450
Wire Wire Line
	5250 3850 5400 3850
$Comp
L Device:Ferrite_Bead FB?
U 1 1 60A66EB9
P 6700 1900
AR Path="/60A66EB9" Ref="FB?"  Part="1" 
AR Path="/62CB939A/60A66EB9" Ref="L5"  Part="1" 
F 0 "L5" V 6900 1900 50  0000 L CNN
F 1 "MFB-201209-0600PN" V 6550 1800 50  0001 L CNN
F 2 "Inductor_SMD:L_0805_2012Metric" V 6630 1900 50  0001 C CNN
F 3 "~" H 6700 1900 50  0001 C CNN
	1    6700 1900
	0    -1   -1   0   
$EndComp
Text HLabel 3350 1900 0    50   Input ~ 0
+48V
Text Notes 2400 3400 0    50   ~ 0
Int only
Connection ~ 4600 3550
$Comp
L power:GND #PWR0130
U 1 1 60CB3707
P 4600 3550
F 0 "#PWR0130" H 4600 3300 50  0001 C CNN
F 1 "GND" H 4605 3377 50  0000 C CNN
F 2 "" H 4600 3550 50  0001 C CNN
F 3 "" H 4600 3550 50  0001 C CNN
	1    4600 3550
	1    0    0    -1  
$EndComp
Text HLabel 2750 3250 0    50   Output ~ 0
+3.3V
Connection ~ 2950 3250
Wire Wire Line
	2950 3250 2750 3250
Wire Wire Line
	4200 2950 4200 2850
Wire Wire Line
	4050 2950 4200 2950
Connection ~ 4200 2850
Connection ~ 4200 2950
Wire Wire Line
	4200 3050 4200 2950
Wire Wire Line
	4200 2850 4050 2850
Wire Wire Line
	4200 2850 4600 2850
Wire Wire Line
	4050 3050 4200 3050
$Comp
L myLibrary:MAXM15065 U?
U 1 1 62CF0906
P 3700 3050
AR Path="/62CF0906" Ref="U?"  Part="1" 
AR Path="/62CB939A/62CF0906" Ref="U6"  Part="1" 
F 0 "U6" H 3450 3500 50  0000 L CNN
F 1 "MAXM15062" H 3450 3400 50  0000 L CNN
F 2 "myLibrary:uSLIC-10" H 3700 3050 50  0001 C CNN
F 3 "https://datasheets.maximintegrated.com/en/ds/MAXM15065-MAXM15067.pdf" H 3700 3050 50  0001 C CNN
	1    3700 3050
	1    0    0    -1  
$EndComp
$Comp
L Device:C C?
U 1 1 62CF08F4
P 4600 3200
AR Path="/62CF08F4" Ref="C?"  Part="1" 
AR Path="/62CB939A/62CF08F4" Ref="C8"  Part="1" 
F 0 "C8" H 4715 3246 50  0000 L CNN
F 1 "1u0 100V" H 4715 3155 50  0000 L CNN
F 2 "Capacitor_SMD:C_1206_3216Metric" H 4638 3050 50  0001 C CNN
F 3 "~" H 4600 3200 50  0001 C CNN
	1    4600 3200
	1    0    0    -1  
$EndComp
Connection ~ 4600 2850
Wire Wire Line
	4600 2850 4600 3050
$Comp
L Device:C C?
U 1 1 62CF08E4
P 4250 3350
AR Path="/62CF08E4" Ref="C?"  Part="1" 
AR Path="/62CB939A/62CF08E4" Ref="C9"  Part="1" 
F 0 "C9" H 4365 3396 50  0000 L CNN
F 1 "1u0" H 4365 3305 50  0000 L CNN
F 2 "Capacitor_SMD:C_0603_1608Metric" H 4288 3200 50  0001 C CNN
F 3 "~" H 4250 3350 50  0001 C CNN
	1    4250 3350
	1    0    0    -1  
$EndComp
$Comp
L Device:C C?
U 1 1 62CF08DE
P 2950 3450
AR Path="/62CF08DE" Ref="C?"  Part="1" 
AR Path="/62CB939A/62CF08DE" Ref="C10"  Part="1" 
F 0 "C10" H 3065 3496 50  0000 L CNN
F 1 "10u" H 3065 3405 50  0000 L CNN
F 2 "Capacitor_SMD:C_0805_2012Metric" H 2988 3300 50  0001 C CNN
F 3 "~" H 2950 3450 50  0001 C CNN
	1    2950 3450
	1    0    0    -1  
$EndComp
Wire Wire Line
	4050 3250 4050 3500
Wire Wire Line
	4050 3500 3300 3500
Wire Wire Line
	4600 3350 4600 3550
Wire Wire Line
	4250 3500 4250 3550
Wire Wire Line
	4050 3150 4250 3150
Wire Wire Line
	4250 3150 4250 3200
Wire Wire Line
	2950 3300 2950 3250
Wire Wire Line
	2950 3250 3300 3250
Connection ~ 3300 3250
Wire Wire Line
	3300 3500 3300 3250
Wire Wire Line
	3300 3250 3350 3250
$Comp
L power:GND #PWR?
U 1 1 62CF08CC
P 3150 2950
AR Path="/62CF08CC" Ref="#PWR?"  Part="1" 
AR Path="/62CB939A/62CF08CC" Ref="#PWR0121"  Part="1" 
F 0 "#PWR0121" H 3150 2700 50  0001 C CNN
F 1 "GND" H 3155 2777 50  0000 C CNN
F 2 "" H 3150 2950 50  0001 C CNN
F 3 "" H 3150 2950 50  0001 C CNN
	1    3150 2950
	1    0    0    -1  
$EndComp
Wire Wire Line
	3350 2950 3150 2950
$Comp
L Device:Ferrite_Bead FB?
U 1 1 62CF08AD
P 4600 2600
AR Path="/62CF08AD" Ref="FB?"  Part="1" 
AR Path="/62CB939A/62CF08AD" Ref="L6"  Part="1" 
F 0 "L6" H 4400 2500 50  0000 L CNN
F 1 "MFB-201209-0600PN" V 4450 2500 50  0001 L CNN
F 2 "Inductor_SMD:L_0805_2012Metric" V 4530 2600 50  0001 C CNN
F 3 "~" H 4600 2600 50  0001 C CNN
	1    4600 2600
	-1   0    0    1   
$EndComp
$Comp
L Device:Polyfuse F?
U 1 1 62CF08A7
P 4600 2200
AR Path="/62CF08A7" Ref="F?"  Part="1" 
AR Path="/62CB939A/62CF08A7" Ref="F1"  Part="1" 
F 0 "F1" H 4650 2250 50  0000 L CNN
F 1 "100mA" H 4650 2150 50  0000 L CNN
F 2 "myLibrary:Fuse_Bourns_MF-MSMF" H 4650 2000 50  0001 L CNN
F 3 "~" H 4600 2200 50  0001 C CNN
F 4 "MF-MSMF010" H 4600 2200 50  0001 C CNN "PartNumb"
	1    4600 2200
	1    0    0    -1  
$EndComp
Text Notes 3400 3750 0    50   ~ 0
3.3V always on
$Comp
L power:GND #PWR?
U 1 1 62CF0878
P 2950 3600
AR Path="/62CF0878" Ref="#PWR?"  Part="1" 
AR Path="/62CB939A/62CF0878" Ref="#PWR0117"  Part="1" 
F 0 "#PWR0117" H 2950 3350 50  0001 C CNN
F 1 "GND" H 2955 3427 50  0000 C CNN
F 2 "" H 2950 3600 50  0001 C CNN
F 3 "" H 2950 3600 50  0001 C CNN
	1    2950 3600
	1    0    0    -1  
$EndComp
Wire Wire Line
	4600 2850 4600 2750
Wire Wire Line
	4600 3550 4250 3550
Wire Wire Line
	4600 2350 4600 2450
Wire Wire Line
	4600 2050 4600 1900
Wire Wire Line
	5250 4950 5250 3850
Connection ~ 5250 1900
Wire Wire Line
	5250 1900 6550 1900
Connection ~ 5250 3850
Connection ~ 4600 1900
Wire Wire Line
	4600 1900 5250 1900
Wire Wire Line
	3350 1900 4600 1900
Wire Wire Line
	5250 1900 5250 3850
Connection ~ 7450 1900
Wire Wire Line
	7500 2750 7500 2950
Wire Wire Line
	7500 2950 7650 2950
$EndSCHEMATC
