EESchema Schematic File Version 4
EELAYER 30 0
EELAYER END
$Descr A4 11693 8268
encoding utf-8
Sheet 1 3
Title "REACH CONTROLLER"
Date "2022-05-25"
Rev "1.1"
Comp "University of Cambridge"
Comment1 "Cavendish Laboratory"
Comment2 "Astrophysics Group"
Comment3 ""
Comment4 ""
$EndDescr
$Comp
L Device:R R5
U 1 1 5D6FA7DC
P 2250 5150
F 0 "R5" H 2300 5200 50  0000 L CNN
F 1 "18k" H 2300 5100 50  0000 L CNN
F 2 "Resistor_SMD:R_0603_1608Metric" V 2180 5150 50  0001 C CNN
F 3 "~" H 2250 5150 50  0001 C CNN
	1    2250 5150
	1    0    0    -1  
$EndComp
$Comp
L Device:R R6
U 1 1 5D6FA7E2
P 2250 5550
F 0 "R6" H 2300 5600 50  0000 L CNN
F 1 "24k" H 2300 5500 50  0000 L CNN
F 2 "Resistor_SMD:R_0603_1608Metric" V 2180 5550 50  0001 C CNN
F 3 "~" H 2250 5550 50  0001 C CNN
	1    2250 5550
	1    0    0    -1  
$EndComp
$Comp
L Device:R R7
U 1 1 5D6FA7E8
P 1850 6100
F 0 "R7" H 1900 6150 50  0000 L CNN
F 1 "10k" H 1900 6050 50  0000 L CNN
F 2 "Resistor_SMD:R_0603_1608Metric" V 1780 6100 50  0001 C CNN
F 3 "~" H 1850 6100 50  0001 C CNN
	1    1850 6100
	1    0    0    -1  
$EndComp
$Comp
L Device:Q_PMOS_GSD T3
U 1 1 5D6FA7EF
P 2500 5350
F 0 "T3" H 2650 5500 50  0000 L CNN
F 1 "ZXMP6A13" H 2650 5600 50  0000 L CNN
F 2 "Package_TO_SOT_SMD:SOT-23" H 2700 5450 50  0001 C CNN
F 3 "~" H 2500 5350 50  0001 C CNN
F 4 "ZXMP6A13FTA" H 2500 5350 50  0001 C CNN "PartNumb"
	1    2500 5350
	1    0    0    1   
$EndComp
Wire Wire Line
	2250 5000 2250 4950
Wire Wire Line
	2600 5150 2600 4950
Wire Wire Line
	2250 5400 2250 5350
Connection ~ 2250 5350
Wire Wire Line
	2250 5350 2250 5300
Wire Wire Line
	2250 6100 2250 6300
Wire Wire Line
	2600 5550 2600 5750
Wire Wire Line
	2600 5750 3400 5750
Wire Wire Line
	2250 6300 1850 6300
Wire Wire Line
	1850 6300 1850 6250
Wire Wire Line
	2250 5350 2300 5350
$Comp
L Transistor_FET:2N7002 T4
U 1 1 5D6FA80D
P 2150 5900
F 0 "T4" H 1850 6150 50  0000 L CNN
F 1 "2N7002" H 1850 6050 50  0000 L CNN
F 2 "Package_TO_SOT_SMD:SOT-323_SC-70" H 2350 5825 50  0001 L CIN
F 3 "https://www.fairchildsemi.com/datasheets/2N/2N7002.pdf" H 2150 5900 50  0001 L CNN
	1    2150 5900
	1    0    0    -1  
$EndComp
Wire Wire Line
	2600 6350 2600 6300
Connection ~ 2250 6300
$Comp
L power:GND #PWR025
U 1 1 5EAC5850
P 2600 6350
F 0 "#PWR025" H 2600 6100 50  0001 C CNN
F 1 "GND" H 2605 6177 50  0000 C CNN
F 2 "" H 2600 6350 50  0001 C CNN
F 3 "" H 2600 6350 50  0001 C CNN
	1    2600 6350
	1    0    0    -1  
$EndComp
Wire Wire Line
	4200 3900 4050 3900
Wire Wire Line
	2600 5750 2600 5850
Connection ~ 2600 5750
Wire Wire Line
	2600 6150 2600 6300
Connection ~ 2600 6300
Wire Wire Line
	2600 6300 2250 6300
$Comp
L Device:R R8
U 1 1 5F826E9C
P 7600 4750
F 0 "R8" H 7650 4800 50  0000 L CNN
F 1 "9k1" H 7650 4700 50  0000 L CNN
F 2 "Resistor_SMD:R_0603_1608Metric" V 7530 4750 50  0001 C CNN
F 3 "~" H 7600 4750 50  0001 C CNN
	1    7600 4750
	1    0    0    -1  
$EndComp
$Comp
L Device:R R9
U 1 1 5F826EA2
P 7600 5150
F 0 "R9" H 7650 5200 50  0000 L CNN
F 1 "12k" H 7650 5100 50  0000 L CNN
F 2 "Resistor_SMD:R_0603_1608Metric" V 7530 5150 50  0001 C CNN
F 3 "~" H 7600 5150 50  0001 C CNN
	1    7600 5150
	1    0    0    -1  
$EndComp
$Comp
L Device:R R10
U 1 1 5F826EA8
P 7200 5700
F 0 "R10" H 7250 5750 50  0000 L CNN
F 1 "10k" H 7250 5650 50  0000 L CNN
F 2 "Resistor_SMD:R_0603_1608Metric" V 7130 5700 50  0001 C CNN
F 3 "~" H 7200 5700 50  0001 C CNN
	1    7200 5700
	1    0    0    -1  
$EndComp
$Comp
L Device:Q_PMOS_GSD T5
U 1 1 5F826EAF
P 7850 4950
F 0 "T5" H 8000 4600 50  0000 L CNN
F 1 "ZXMP6A" H 8000 4700 50  0000 L CNN
F 2 "Package_TO_SOT_SMD:SOT-23" H 8050 5050 50  0001 C CNN
F 3 "~" H 7850 4950 50  0001 C CNN
F 4 "ZXMP6A13FTA" H 7850 4950 50  0001 C CNN "PartNumb"
	1    7850 4950
	1    0    0    1   
$EndComp
Wire Wire Line
	7600 4600 7600 4550
Wire Wire Line
	7950 4750 7950 4550
Wire Wire Line
	7200 5900 7200 5850
Wire Wire Line
	7600 4550 7950 4550
Wire Wire Line
	7600 4900 7600 4950
Wire Wire Line
	7650 4950 7600 4950
Connection ~ 7600 4950
Wire Wire Line
	7600 4950 7600 5000
Wire Wire Line
	7600 5700 7600 5900
Connection ~ 7600 5900
Wire Wire Line
	7600 5900 7200 5900
Connection ~ 7950 5900
Wire Wire Line
	7950 5900 7600 5900
$Comp
L power:GND #PWR043
U 1 1 5F826ECA
P 7950 5900
F 0 "#PWR043" H 7950 5650 50  0001 C CNN
F 1 "GND" H 7955 5727 50  0000 C CNN
F 2 "" H 7950 5900 50  0001 C CNN
F 3 "" H 7950 5900 50  0001 C CNN
	1    7950 5900
	1    0    0    -1  
$EndComp
Connection ~ 7950 5300
Wire Wire Line
	8100 5300 7950 5300
Wire Wire Line
	7950 5150 7950 5300
Wire Wire Line
	7950 5750 7950 5900
Wire Wire Line
	7950 5300 7950 5450
$Comp
L Transistor_FET:2N7002 T6
U 1 1 5F826EBA
P 7500 5500
F 0 "T6" H 7200 5750 50  0000 L CNN
F 1 "2N7002" H 7200 5650 50  0000 L CNN
F 2 "Package_TO_SOT_SMD:SOT-323_SC-70" H 7700 5425 50  0001 L CIN
F 3 "https://www.fairchildsemi.com/datasheets/2N/2N7002.pdf" H 7500 5500 50  0001 L CNN
	1    7500 5500
	1    0    0    -1  
$EndComp
Wire Wire Line
	2250 4950 2600 4950
$Comp
L power:+3.3V #PWR07
U 1 1 5E11296B
P 6650 5050
F 0 "#PWR07" H 6650 4900 50  0001 C CNN
F 1 "+3.3V" H 6665 5223 50  0000 C CNN
F 2 "" H 6650 5050 50  0001 C CNN
F 3 "" H 6650 5050 50  0001 C CNN
	1    6650 5050
	1    0    0    -1  
$EndComp
$Comp
L power:GND #PWR016
U 1 1 5E17554A
P 3800 4200
F 0 "#PWR016" H 3800 3950 50  0001 C CNN
F 1 "GND" H 3805 4027 50  0000 C CNN
F 2 "" H 3800 4200 50  0001 C CNN
F 3 "" H 3800 4200 50  0001 C CNN
	1    3800 4200
	1    0    0    -1  
$EndComp
Wire Wire Line
	3800 4200 4200 4200
$Comp
L power:GND #PWR023
U 1 1 5E1AC040
P 3900 5300
F 0 "#PWR023" H 3900 5050 50  0001 C CNN
F 1 "GND" H 3905 5127 50  0000 C CNN
F 2 "" H 3900 5300 50  0001 C CNN
F 3 "" H 3900 5300 50  0001 C CNN
	1    3900 5300
	1    0    0    -1  
$EndComp
Wire Wire Line
	3900 5300 3900 5250
Wire Wire Line
	3900 5250 4050 5250
$Comp
L power:GND #PWR020
U 1 1 5E1E1C2F
P 6450 4800
F 0 "#PWR020" H 6450 4550 50  0001 C CNN
F 1 "GND" H 6455 4627 50  0000 C CNN
F 2 "" H 6450 4800 50  0001 C CNN
F 3 "" H 6450 4800 50  0001 C CNN
	1    6450 4800
	1    0    0    -1  
$EndComp
Wire Wire Line
	6450 4800 6300 4800
Wire Wire Line
	6300 4800 6300 5000
Wire Wire Line
	6300 5000 6200 5000
$Comp
L power:GND #PWR015
U 1 1 5E216DDD
P 6450 4150
F 0 "#PWR015" H 6450 3900 50  0001 C CNN
F 1 "GND" H 6455 3977 50  0000 C CNN
F 2 "" H 6450 4150 50  0001 C CNN
F 3 "" H 6450 4150 50  0001 C CNN
	1    6450 4150
	1    0    0    -1  
$EndComp
Wire Wire Line
	6450 4150 6450 4100
Wire Wire Line
	6450 4000 6200 4000
Wire Wire Line
	6200 4100 6450 4100
Connection ~ 6450 4100
Wire Wire Line
	6450 4100 6450 4000
$Comp
L power:GND #PWR08
U 1 1 5E280435
P 6500 2800
F 0 "#PWR08" H 6500 2550 50  0001 C CNN
F 1 "GND" H 6505 2627 50  0000 C CNN
F 2 "" H 6500 2800 50  0001 C CNN
F 3 "" H 6500 2800 50  0001 C CNN
	1    6500 2800
	1    0    0    -1  
$EndComp
Wire Wire Line
	6500 2800 6200 2800
$Comp
L power:GND #PWR02
U 1 1 5E2B69CB
P 4000 1400
F 0 "#PWR02" H 4000 1150 50  0001 C CNN
F 1 "GND" H 4005 1227 50  0000 C CNN
F 2 "" H 4000 1400 50  0001 C CNN
F 3 "" H 4000 1400 50  0001 C CNN
	1    4000 1400
	1    0    0    -1  
$EndComp
NoConn ~ 4200 4000
NoConn ~ 4200 4300
NoConn ~ 4200 4400
NoConn ~ 4200 5100
NoConn ~ 4200 5200
NoConn ~ 4200 5300
NoConn ~ 4200 5500
NoConn ~ 6200 4800
NoConn ~ 6200 4700
NoConn ~ 6200 4600
NoConn ~ 6200 4500
NoConn ~ 6200 4300
NoConn ~ 6200 4200
NoConn ~ 6200 3900
NoConn ~ 6200 3800
NoConn ~ 6200 3700
NoConn ~ 6200 3600
NoConn ~ 6200 3500
NoConn ~ 6200 3400
NoConn ~ 6200 3300
NoConn ~ 6200 3200
NoConn ~ 6200 3100
NoConn ~ 6200 3000
NoConn ~ 6200 2900
NoConn ~ 6200 2600
NoConn ~ 6200 2500
NoConn ~ 6200 2400
NoConn ~ 6200 2300
NoConn ~ 6200 2200
NoConn ~ 6200 2100
NoConn ~ 6200 2000
NoConn ~ 6200 1900
NoConn ~ 6200 1800
NoConn ~ 6200 1700
NoConn ~ 6200 1600
$Comp
L Device:D_Schottky D3
U 1 1 5F50B17E
P 2600 6000
F 0 "D3" V 2550 6100 50  0000 L CNN
F 1 "PMEG6010" V 2650 6100 50  0000 L CNN
F 2 "Diode_SMD:D_SOD-323" H 2600 6000 50  0001 C CNN
F 3 "~" H 2600 6000 50  0001 C CNN
F 4 "PMEG6010CEJ" V 2600 6000 50  0001 C CNN "PartNumb"
	1    2600 6000
	0    1    1    0   
$EndComp
Text Label 3750 3100 0    50   ~ 0
MS1-1
Entry Wire Line
	2700 2400 2600 2500
Entry Wire Line
	2700 2500 2600 2600
Entry Wire Line
	2700 2600 2600 2700
Entry Wire Line
	2700 2700 2600 2800
Entry Wire Line
	2700 2800 2600 2900
Entry Wire Line
	2700 2900 2600 3000
Entry Wire Line
	2700 3000 2600 3100
Entry Wire Line
	2700 3100 2600 3200
Text Label 3750 3200 0    50   ~ 0
MS1-2
Text Label 3750 3300 0    50   ~ 0
MS1-3
Text Label 3750 3400 0    50   ~ 0
MS1-4
Text Label 3750 3500 0    50   ~ 0
MS1-5
Text Label 3750 3600 0    50   ~ 0
MS1-6
Text Label 3750 3700 0    50   ~ 0
MS1-7
Text Label 3750 3800 0    50   ~ 0
MS1-8
Wire Wire Line
	2600 2500 2300 2500
Wire Wire Line
	2600 2600 2300 2600
Wire Wire Line
	2300 2700 2600 2700
Wire Wire Line
	2600 2800 2300 2800
Wire Wire Line
	2600 2900 2300 2900
Wire Wire Line
	2600 3000 2300 3000
Wire Wire Line
	2600 3100 2300 3100
Wire Wire Line
	2300 3200 2600 3200
Wire Wire Line
	1750 2400 1800 2400
Wire Wire Line
	2400 2400 2300 2400
$Comp
L power:+3V3 #PWR0106
U 1 1 61328976
P 1550 2450
F 0 "#PWR0106" H 1550 2300 50  0001 C CNN
F 1 "+3V3" H 1565 2623 50  0000 C CNN
F 2 "" H 1550 2450 50  0001 C CNN
F 3 "" H 1550 2450 50  0001 C CNN
	1    1550 2450
	1    0    0    -1  
$EndComp
Wire Wire Line
	1550 2450 1550 2500
Text Label 3750 4500 0    50   ~ 0
MS2-1
Text Label 3750 4600 0    50   ~ 0
MS2-2
Text Label 3750 4700 0    50   ~ 0
MS2-3
Text Label 3750 4800 0    50   ~ 0
MS2-4
Text Label 3750 4900 0    50   ~ 0
MS2-5
Text Label 3750 5000 0    50   ~ 0
MS2-6
Entry Wire Line
	2700 3200 2600 3300
Entry Wire Line
	2700 3300 2600 3400
Entry Wire Line
	2700 3400 2600 3500
Entry Wire Line
	2700 3500 2600 3600
Entry Wire Line
	2700 3600 2600 3700
Entry Wire Line
	2700 3700 2600 3800
Wire Wire Line
	2600 3300 2300 3300
Wire Wire Line
	2600 3400 2300 3400
Wire Wire Line
	2600 3500 2300 3500
Wire Wire Line
	2600 3700 2300 3700
Wire Wire Line
	2600 3800 2300 3800
Wire Wire Line
	2600 3600 2300 3600
Text Label 2300 3300 0    50   ~ 0
MS2-1
Text Label 2300 3400 0    50   ~ 0
MS2-2
Text Label 2300 3500 0    50   ~ 0
MS2-3
Text Label 2300 3600 0    50   ~ 0
MS2-4
Text Label 2300 3700 0    50   ~ 0
MS2-5
Text Label 2300 3800 0    50   ~ 0
MS2-6
Text Label 2300 2500 0    50   ~ 0
MS1-1
Text Label 2300 2600 0    50   ~ 0
MS1-2
Text Label 2300 2700 0    50   ~ 0
MS1-3
Text Label 2300 2800 0    50   ~ 0
MS1-4
Text Label 2300 2900 0    50   ~ 0
MS1-5
Text Label 2300 3000 0    50   ~ 0
MS1-6
Text Label 2300 3100 0    50   ~ 0
MS1-7
Text Label 2300 3200 0    50   ~ 0
MS1-8
Wire Wire Line
	1800 2500 1550 2500
Wire Wire Line
	4050 5250 4050 5400
Wire Wire Line
	4050 5400 4200 5400
Entry Wire Line
	2700 3800 2600 3900
Entry Wire Line
	2700 3900 2600 4000
Entry Wire Line
	2700 4000 2600 4100
Entry Wire Line
	2700 4100 2600 4200
Wire Wire Line
	2600 3900 2300 3900
Wire Wire Line
	2300 4000 2600 4000
Wire Wire Line
	2600 4100 2300 4100
Wire Wire Line
	2600 4200 2300 4200
Text Label 2300 3900 0    50   ~ 0
MS3-1
Text Label 2300 4000 0    50   ~ 0
MS3-2
Text Label 2300 4100 0    50   ~ 0
MS3-3
Text Label 2300 4200 0    50   ~ 0
MS3-4
Text Label 3750 5600 0    50   ~ 0
MS3-1
Text Label 3750 5700 0    50   ~ 0
MS3-2
Text Label 3750 5800 0    50   ~ 0
MS3-3
Wire Wire Line
	3600 5800 4200 5800
Wire Wire Line
	3600 5700 4200 5700
Wire Wire Line
	3600 5600 4200 5600
Wire Wire Line
	4200 5000 3600 5000
Wire Wire Line
	3600 4900 4200 4900
Wire Wire Line
	3600 4800 4200 4800
Wire Wire Line
	3600 4700 4200 4700
Wire Wire Line
	3600 4600 4200 4600
Wire Wire Line
	3600 4500 4200 4500
Wire Wire Line
	3600 3800 4200 3800
Wire Wire Line
	3600 3700 4200 3700
Wire Wire Line
	3600 3600 4200 3600
Wire Wire Line
	4200 3500 3600 3500
Wire Wire Line
	3600 3400 4200 3400
Wire Wire Line
	3600 3300 4200 3300
Wire Wire Line
	4200 3200 3600 3200
Wire Wire Line
	3600 3100 4200 3100
Entry Wire Line
	3500 5700 3600 5800
Entry Wire Line
	3500 5600 3600 5700
Entry Wire Line
	3500 5500 3600 5600
Entry Wire Line
	3500 4900 3600 5000
Entry Wire Line
	3500 4800 3600 4900
Entry Wire Line
	3500 4700 3600 4800
Entry Wire Line
	3500 4600 3600 4700
Entry Wire Line
	3500 4500 3600 4600
Entry Wire Line
	3500 4400 3600 4500
Entry Wire Line
	3500 3700 3600 3800
Entry Wire Line
	3500 3600 3600 3700
Entry Wire Line
	3500 3500 3600 3600
Entry Wire Line
	3500 3400 3600 3500
Entry Wire Line
	3500 3300 3600 3400
Entry Wire Line
	3500 3200 3600 3300
Entry Wire Line
	3500 3100 3600 3200
Entry Wire Line
	3500 3000 3600 3100
Entry Wire Line
	3500 2750 3600 2850
Entry Wire Line
	3500 2650 3600 2750
Entry Wire Line
	3500 2550 3600 2650
Entry Wire Line
	3500 2450 3600 2550
Wire Wire Line
	3600 2850 3950 2850
Wire Wire Line
	3950 2850 3950 2900
Wire Wire Line
	3950 2900 4200 2900
Wire Wire Line
	3600 2750 4000 2750
Wire Wire Line
	4000 2750 4000 2800
Wire Wire Line
	4000 2800 4200 2800
Wire Wire Line
	3600 2650 4050 2650
Wire Wire Line
	4050 2650 4050 2700
Wire Wire Line
	4050 2700 4200 2700
Wire Wire Line
	3600 2550 4100 2550
Wire Wire Line
	4100 2550 4100 2600
Wire Wire Line
	4100 2600 4200 2600
Text Label 3700 2550 0    50   ~ 0
MS4-1
Text Label 3700 2650 0    50   ~ 0
MS4-2
Text Label 3700 2750 0    50   ~ 0
MS4-3
Text Label 3700 2850 0    50   ~ 0
MS4-4
Wire Bus Line
	3500 1500 3400 1400
Entry Wire Line
	3400 5750 3500 5650
Wire Wire Line
	1950 5900 1850 5900
Connection ~ 1850 5900
Wire Wire Line
	1850 5900 1850 5950
Text Label 3150 5750 0    50   ~ 0
MSX-1
Text Label 2300 4300 0    50   ~ 0
MSX-1
Wire Bus Line
	1400 4600 1300 4500
Wire Bus Line
	2700 4500 2600 4600
Wire Bus Line
	1400 4600 2600 4600
Entry Wire Line
	1400 4000 1300 4100
Entry Wire Line
	1400 4100 1300 4200
Entry Wire Line
	1400 4200 1300 4300
Wire Wire Line
	1400 3900 1800 3900
Wire Wire Line
	1800 4000 1400 4000
Wire Wire Line
	1400 4100 1800 4100
Wire Wire Line
	1800 4200 1400 4200
Text Label 1400 3900 0    50   ~ 0
MS4-1
Text Label 1400 4000 0    50   ~ 0
MS4-2
Text Label 1400 4100 0    50   ~ 0
MS4-3
Text Label 1400 4200 0    50   ~ 0
MS4-4
Entry Wire Line
	2700 4200 2600 4300
Wire Wire Line
	2600 4300 2300 4300
Wire Wire Line
	7300 5500 7200 5500
Connection ~ 7200 5500
Wire Wire Line
	7200 5500 7200 5550
$Comp
L power:+24V #PWR0107
U 1 1 629C2C81
P 8400 4500
F 0 "#PWR0107" H 8400 4350 50  0001 C CNN
F 1 "+24V" H 8415 4673 50  0000 C CNN
F 2 "" H 8400 4500 50  0001 C CNN
F 3 "" H 8400 4500 50  0001 C CNN
	1    8400 4500
	1    0    0    -1  
$EndComp
Wire Wire Line
	8400 4550 7950 4550
Connection ~ 7950 4550
$Comp
L Mechanical:MountingHole H1
U 1 1 62C82266
P 900 7200
F 0 "H1" H 1000 7246 50  0001 L CNN
F 1 "M2.5" H 1000 7155 50  0000 L CNN
F 2 "MountingHole:MountingHole_2.7mm_M2.5" H 900 7200 50  0001 C CNN
F 3 "~" H 900 7200 50  0001 C CNN
	1    900  7200
	1    0    0    -1  
$EndComp
$Comp
L Mechanical:MountingHole H2
U 1 1 62C83FDF
P 1500 7200
F 0 "H2" H 1600 7246 50  0001 L CNN
F 1 "M2.5" H 1600 7155 50  0000 L CNN
F 2 "MountingHole:MountingHole_2.7mm_M2.5" H 1500 7200 50  0001 C CNN
F 3 "~" H 1500 7200 50  0001 C CNN
	1    1500 7200
	1    0    0    -1  
$EndComp
$Comp
L Mechanical:MountingHole H4
U 1 1 62C84721
P 900 7500
F 0 "H4" H 1000 7546 50  0000 L CNN
F 1 "M2.5" H 1000 7455 50  0001 L CNN
F 2 "MountingHole:MountingHole_2.7mm_M2.5" H 900 7500 50  0001 C CNN
F 3 "~" H 900 7500 50  0001 C CNN
	1    900  7500
	1    0    0    -1  
$EndComp
$Comp
L Mechanical:MountingHole H3
U 1 1 62C852D7
P 1500 7500
F 0 "H3" H 1600 7546 50  0001 L CNN
F 1 "M2.5" H 1600 7455 50  0000 L CNN
F 2 "MountingHole:MountingHole_2.7mm_M2.5" H 1500 7500 50  0001 C CNN
F 3 "~" H 1500 7500 50  0001 C CNN
	1    1500 7500
	1    0    0    -1  
$EndComp
Wire Wire Line
	1750 2150 1100 2150
Wire Wire Line
	1100 2100 1100 2150
Connection ~ 1100 2150
Wire Wire Line
	1100 2150 1100 2200
Wire Wire Line
	2400 2150 3000 2150
$Comp
L power:+12V #PWR0105
U 1 1 6116AF9A
P 1100 1800
F 0 "#PWR0105" H 1100 1650 50  0001 C CNN
F 1 "+12V" H 1115 1973 50  0000 C CNN
F 2 "" H 1100 1800 50  0001 C CNN
F 3 "" H 1100 1800 50  0001 C CNN
	1    1100 1800
	1    0    0    -1  
$EndComp
$Comp
L power:GND #PWR0104
U 1 1 6113913D
P 1100 2500
F 0 "#PWR0104" H 1100 2250 50  0001 C CNN
F 1 "GND" H 1105 2327 50  0000 C CNN
F 2 "" H 1100 2500 50  0001 C CNN
F 3 "" H 1100 2500 50  0001 C CNN
	1    1100 2500
	1    0    0    -1  
$EndComp
$Comp
L Device:C C12
U 1 1 61139137
P 1100 2350
F 0 "C12" H 1215 2396 50  0000 L CNN
F 1 "10u" H 1215 2305 50  0000 L CNN
F 2 "Capacitor_SMD:C_1206_3216Metric" H 1138 2200 50  0001 C CNN
F 3 "~" H 1100 2350 50  0001 C CNN
	1    1100 2350
	1    0    0    -1  
$EndComp
$Comp
L Device:Polyfuse F3
U 1 1 61139131
P 1100 1950
F 0 "F3" H 1188 1996 50  0000 L CNN
F 1 "750mA" H 1188 1905 50  0000 L CNN
F 2 "myLibrary:Fuse_Bourns_MF-MSMF" H 1150 1750 50  0001 L CNN
F 3 "~" H 1100 1950 50  0001 C CNN
F 4 "MF-MSMF075/24" H 1100 1950 50  0001 C CNN "PartNumb"
	1    1100 1950
	1    0    0    -1  
$EndComp
$Comp
L power:GND #PWR029
U 1 1 5FCB2A16
P 3000 2500
F 0 "#PWR029" H 3000 2250 50  0001 C CNN
F 1 "GND" H 3005 2327 50  0000 C CNN
F 2 "" H 3000 2500 50  0001 C CNN
F 3 "" H 3000 2500 50  0001 C CNN
	1    3000 2500
	1    0    0    -1  
$EndComp
Wire Wire Line
	3000 2150 3000 2200
Connection ~ 3000 2150
Wire Wire Line
	3000 2100 3000 2150
$Comp
L Device:C C13
U 1 1 5FCB2A0C
P 3000 2350
F 0 "C13" H 3115 2396 50  0000 L CNN
F 1 "10u" H 3115 2305 50  0000 L CNN
F 2 "Capacitor_SMD:C_1206_3216Metric" H 3038 2200 50  0001 C CNN
F 3 "~" H 3000 2350 50  0001 C CNN
	1    3000 2350
	1    0    0    -1  
$EndComp
$Comp
L Device:Polyfuse F4
U 1 1 5FCB2A00
P 3000 1950
F 0 "F4" H 3088 1996 50  0000 L CNN
F 1 "750mA" H 3088 1905 50  0000 L CNN
F 2 "myLibrary:Fuse_Bourns_MF-MSMF" H 3050 1750 50  0001 L CNN
F 3 "~" H 3000 1950 50  0001 C CNN
F 4 "MF-MSMF075/24" H 3000 1950 50  0001 C CNN "PartNumb"
	1    3000 1950
	1    0    0    -1  
$EndComp
$Comp
L power:+24V #PWR027
U 1 1 5F826EDC
P 3000 1800
F 0 "#PWR027" H 3000 1650 50  0001 C CNN
F 1 "+24V" H 3015 1973 50  0000 C CNN
F 2 "" H 3000 1800 50  0001 C CNN
F 3 "" H 3000 1800 50  0001 C CNN
	1    3000 1800
	1    0    0    -1  
$EndComp
Wire Wire Line
	2400 2150 2400 2400
Wire Wire Line
	1750 2150 1750 2400
Wire Bus Line
	2800 1400 2700 1500
Wire Bus Line
	3400 1400 2800 1400
Entry Wire Line
	1300 3300 1400 3200
Wire Wire Line
	1700 2600 1800 2600
Connection ~ 1700 4300
Wire Wire Line
	1700 4300 1800 4300
$Comp
L power:GND #PWR0101
U 1 1 60817917
P 1700 4300
F 0 "#PWR0101" H 1700 4050 50  0001 C CNN
F 1 "GND" H 1705 4127 50  0000 C CNN
F 2 "" H 1700 4300 50  0001 C CNN
F 3 "" H 1700 4300 50  0001 C CNN
	1    1700 4300
	1    0    0    -1  
$EndComp
Wire Wire Line
	1700 4300 1700 2900
Wire Bus Line
	3600 6200 6600 6200
Entry Wire Line
	6600 5600 6700 5700
Entry Wire Line
	6600 5700 6700 5800
Wire Wire Line
	6600 5700 6200 5700
Wire Wire Line
	6600 5600 6200 5600
Text Label 6350 5600 0    50   ~ 0
SCL0
Text Label 6350 5700 0    50   ~ 0
SDA0
Wire Bus Line
	6700 6100 6600 6200
Wire Bus Line
	3500 6100 3600 6200
Entry Wire Line
	6600 5800 6700 5900
Wire Wire Line
	6600 5800 6200 5800
Text Label 6350 5800 0    50   ~ 0
MS3-4
$Comp
L power:GND #PWR024
U 1 1 6035C975
P 2950 5300
F 0 "#PWR024" H 2950 5050 50  0001 C CNN
F 1 "GND" H 2955 5127 50  0000 C CNN
F 2 "" H 2950 5300 50  0001 C CNN
F 3 "" H 2950 5300 50  0001 C CNN
	1    2950 5300
	1    0    0    -1  
$EndComp
$Comp
L power:+24V #PWR019
U 1 1 6035C95F
P 2950 4600
F 0 "#PWR019" H 2950 4450 50  0001 C CNN
F 1 "+24V" H 2965 4773 50  0000 C CNN
F 2 "" H 2950 4600 50  0001 C CNN
F 3 "" H 2950 4600 50  0001 C CNN
	1    2950 4600
	1    0    0    -1  
$EndComp
Connection ~ 2600 4950
Wire Wire Line
	2600 4950 2950 4950
Wire Wire Line
	2950 4950 2950 5000
Connection ~ 2950 4950
Wire Wire Line
	2950 4900 2950 4950
$Comp
L Device:C C11
U 1 1 6035C96B
P 2950 5150
F 0 "C11" H 3065 5196 50  0000 L CNN
F 1 "10u" H 3065 5105 50  0000 L CNN
F 2 "Capacitor_SMD:C_1206_3216Metric" H 2988 5000 50  0001 C CNN
F 3 "~" H 2950 5150 50  0001 C CNN
	1    2950 5150
	1    0    0    -1  
$EndComp
$Comp
L Device:Polyfuse F2
U 1 1 6035C965
P 2950 4750
F 0 "F2" H 3000 4850 50  0000 L CNN
F 1 "300mA" H 3000 4750 50  0000 L CNN
F 2 "myLibrary:Fuse_Bourns_MF-MSMF" H 3000 4550 50  0001 L CNN
F 3 "~" H 2950 4750 50  0001 C CNN
F 4 "MF-MSMF030" H 2950 4750 50  0001 C CNN "PartNumb"
	1    2950 4750
	1    0    0    -1  
$EndComp
Text GLabel 4050 3900 0    50   Output ~ 0
MSX_EN
Text GLabel 1750 5900 0    50   Input ~ 0
MSX_EN
Wire Wire Line
	1850 5900 1750 5900
Text GLabel 6350 5200 2    50   Output ~ 0
24V_EN
Text GLabel 6350 5300 2    50   Output ~ 0
12V_EN
Wire Wire Line
	6200 5200 6350 5200
Wire Wire Line
	6350 5300 6200 5300
Entry Wire Line
	1300 3400 1400 3300
Wire Wire Line
	1400 3200 1800 3200
Wire Wire Line
	1400 3300 1800 3300
Text Label 1400 3200 0    50   ~ 0
SCL0
Text Label 1400 3300 0    50   ~ 0
SDA0
Text GLabel 6350 5400 2    50   Output ~ 0
5V_EN
Wire Wire Line
	6350 5400 6200 5400
Text Notes 1700 5450 0    50   ~ 0
Mechanical\nTransfer\nSwitch\n(MSX)
$Comp
L Device:CP C14
U 1 1 60F11A77
P 7950 5600
F 0 "C14" H 8068 5646 50  0000 L CNN
F 1 "47u 35V" H 8068 5555 50  0000 L CNN
F 2 "Capacitor_SMD:CP_Elec_5x5.9" H 7988 5450 50  0001 C CNN
F 3 "~" H 7950 5600 50  0001 C CNN
	1    7950 5600
	1    0    0    -1  
$EndComp
Text GLabel 8100 5300 2    50   Output ~ 0
INT_FAN
Wire Wire Line
	6200 5500 7200 5500
Text GLabel 1550 2700 0    50   Input ~ 0
+6V_A
Text GLabel 1550 2800 0    50   Input ~ 0
+6V_B
Wire Wire Line
	1800 2900 1700 2900
Connection ~ 1700 2900
Wire Wire Line
	1700 2900 1700 2600
Wire Wire Line
	1550 2800 1800 2800
Text GLabel 1300 3000 0    50   Input ~ 0
INT_FAN
Text Notes 7200 4900 0    50   ~ 0
Internal\nFan
$Comp
L Device:Ferrite_Bead L15
U 1 1 610D67FB
P 10300 5400
AR Path="/610D67FB" Ref="L15"  Part="1" 
AR Path="/62CB939A/610D67FB" Ref="FB?"  Part="1" 
AR Path="/62CB50CE/610D67FB" Ref="FB?"  Part="1" 
F 0 "L15" V 10100 5350 50  0000 L CNN
F 1 "MFB-201209-0600PN" V 10150 5300 50  0001 L CNN
F 2 "Inductor_SMD:L_0805_2012Metric" V 10230 5400 50  0001 C CNN
F 3 "~" H 10300 5400 50  0001 C CNN
	1    10300 5400
	0    1    1    0   
$EndComp
$Comp
L Device:C C15
U 1 1 610D6804
P 10050 5650
AR Path="/610D6804" Ref="C15"  Part="1" 
AR Path="/62CB939A/610D6804" Ref="C?"  Part="1" 
AR Path="/62CB50CE/610D6804" Ref="C?"  Part="1" 
F 0 "C15" H 10165 5696 50  0000 L CNN
F 1 "3u3" H 10165 5605 50  0000 L CNN
F 2 "Capacitor_SMD:C_1206_3216Metric" H 10088 5500 50  0001 C CNN
F 3 "" H 10050 5650 50  0001 C CNN
F 4 "445-15454-1-ND" H 10050 5650 50  0001 C CNN "DigiKey_Part_Number"
F 5 "TDK Corporation " H 10050 5650 50  0001 C CNN "Manufacturer"
F 6 "C3216X7S2A335K160AB" H 10050 5650 50  0001 C CNN "Manufacturer_Part_Number"
	1    10050 5650
	1    0    0    -1  
$EndComp
Connection ~ 10050 5900
Wire Wire Line
	10050 5400 10050 5500
Connection ~ 10050 5400
Wire Wire Line
	9050 5900 9050 5850
Wire Wire Line
	9400 5700 9400 5900
Wire Wire Line
	9700 4950 9400 4950
Wire Wire Line
	9400 4950 9400 4900
Connection ~ 9400 4950
Wire Wire Line
	9400 5000 9400 4950
Wire Wire Line
	9400 4600 9400 4550
$Comp
L Device:R R12
U 1 1 610D6816
P 9400 5150
AR Path="/610D6816" Ref="R12"  Part="1" 
AR Path="/62CB50CE/610D6816" Ref="R?"  Part="1" 
F 0 "R12" H 9450 5200 50  0000 L CNN
F 1 "18k" H 9450 5100 50  0000 L CNN
F 2 "Resistor_SMD:R_0603_1608Metric" V 9330 5150 50  0001 C CNN
F 3 "~" H 9400 5150 50  0001 C CNN
	1    9400 5150
	1    0    0    -1  
$EndComp
$Comp
L Device:R R11
U 1 1 610D681C
P 9400 4750
AR Path="/610D681C" Ref="R11"  Part="1" 
AR Path="/62CB50CE/610D681C" Ref="R?"  Part="1" 
F 0 "R11" H 9450 4800 50  0000 L CNN
F 1 "9k1" H 9450 4700 50  0000 L CNN
F 2 "Resistor_SMD:R_0603_1608Metric" V 9330 4750 50  0001 C CNN
F 3 "~" H 9400 4750 50  0001 C CNN
	1    9400 4750
	1    0    0    -1  
$EndComp
$Comp
L Device:R R13
U 1 1 610D6822
P 9050 5700
AR Path="/610D6822" Ref="R13"  Part="1" 
AR Path="/62CB50CE/610D6822" Ref="R?"  Part="1" 
F 0 "R13" H 9100 5750 50  0000 L CNN
F 1 "10k" H 9100 5650 50  0000 L CNN
F 2 "Resistor_SMD:R_0603_1608Metric" V 8980 5700 50  0001 C CNN
F 3 "~" H 9050 5700 50  0001 C CNN
	1    9050 5700
	1    0    0    -1  
$EndComp
$Comp
L Transistor_FET:2N7002 T8
U 1 1 610D6828
P 9300 5500
AR Path="/610D6828" Ref="T8"  Part="1" 
AR Path="/62CB50CE/610D6828" Ref="T?"  Part="1" 
F 0 "T8" H 9500 5550 50  0000 L CNN
F 1 "2N7002" H 9500 5450 50  0000 L CNN
F 2 "Package_TO_SOT_SMD:SOT-323_SC-70" H 9500 5425 50  0001 L CIN
F 3 "https://www.fairchildsemi.com/datasheets/2N/2N7002.pdf" H 9300 5500 50  0001 L CNN
	1    9300 5500
	1    0    0    -1  
$EndComp
Wire Wire Line
	9100 5500 9050 5500
Connection ~ 9400 5900
Wire Wire Line
	9050 5500 9050 5550
Connection ~ 9700 4950
Connection ~ 9700 4550
Connection ~ 10050 4550
Wire Wire Line
	10050 4500 10050 4550
$Comp
L power:GND #PWR0102
U 1 1 610D6836
P 10050 5950
AR Path="/610D6836" Ref="#PWR0102"  Part="1" 
AR Path="/62CB50CE/610D6836" Ref="#PWR?"  Part="1" 
F 0 "#PWR0102" H 10050 5700 50  0001 C CNN
F 1 "GND" H 10055 5777 50  0000 C CNN
F 2 "" H 10050 5950 50  0001 C CNN
F 3 "" H 10050 5950 50  0001 C CNN
	1    10050 5950
	1    0    0    -1  
$EndComp
Wire Wire Line
	10050 5900 10050 5800
$Comp
L Device:D_Zener D2
U 1 1 610D683E
P 9700 4750
AR Path="/610D683E" Ref="D2"  Part="1" 
AR Path="/62CB50CE/610D683E" Ref="D?"  Part="1" 
F 0 "D2" V 9654 4829 50  0000 L CNN
F 1 "10V" V 9745 4829 50  0000 L CNN
F 2 "Diode_SMD:D_SOD-323" H 9700 4750 50  0001 C CNN
F 3 "~" H 9700 4750 50  0001 C CNN
F 4 "MM3Z10VST1G" V 9700 4750 50  0001 C CNN "PartNumber"
	1    9700 4750
	0    1    1    0   
$EndComp
$Comp
L Device:Q_PMOS_GSD T7
U 1 1 610D6845
P 9950 4950
AR Path="/610D6845" Ref="T7"  Part="1" 
AR Path="/62CB50CE/610D6845" Ref="T?"  Part="1" 
F 0 "T7" H 10150 4800 50  0000 L CNN
F 1 "ZXMP6A13" H 10150 4900 50  0000 L CNN
F 2 "Package_TO_SOT_SMD:SOT-23" H 10150 5050 50  0001 C CNN
F 3 "~" H 9950 4950 50  0001 C CNN
F 4 "ZXMP6A13FTA" H 9950 4950 50  0001 C CNN "PartNumb"
	1    9950 4950
	1    0    0    1   
$EndComp
Wire Wire Line
	10050 4750 10050 4550
Wire Wire Line
	9700 4550 9700 4600
Wire Wire Line
	9700 4900 9700 4950
Wire Wire Line
	10050 5150 10050 5400
Wire Wire Line
	10050 5950 10050 5900
Wire Wire Line
	10050 5400 10150 5400
Wire Wire Line
	8950 5500 9050 5500
Connection ~ 9050 5500
Wire Wire Line
	9750 4950 9700 4950
Wire Wire Line
	9400 5900 10050 5900
Wire Wire Line
	9700 4550 10050 4550
Wire Wire Line
	9050 5900 9400 5900
Text GLabel 3950 2300 0    50   Output ~ 0
NS_EN
Text GLabel 8950 5500 0    50   Input ~ 0
NS_EN
Text GLabel 10500 5400 2    50   Output ~ 0
NS_PWR
Wire Wire Line
	10500 5400 10450 5400
Text GLabel 1300 3100 0    50   Input ~ 0
NS_PWR
Wire Wire Line
	3700 3000 4200 3000
Wire Wire Line
	4100 4100 4200 4100
Wire Wire Line
	4100 4150 4100 4100
Wire Wire Line
	3800 4150 4100 4150
$Comp
L power:+3.3V #PWR014
U 1 1 5E11088D
P 3800 4150
F 0 "#PWR014" H 3800 4000 50  0001 C CNN
F 1 "+3.3V" H 3950 4200 50  0000 C CNN
F 2 "" H 3800 4150 50  0001 C CNN
F 3 "" H 3800 4150 50  0001 C CNN
	1    3800 4150
	1    0    0    -1  
$EndComp
$Comp
L power:+3.3V #PWR09
U 1 1 5E2EC4FE
P 3700 3000
F 0 "#PWR09" H 3700 2850 50  0001 C CNN
F 1 "+3.3V" H 3850 3050 50  0000 C CNN
F 2 "" H 3700 3000 50  0001 C CNN
F 3 "" H 3700 3000 50  0001 C CNN
	1    3700 3000
	1    0    0    -1  
$EndComp
NoConn ~ 6200 4900
Text GLabel 3950 2200 0    50   Output ~ 0
6V_EN
$Comp
L teensy:Teensy3.5 U1
U 1 1 5D57A89F
P 5200 3700
F 0 "U1" H 5200 6087 60  0000 C CNN
F 1 "Teensy3.5" H 5200 5981 60  0000 C CNN
F 2 "teensy:Teensy35_36" H 5200 3700 60  0001 C CNN
F 3 "" H 5200 3700 60  0000 C CNN
	1    5200 3700
	1    0    0    -1  
$EndComp
Wire Wire Line
	3950 2200 4200 2200
Wire Wire Line
	3950 2300 4200 2300
NoConn ~ 4200 2500
Wire Wire Line
	1550 2700 1800 2700
Wire Wire Line
	1300 3100 1800 3100
Wire Wire Line
	1300 3000 1800 3000
Wire Wire Line
	9400 4550 9700 4550
Entry Wire Line
	3500 1600 3600 1700
Entry Wire Line
	3500 1700 3600 1800
Entry Wire Line
	3500 1800 3600 1900
Wire Wire Line
	3600 1700 4200 1700
Wire Wire Line
	3600 1800 4200 1800
Wire Wire Line
	3600 1900 4200 1900
Wire Wire Line
	4000 1400 4000 1350
Wire Wire Line
	4000 1350 4200 1350
Wire Wire Line
	4200 1350 4200 1600
Text Label 3700 1700 0    50   ~ 0
TEC_TX
Text Label 3700 1800 0    50   ~ 0
TEC_RX
Text Label 3700 1900 0    50   ~ 0
TEC_EN
$Comp
L Connector_Generic:Conn_02x20_Odd_Even J4
U 1 1 604535F2
P 2100 3300
F 0 "J4" H 2150 4400 50  0000 L CNN
F 1 "Breakout" H 1900 4300 50  0000 L CNN
F 2 "myLibrary:PinSocket_Stacking_2x20_P2.54mm_Vertical" H 2100 3300 50  0001 C CNN
F 3 "~" H 2100 3300 50  0001 C CNN
	1    2100 3300
	-1   0    0    -1  
$EndComp
Entry Wire Line
	1300 3500 1400 3400
Entry Wire Line
	1300 3600 1400 3500
Entry Wire Line
	1300 3700 1400 3600
Wire Wire Line
	1400 3400 1800 3400
Wire Wire Line
	1400 3500 1800 3500
Wire Wire Line
	1400 3600 1800 3600
Text Label 1400 3400 0    50   ~ 0
TEC_TX
Text Label 1400 3500 0    50   ~ 0
TEC_RX
Text Label 1400 3600 0    50   ~ 0
TEC_EN
$Comp
L Device:C C27
U 1 1 60BCFF86
P 9050 4750
F 0 "C27" H 9165 4796 50  0000 L CNN
F 1 "1u0" H 9165 4705 50  0000 L CNN
F 2 "Capacitor_SMD:C_1206_3216Metric" H 9088 4600 50  0001 C CNN
F 3 "~" H 9050 4750 50  0001 C CNN
	1    9050 4750
	1    0    0    -1  
$EndComp
$Comp
L power:GND #PWR0113
U 1 1 60BEE10D
P 9050 4900
F 0 "#PWR0113" H 9050 4650 50  0001 C CNN
F 1 "GND" H 9055 4727 50  0000 C CNN
F 2 "" H 9050 4900 50  0001 C CNN
F 3 "" H 9050 4900 50  0001 C CNN
	1    9050 4900
	1    0    0    -1  
$EndComp
Wire Wire Line
	9400 4550 9050 4550
Wire Wire Line
	9050 4550 9050 4600
Connection ~ 9400 4550
Text Notes 10400 5700 0    50   ~ 0
Noise\nSources
NoConn ~ 4200 2400
$Comp
L Device:Polyfuse F5
U 1 1 61191A34
P 10050 4350
F 0 "F5" H 10138 4396 50  0000 L CNN
F 1 "300mA" H 10138 4305 50  0000 L CNN
F 2 "myLibrary:Fuse_Bourns_MF-MSMF" H 10100 4150 50  0001 L CNN
F 3 "~" H 10050 4350 50  0001 C CNN
F 4 "MF-MSMF030" H 10050 4350 50  0001 C CNN "PartNumb"
	1    10050 4350
	1    0    0    -1  
$EndComp
NoConn ~ 6200 2700
Wire Wire Line
	6650 5100 6200 5100
Wire Wire Line
	6650 5050 6650 5100
$Comp
L Device:C C34
U 1 1 60A2DF6B
P 8400 4750
F 0 "C34" H 8515 4796 50  0000 L CNN
F 1 "10u" H 8515 4705 50  0000 L CNN
F 2 "Capacitor_SMD:C_1206_3216Metric" H 8438 4600 50  0001 C CNN
F 3 "~" H 8400 4750 50  0001 C CNN
	1    8400 4750
	1    0    0    -1  
$EndComp
$Comp
L power:GND #PWR0134
U 1 1 60A401EB
P 8400 4900
F 0 "#PWR0134" H 8400 4650 50  0001 C CNN
F 1 "GND" H 8405 4727 50  0000 C CNN
F 2 "" H 8400 4900 50  0001 C CNN
F 3 "" H 8400 4900 50  0001 C CNN
	1    8400 4900
	1    0    0    -1  
$EndComp
Wire Wire Line
	8400 4500 8400 4550
Connection ~ 8400 4550
Wire Wire Line
	8400 4550 8400 4600
Text GLabel 7250 2350 0    50   Input ~ 0
24V_EN
Text Notes 6550 2050 0    50   ~ 0
Micro-\ncontroller
Text Notes 6550 1800 0    50   ~ 0
Mechanical\nSwitches
Text Notes 8800 1350 0    50   ~ 0
Mechanical\nSwitches
Text Notes 10550 1650 0    50   ~ 0
VNA
Text Notes 10550 2250 0    50   ~ 0
USB Extender
Wire Wire Line
	9300 1300 9300 1350
Wire Wire Line
	9950 1350 9800 1350
Connection ~ 9950 1350
Connection ~ 9300 1350
Wire Wire Line
	9300 1800 8850 1800
Wire Wire Line
	9300 1350 9300 1800
Wire Wire Line
	9500 1350 9300 1350
Wire Wire Line
	10250 1350 9950 1350
$Comp
L power:GND #PWR0133
U 1 1 60F72A09
P 9950 1650
F 0 "#PWR0133" H 9950 1400 50  0001 C CNN
F 1 "GND" H 9955 1477 50  0000 C CNN
F 2 "" H 9950 1650 50  0001 C CNN
F 3 "" H 9950 1650 50  0001 C CNN
	1    9950 1650
	1    0    0    -1  
$EndComp
$Comp
L Device:C C?
U 1 1 60F64893
P 9950 1500
AR Path="/62CB939A/60F64893" Ref="C?"  Part="1" 
AR Path="/60F64893" Ref="C33"  Part="1" 
F 0 "C33" H 10065 1546 50  0000 L CNN
F 1 "1u0" H 10065 1455 50  0000 L CNN
F 2 "Capacitor_SMD:C_0805_2012Metric" H 9988 1350 50  0001 C CNN
F 3 "~" H 9950 1500 50  0001 C CNN
	1    9950 1500
	1    0    0    -1  
$EndComp
$Comp
L Device:Ferrite_Bead L12
U 1 1 60F4138F
P 9650 1350
AR Path="/60F4138F" Ref="L12"  Part="1" 
AR Path="/62CB939A/60F4138F" Ref="L?"  Part="1" 
F 0 "L12" V 9450 1250 50  0000 L CNN
F 1 "MFB-201209-0600PN" V 9500 1250 50  0001 L CNN
F 2 "Inductor_SMD:L_0805_2012Metric" V 9580 1350 50  0001 C CNN
F 3 "~" H 9650 1350 50  0001 C CNN
	1    9650 1350
	0    1    1    0   
$EndComp
$Comp
L power:GND #PWR0132
U 1 1 60F2BFCB
P 10450 1550
F 0 "#PWR0132" H 10450 1300 50  0001 C CNN
F 1 "GND" H 10455 1377 50  0000 C CNN
F 2 "" H 10450 1550 50  0001 C CNN
F 3 "" H 10450 1550 50  0001 C CNN
	1    10450 1550
	1    0    0    -1  
$EndComp
$Comp
L Connector:Conn_Coaxial J2
U 1 1 60F2BFC5
P 10450 1350
F 0 "J2" H 10550 1400 50  0000 L CNN
F 1 "Power Out" H 10550 1300 50  0000 L CNN
F 2 "SamacSys_Parts:0731000097" H 10450 1350 50  0001 C CNN
F 3 " ~" H 10450 1350 50  0001 C CNN
F 4 "12V" H 10550 1200 50  0000 L CNN "Comment"
	1    10450 1350
	1    0    0    -1  
$EndComp
Wire Wire Line
	10250 1950 8850 1950
Wire Wire Line
	9100 2550 9100 3500
Connection ~ 9100 2550
Wire Wire Line
	7250 2650 7350 2650
Text GLabel 7250 2650 0    50   Input ~ 0
5V_EN
Wire Wire Line
	10100 2550 10250 2550
$Sheet
S 7350 1650 1500 1100
U 62CB939A
F0 "Digital Power Supply" 50
F1 "Power_Supply_Digital.sch" 50
F2 "24V_EN" I L 7350 2350 50 
F3 "12V_EN" I L 7350 2500 50 
F4 "+24V" O L 7350 1800 50 
F5 "+12V" O R 8850 1800 50 
F6 "+3.3V" O L 7350 2050 50 
F7 "5V_EN" I L 7350 2650 50 
F8 "+5V" O R 8850 1950 50 
F9 "+48V" O R 8850 2550 50 
$EndSheet
$Comp
L power:+3.3V #PWR0109
U 1 1 612B2402
P 7050 2050
F 0 "#PWR0109" H 7050 1900 50  0001 C CNN
F 1 "+3.3V" H 7065 2223 50  0000 C CNN
F 2 "" H 7050 2050 50  0001 C CNN
F 3 "" H 7050 2050 50  0001 C CNN
	1    7050 2050
	1    0    0    -1  
$EndComp
$Comp
L power:+48V #PWR0122
U 1 1 610EC2E9
P 10050 4200
F 0 "#PWR0122" H 10050 4050 50  0001 C CNN
F 1 "+48V" H 10065 4373 50  0000 C CNN
F 2 "" H 10050 4200 50  0001 C CNN
F 3 "" H 10050 4200 50  0001 C CNN
	1    10050 4200
	1    0    0    -1  
$EndComp
Wire Wire Line
	7250 3300 7350 3300
Wire Wire Line
	7350 3450 7250 3450
Text GLabel 7250 3450 0    50   Output ~ 0
+6V_B
Text GLabel 7250 3300 0    50   Output ~ 0
+6V_A
Wire Wire Line
	7250 3800 7350 3800
Text GLabel 7250 3800 0    50   Input ~ 0
6V_EN
Text GLabel 7250 2500 0    50   Input ~ 0
12V_EN
$Sheet
S 7350 3150 1500 800 
U 62CB50CE
F0 "Analog Power Supply" 50
F1 "Power_Supply_Analog.sch" 50
F2 "+6V_A" O L 7350 3300 50 
F3 "+6V_B" O L 7350 3450 50 
F4 "6V_EN" I L 7350 3800 50 
F5 "48V" I R 8850 3500 50 
$EndSheet
Wire Wire Line
	7350 2500 7250 2500
Wire Wire Line
	7350 2350 7250 2350
Wire Wire Line
	9500 2550 9700 2550
Wire Wire Line
	9350 2550 9100 2550
Wire Wire Line
	9100 2550 8850 2550
Wire Wire Line
	9100 3500 8850 3500
Wire Wire Line
	7050 2050 7350 2050
Wire Wire Line
	7050 1800 7350 1800
$Comp
L power:+12V #PWR0112
U 1 1 62DE2E1E
P 9300 1300
F 0 "#PWR0112" H 9300 1150 50  0001 C CNN
F 1 "+12V" H 9315 1473 50  0000 C CNN
F 2 "" H 9300 1300 50  0001 C CNN
F 3 "" H 9300 1300 50  0001 C CNN
	1    9300 1300
	1    0    0    -1  
$EndComp
$Comp
L power:+24V #PWR0111
U 1 1 62DE2752
P 7050 1800
F 0 "#PWR0111" H 7050 1650 50  0001 C CNN
F 1 "+24V" H 7065 1973 50  0000 C CNN
F 2 "" H 7050 1800 50  0001 C CNN
F 3 "" H 7050 1800 50  0001 C CNN
	1    7050 1800
	1    0    0    -1  
$EndComp
Connection ~ 9500 2550
Wire Wire Line
	9500 2500 9500 2550
Connection ~ 9350 2550
Wire Wire Line
	9350 2550 9500 2550
Connection ~ 10450 3250
$Comp
L power:GND #PWR0110
U 1 1 62AC6C59
P 10450 3250
F 0 "#PWR0110" H 10450 3000 50  0001 C CNN
F 1 "GND" H 10455 3077 50  0000 C CNN
F 2 "" H 10450 3250 50  0001 C CNN
F 3 "" H 10450 3250 50  0001 C CNN
	1    10450 3250
	1    0    0    -1  
$EndComp
$Comp
L power:GND #PWR0108
U 1 1 62A92C17
P 10450 2150
F 0 "#PWR0108" H 10450 1900 50  0001 C CNN
F 1 "GND" H 10455 1977 50  0000 C CNN
F 2 "" H 10450 2150 50  0001 C CNN
F 3 "" H 10450 2150 50  0001 C CNN
	1    10450 2150
	1    0    0    -1  
$EndComp
$Comp
L Connector:Conn_Coaxial J3
U 1 1 62A83B33
P 10450 1950
F 0 "J3" H 10550 2000 50  0000 L CNN
F 1 "Power Out" H 10550 1900 50  0000 L CNN
F 2 "SamacSys_Parts:0731000097" H 10450 1950 50  0001 C CNN
F 3 " ~" H 10450 1950 50  0001 C CNN
F 4 "5V" H 10550 1800 50  0000 L CNN "Comment"
	1    10450 1950
	1    0    0    -1  
$EndComp
$Comp
L Connector:Conn_Coaxial J1
U 1 1 603F8FB2
P 10450 2550
F 0 "J1" H 10550 2600 50  0000 L CNN
F 1 "Power In" H 10550 2500 50  0000 L CNN
F 2 "myLibrary:SMA_Molex_73251-2200_Horiz_3D" H 10450 2550 50  0001 C CNN
F 3 " ~" H 10450 2550 50  0001 C CNN
F 4 "48V" H 10550 2400 50  0000 L CNN "Comment"
	1    10450 2550
	1    0    0    -1  
$EndComp
$Comp
L Device:C C5
U 1 1 603F98BD
P 10100 2900
F 0 "C5" H 10215 2946 50  0000 L CNN
F 1 "470p" H 10215 2855 50  0000 L CNN
F 2 "Capacitor_SMD:C_0805_2012Metric" H 10138 2750 50  0001 C CNN
F 3 "~" H 10100 2900 50  0001 C CNN
	1    10100 2900
	1    0    0    -1  
$EndComp
$Comp
L Device:L L1
U 1 1 603FB62F
P 9900 2550
F 0 "L1" V 10100 2550 50  0000 L BNN
F 1 "47u" V 10000 2500 50  0000 L BNN
F 2 "myLibrary:Inductor_Bourns_SRR1050A" H 9900 2550 50  0001 C CNN
F 3 "~" H 9900 2550 50  0001 C CNN
	1    9900 2550
	0    -1   -1   0   
$EndComp
Wire Wire Line
	10050 2550 10100 2550
Connection ~ 10100 2550
Wire Wire Line
	10100 2550 10100 2750
Wire Wire Line
	9700 2600 9700 2550
Connection ~ 9700 2550
Wire Wire Line
	9750 2550 9700 2550
Wire Wire Line
	9700 3200 9700 3250
Connection ~ 9700 3250
Wire Wire Line
	9700 3250 10100 3250
Wire Wire Line
	9700 3250 9350 3250
Wire Wire Line
	10450 2750 10450 3250
Wire Wire Line
	10100 3050 10100 3250
Connection ~ 10100 3250
Wire Wire Line
	10100 3250 10450 3250
$Comp
L Device:C C7
U 1 1 60400B64
P 9700 3050
F 0 "C7" H 9815 3096 50  0000 L CNN
F 1 "1u0" H 9815 3005 50  0000 L CNN
F 2 "Capacitor_SMD:C_1206_3216Metric" H 9738 2900 50  0001 C CNN
F 3 "~" H 9700 3050 50  0001 C CNN
	1    9700 3050
	1    0    0    -1  
$EndComp
$Comp
L Device:R R4
U 1 1 5D9189EC
P 9700 2750
F 0 "R4" H 9770 2796 50  0000 L CNN
F 1 "10R" H 9770 2705 50  0000 L CNN
F 2 "Resistor_SMD:R_0805_2012Metric" V 9630 2750 50  0001 C CNN
F 3 "~" H 9700 2750 50  0001 C CNN
	1    9700 2750
	1    0    0    -1  
$EndComp
$Comp
L Device:C C4
U 1 1 5DB250A2
P 9350 2900
F 0 "C4" H 9465 2946 50  0000 L CNN
F 1 "470p" H 9465 2855 50  0000 L CNN
F 2 "Capacitor_SMD:C_0805_2012Metric" H 9388 2750 50  0001 C CNN
F 3 "~" H 9350 2900 50  0001 C CNN
	1    9350 2900
	1    0    0    -1  
$EndComp
Wire Wire Line
	9350 3250 9350 3050
Wire Wire Line
	9350 2750 9350 2550
$Comp
L power:+48V #PWR0103
U 1 1 5DB69621
P 9500 2500
F 0 "#PWR0103" H 9500 2350 50  0001 C CNN
F 1 "+48V" H 9515 2673 50  0000 C CNN
F 2 "" H 9500 2500 50  0001 C CNN
F 3 "" H 9500 2500 50  0001 C CNN
	1    9500 2500
	1    0    0    -1  
$EndComp
Entry Wire Line
	3500 2000 3600 2100
Entry Wire Line
	3500 1900 3600 2000
Wire Wire Line
	3600 2100 4200 2100
Wire Wire Line
	4200 2000 3600 2000
Text Label 3700 2000 0    50   ~ 0
GPIO3
Text Label 3700 2100 0    50   ~ 0
GPIO4
Entry Wire Line
	1400 3900 1300 4000
Entry Wire Line
	1300 3800 1400 3700
Entry Wire Line
	1300 3900 1400 3800
Wire Wire Line
	1400 3700 1800 3700
Wire Wire Line
	1800 3800 1400 3800
Text Label 1400 3700 0    50   ~ 0
GPIO3
Text Label 1400 3800 0    50   ~ 0
GPIO4
$Comp
L Graphic:SYM_Flash_Small SYM1
U 1 1 609C07D6
P 11000 2650
F 0 "SYM1" V 10910 2650 50  0001 C CNN
F 1 "SYM_Flash_Small" V 11090 2650 50  0001 C CNN
F 2 "myLibrary:Symbol_HighVoltage_Type2_FrontSilk_VerySmall" H 11000 2625 50  0001 C CNN
F 3 "~" H 11400 2550 50  0001 C CNN
	1    11000 2650
	1    0    0    -1  
$EndComp
$Comp
L myLibrary:Logo_Generic Logo1
U 1 1 609F0F24
P 2100 7250
F 0 "Logo1" H 2328 7336 50  0001 L CNN
F 1 "KiCAD" H 2328 7290 50  0000 L CNN
F 2 "Symbol:KiCad-Logo2_5mm_SilkScreen" H 2100 7250 50  0001 C CNN
F 3 "" H 2100 7250 50  0001 C CNN
	1    2100 7250
	1    0    0    -1  
$EndComp
$Comp
L myLibrary:Logo_Generic Logo2
U 1 1 60A23B91
P 2100 7550
F 0 "Logo2" H 2328 7636 50  0001 L CNN
F 1 "Cavendish" H 2328 7590 50  0000 L CNN
F 2 "myLibrary:logo_kapitza" H 2100 7550 50  0001 C CNN
F 3 "" H 2100 7550 50  0001 C CNN
	1    2100 7550
	1    0    0    -1  
$EndComp
Text Notes 2700 6300 0    50   ~ 0
D3 Duplicated on\nthe transfer switch
Wire Bus Line
	6700 5600 6700 6100
Wire Bus Line
	1300 3200 1300 4500
Wire Bus Line
	2700 1500 2700 4500
Wire Bus Line
	3500 1500 3500 6100
$EndSCHEMATC
