EESchema Schematic File Version 4
EELAYER 30 0
EELAYER END
$Descr A4 11693 8268
encoding utf-8
Sheet 3 3
Title "MAIN CONTROLLER"
Date "February 2021"
Rev "1.1"
Comp "Astrophysics Group Cavendish Laboratory"
Comment1 ""
Comment2 ""
Comment3 ""
Comment4 "Analog Power Supplies"
$EndDescr
$Comp
L Device:Ferrite_Bead FB?
U 1 1 604E9D02
P 3600 2400
AR Path="/604E9D02" Ref="FB?"  Part="1" 
AR Path="/62CB939A/604E9D02" Ref="FB?"  Part="1" 
AR Path="/62CB50CE/604E9D02" Ref="L14"  Part="1" 
F 0 "L14" V 3400 2350 50  0000 L CNN
F 1 "MFB-201209-0600PN" V 3450 2300 50  0001 L CNN
F 2 "Inductor_SMD:L_0805_2012Metric" V 3530 2400 50  0001 C CNN
F 3 "~" H 3600 2400 50  0001 C CNN
	1    3600 2400
	0    1    1    0   
$EndComp
$Comp
L Device:C C?
U 1 1 604E412F
P 3300 2650
AR Path="/604E412F" Ref="C?"  Part="1" 
AR Path="/62CB939A/604E412F" Ref="C?"  Part="1" 
AR Path="/62CB50CE/604E412F" Ref="C18"  Part="1" 
F 0 "C18" H 3415 2696 50  0000 L CNN
F 1 "3u3" H 3415 2605 50  0000 L CNN
F 2 "Capacitor_SMD:C_1206_3216Metric" H 3338 2500 50  0001 C CNN
F 3 "~" H 3300 2650 50  0001 C CNN
F 4 "445-15454-1-ND" H 3300 2650 50  0001 C CNN "DigiKey_Part_Number"
F 5 "TDK Corporation " H 3300 2650 50  0001 C CNN "Manufacturer"
F 6 "C3216X7S2A335K160AB" H 3300 2650 50  0001 C CNN "Manufacturer_Part_Number"
	1    3300 2650
	1    0    0    -1  
$EndComp
$Comp
L Device:C C?
U 1 1 604E00B1
P 3850 2650
AR Path="/604E00B1" Ref="C?"  Part="1" 
AR Path="/62CB939A/604E00B1" Ref="C?"  Part="1" 
AR Path="/62CB50CE/604E00B1" Ref="C19"  Part="1" 
F 0 "C19" H 3965 2696 50  0000 L CNN
F 1 "3u3" H 3965 2605 50  0000 L CNN
F 2 "Capacitor_SMD:C_1206_3216Metric" H 3888 2500 50  0001 C CNN
F 3 "~" H 3850 2650 50  0001 C CNN
F 4 "445-15454-1-ND" H 3850 2650 50  0001 C CNN "DigiKey_Part_Number"
F 5 "TDK Corporation " H 3850 2650 50  0001 C CNN "Manufacturer"
F 6 "C3216X7S2A335K160AB" H 3850 2650 50  0001 C CNN "Manufacturer_Part_Number"
	1    3850 2650
	1    0    0    -1  
$EndComp
Connection ~ 3300 2900
Wire Wire Line
	3300 2400 3300 2500
Connection ~ 3300 2400
Wire Wire Line
	2250 2900 2250 2850
Wire Wire Line
	2600 2900 2250 2900
Wire Wire Line
	2600 2700 2600 2900
Wire Wire Line
	2900 1950 2600 1950
Wire Wire Line
	2600 1950 2600 1900
Connection ~ 2600 1950
Wire Wire Line
	2600 2000 2600 1950
Wire Wire Line
	2600 1550 2900 1550
Wire Wire Line
	2600 1600 2600 1550
$Comp
L Device:R R?
U 1 1 62F30637
P 2600 2150
AR Path="/62F30637" Ref="R?"  Part="1" 
AR Path="/62CB50CE/62F30637" Ref="R2"  Part="1" 
F 0 "R2" H 2650 2200 50  0000 L CNN
F 1 "18k" H 2650 2100 50  0000 L CNN
F 2 "Resistor_SMD:R_0603_1608Metric" V 2530 2150 50  0001 C CNN
F 3 "~" H 2600 2150 50  0001 C CNN
	1    2600 2150
	1    0    0    -1  
$EndComp
$Comp
L Device:R R?
U 1 1 62F3063D
P 2600 1750
AR Path="/62F3063D" Ref="R?"  Part="1" 
AR Path="/62CB50CE/62F3063D" Ref="R1"  Part="1" 
F 0 "R1" H 2650 1800 50  0000 L CNN
F 1 "9k1" H 2650 1700 50  0000 L CNN
F 2 "Resistor_SMD:R_0603_1608Metric" V 2530 1750 50  0001 C CNN
F 3 "~" H 2600 1750 50  0001 C CNN
	1    2600 1750
	1    0    0    -1  
$EndComp
$Comp
L Device:R R?
U 1 1 62F3064A
P 2250 2700
AR Path="/62F3064A" Ref="R?"  Part="1" 
AR Path="/62CB50CE/62F3064A" Ref="R3"  Part="1" 
F 0 "R3" H 2300 2750 50  0000 L CNN
F 1 "10k" H 2300 2650 50  0000 L CNN
F 2 "Resistor_SMD:R_0603_1608Metric" V 2180 2700 50  0001 C CNN
F 3 "~" H 2250 2700 50  0001 C CNN
	1    2250 2700
	1    0    0    -1  
$EndComp
$Comp
L Transistor_FET:2N7002 T?
U 1 1 62F30650
P 2500 2500
AR Path="/62F30650" Ref="T?"  Part="1" 
AR Path="/62CB50CE/62F30650" Ref="T2"  Part="1" 
F 0 "T2" H 2700 2550 50  0000 L CNN
F 1 "2N7002" H 2700 2450 50  0000 L CNN
F 2 "Package_TO_SOT_SMD:SOT-323_SC-70" H 2700 2425 50  0001 L CIN
F 3 "https://www.fairchildsemi.com/datasheets/2N/2N7002.pdf" H 2500 2500 50  0001 L CNN
	1    2500 2500
	1    0    0    -1  
$EndComp
Wire Wire Line
	2300 2500 2250 2500
Wire Wire Line
	2600 2900 3300 2900
Connection ~ 2600 2900
Wire Wire Line
	2250 2500 2250 2550
Connection ~ 2900 1950
Connection ~ 2900 1550
Connection ~ 3300 1550
$Comp
L SamacSys_Parts:LT3045EDD#PBF U3
U 1 1 62F40551
P 7050 2350
F 0 "U3" H 7250 2600 50  0000 L CNN
F 1 "LT3045EDD" H 7250 2500 50  0000 L CNN
F 2 "SON50P300X300X80-11N-D" H 8100 2450 50  0001 L CNN
F 3 "http://cds.linear.com/docs/en/datasheet/3045f.pdf" H 8100 2350 50  0001 L CNN
F 4 "LINEAR TECHNOLOGY - LT3045EDD#PBF - LDO, ADJ, 0V TO 15V, 0.5A, DFN-10" H 8100 2250 50  0001 L CNN "Description"
F 5 "0.8" H 8100 2150 50  0001 L CNN "Height"
F 6 "Linear Technology" H 8100 2050 50  0001 L CNN "Manufacturer_Name"
F 7 "LT3045EDD#PBF" H 8100 1950 50  0001 L CNN "Manufacturer_Part_Number"
	1    7050 2350
	1    0    0    -1  
$EndComp
Wire Wire Line
	3550 1550 3300 1550
$Comp
L power:GND #PWR?
U 1 1 62F3065A
P 3300 2950
AR Path="/62F3065A" Ref="#PWR?"  Part="1" 
AR Path="/62CB50CE/62F3065A" Ref="#PWR0114"  Part="1" 
F 0 "#PWR0114" H 3300 2700 50  0001 C CNN
F 1 "GND" H 3305 2777 50  0000 C CNN
F 2 "" H 3300 2950 50  0001 C CNN
F 3 "" H 3300 2950 50  0001 C CNN
	1    3300 2950
	1    0    0    -1  
$EndComp
Wire Wire Line
	3300 2900 3300 2800
$Comp
L Device:D_Zener D?
U 1 1 62F30644
P 2900 1750
AR Path="/62F30644" Ref="D?"  Part="1" 
AR Path="/62CB50CE/62F30644" Ref="D1"  Part="1" 
F 0 "D1" V 2854 1829 50  0000 L CNN
F 1 "10V" V 2945 1829 50  0000 L CNN
F 2 "Diode_SMD:D_SOD-323" H 2900 1750 50  0001 C CNN
F 3 "~" H 2900 1750 50  0001 C CNN
F 4 "MM3Z10VST1G" V 2900 1750 50  0001 C CNN "PartNumber"
	1    2900 1750
	0    1    1    0   
$EndComp
$Comp
L Device:Q_PMOS_GSD T?
U 1 1 62F30631
P 3200 1950
AR Path="/62F30631" Ref="T?"  Part="1" 
AR Path="/62CB50CE/62F30631" Ref="T1"  Part="1" 
F 0 "T1" H 3400 1800 50  0000 L CNN
F 1 "ZXMP6A13" H 3400 1900 50  0000 L CNN
F 2 "Package_TO_SOT_SMD:SOT-23" H 3400 2050 50  0001 C CNN
F 3 "~" H 3200 1950 50  0001 C CNN
F 4 "ZXMP6A13FTA" H 3200 1950 50  0001 C CNN "PartNumb"
	1    3200 1950
	1    0    0    1   
$EndComp
Wire Wire Line
	3300 1750 3300 1550
Wire Wire Line
	2900 1550 3300 1550
Wire Wire Line
	2900 1550 2900 1600
Wire Wire Line
	3000 1950 2900 1950
Wire Wire Line
	2900 1900 2900 1950
Wire Wire Line
	3300 2150 3300 2400
$Comp
L SamacSys_Parts:SRH05S6V5 U2
U 1 1 62F1A12B
P 4350 2400
F 0 "U2" H 4550 2650 50  0000 L CNN
F 1 "SRH05S7V2" H 4550 2550 50  0000 L CNN
F 2 "SRH05S6V5" H 5200 2500 50  0001 L CNN
F 3 "https://www.xppower.com/portals/0/pdfs/SF_SRH05.pdf" H 5200 2400 50  0001 L CNN
F 4 "XP Power DC-DC Switching Regulator" H 5200 2300 50  0001 L CNN "Description"
F 5 "10.15" H 5200 2200 50  0001 L CNN "Height"
F 6 "XP POWER" H 5200 2100 50  0001 L CNN "Manufacturer_Name"
F 7 "SRH05S7V2" H 5200 2000 50  0001 L CNN "Manufacturer_Part_Number"
	1    4350 2400
	1    0    0    -1  
$EndComp
$Comp
L power:GND #PWR0123
U 1 1 6053AE95
P 4250 2950
F 0 "#PWR0123" H 4250 2700 50  0001 C CNN
F 1 "GND" H 4255 2777 50  0000 C CNN
F 2 "" H 4250 2950 50  0001 C CNN
F 3 "" H 4250 2950 50  0001 C CNN
	1    4250 2950
	1    0    0    -1  
$EndComp
Wire Wire Line
	3300 2950 3300 2900
$Comp
L Device:R R14
U 1 1 60C61704
P 8500 3000
F 0 "R14" H 8570 3046 50  0000 L CNN
F 1 "61k" H 8570 2955 50  0000 L CNN
F 2 "Resistor_SMD:R_0603_1608Metric" V 8430 3000 50  0001 C CNN
F 3 "~" H 8500 3000 50  0001 C CNN
	1    8500 3000
	1    0    0    -1  
$EndComp
$Comp
L Device:C C22
U 1 1 60C61F70
P 8850 3100
F 0 "C22" H 8965 3146 50  0000 L CNN
F 1 "4u7" H 8965 3055 50  0000 L CNN
F 2 "Capacitor_SMD:C_0805_2012Metric" H 8888 2950 50  0001 C CNN
F 3 "~" H 8850 3100 50  0001 C CNN
	1    8850 3100
	1    0    0    -1  
$EndComp
Wire Wire Line
	8250 2650 8500 2650
Wire Wire Line
	8850 2650 8850 2950
Wire Wire Line
	8500 2650 8500 2850
Connection ~ 8500 2650
Wire Wire Line
	8500 2650 8850 2650
$Comp
L power:GND #PWR0124
U 1 1 60C64AD8
P 8850 3500
F 0 "#PWR0124" H 8850 3250 50  0001 C CNN
F 1 "GND" H 8855 3327 50  0000 C CNN
F 2 "" H 8850 3500 50  0001 C CNN
F 3 "" H 8850 3500 50  0001 C CNN
	1    8850 3500
	1    0    0    -1  
$EndComp
Wire Wire Line
	8850 3250 8850 3450
Wire Wire Line
	8850 3450 8500 3450
Connection ~ 8850 3450
Wire Wire Line
	8850 3450 8850 3500
Wire Wire Line
	8500 3150 8500 3450
Connection ~ 8500 3450
Wire Wire Line
	8500 3450 8350 3450
$Comp
L Device:R R15
U 1 1 60C664D1
P 6900 3050
F 0 "R15" H 6970 3096 50  0000 L CNN
F 1 "470R" H 6970 3005 50  0000 L CNN
F 2 "Resistor_SMD:R_0603_1608Metric" V 6830 3050 50  0001 C CNN
F 3 "~" H 6900 3050 50  0001 C CNN
	1    6900 3050
	1    0    0    -1  
$EndComp
Wire Wire Line
	7050 2750 6900 2750
Wire Wire Line
	6900 2750 6900 2900
Wire Wire Line
	6900 3200 6900 3450
Wire Wire Line
	6900 3450 7650 3450
Wire Wire Line
	8250 2550 8350 2550
Wire Wire Line
	8350 2550 8350 3450
Connection ~ 8350 3450
Wire Wire Line
	8350 3450 7650 3450
Connection ~ 7650 3450
$Comp
L Device:C C16
U 1 1 60C6BE7C
P 9100 2550
F 0 "C16" H 9215 2596 50  0000 L CNN
F 1 "10u" H 9215 2505 50  0000 L CNN
F 2 "Capacitor_SMD:C_0805_2012Metric" H 9138 2400 50  0001 C CNN
F 3 "~" H 9100 2550 50  0001 C CNN
	1    9100 2550
	1    0    0    -1  
$EndComp
$Comp
L power:GND #PWR0125
U 1 1 60C6DDF5
P 9100 2700
F 0 "#PWR0125" H 9100 2450 50  0001 C CNN
F 1 "GND" H 9105 2527 50  0000 C CNN
F 2 "" H 9100 2700 50  0001 C CNN
F 3 "" H 9100 2700 50  0001 C CNN
	1    9100 2700
	1    0    0    -1  
$EndComp
Wire Wire Line
	8250 2450 8250 2350
Wire Wire Line
	8250 2350 9100 2350
Wire Wire Line
	9100 2350 9100 2400
Connection ~ 8250 2350
Wire Wire Line
	7050 2550 7050 2450
Connection ~ 7050 2450
Wire Wire Line
	7050 2450 7050 2350
$Comp
L Device:C C17
U 1 1 60C7558A
P 6650 2600
F 0 "C17" H 6765 2646 50  0000 L CNN
F 1 "47u" H 6765 2555 50  0000 L CNN
F 2 "Capacitor_SMD:C_1206_3216Metric" H 6688 2450 50  0001 C CNN
F 3 "~" H 6650 2600 50  0001 C CNN
	1    6650 2600
	1    0    0    -1  
$EndComp
$Comp
L Device:L L2
U 1 1 60C76492
P 6450 2350
F 0 "L2" V 6640 2350 50  0000 L CNN
F 1 "10u" V 6550 2300 50  0000 L CNN
F 2 "SamacSys_Parts:ASPI0403S100MT" H 6450 2350 50  0001 C CNN
F 3 "~" H 6450 2350 50  0001 C CNN
F 4 "ASPI-0403S-470M-TCT-ND" V 6450 2350 50  0001 C CNN "DigiKey_Part_Number"
	1    6450 2350
	0    -1   -1   0   
$EndComp
$Comp
L Device:C C21
U 1 1 60C7964F
P 6250 2950
F 0 "C21" H 6365 2996 50  0000 L CNN
F 1 "47u" H 6365 2905 50  0000 L CNN
F 2 "Capacitor_SMD:C_1206_3216Metric" H 6288 2800 50  0001 C CNN
F 3 "~" H 6250 2950 50  0001 C CNN
	1    6250 2950
	1    0    0    -1  
$EndComp
Wire Wire Line
	6900 3450 6650 3450
Wire Wire Line
	6250 3450 6250 3100
Connection ~ 6900 3450
Wire Wire Line
	6250 2800 6250 2350
Wire Wire Line
	6250 2350 6300 2350
Connection ~ 7050 2350
Wire Wire Line
	6600 2350 6650 2350
Wire Wire Line
	6650 2350 6650 2450
Connection ~ 6650 2350
Wire Wire Line
	6650 2350 7050 2350
Wire Wire Line
	6650 2750 6650 3450
Connection ~ 6650 3450
Wire Wire Line
	6650 3450 6250 3450
Text HLabel 9250 2350 2    50   Output ~ 0
+6V_A
Wire Wire Line
	9250 2350 9100 2350
Connection ~ 9100 2350
Wire Wire Line
	3300 2400 3450 2400
$Comp
L SamacSys_Parts:LT3045EDD#PBF U7
U 1 1 60CA1DF3
P 7050 4350
F 0 "U7" H 7250 4600 50  0000 L CNN
F 1 "LT3045EDD" H 7250 4500 50  0000 L CNN
F 2 "SON50P300X300X80-11N-D" H 8100 4450 50  0001 L CNN
F 3 "http://cds.linear.com/docs/en/datasheet/3045f.pdf" H 8100 4350 50  0001 L CNN
F 4 "LINEAR TECHNOLOGY - LT3045EDD#PBF - LDO, ADJ, 0V TO 15V, 0.5A, DFN-10" H 8100 4250 50  0001 L CNN "Description"
F 5 "0.8" H 8100 4150 50  0001 L CNN "Height"
F 6 "Linear Technology" H 8100 4050 50  0001 L CNN "Manufacturer_Name"
F 7 "LT3045EDD#PBF" H 8100 3950 50  0001 L CNN "Manufacturer_Part_Number"
	1    7050 4350
	1    0    0    -1  
$EndComp
$Comp
L Device:R R16
U 1 1 60CA1DF9
P 8500 5000
F 0 "R16" H 8570 5046 50  0000 L CNN
F 1 "61k" H 8570 4955 50  0000 L CNN
F 2 "Resistor_SMD:R_0603_1608Metric" V 8430 5000 50  0001 C CNN
F 3 "~" H 8500 5000 50  0001 C CNN
	1    8500 5000
	1    0    0    -1  
$EndComp
$Comp
L Device:C C26
U 1 1 60CA1DFF
P 8850 5100
F 0 "C26" H 8965 5146 50  0000 L CNN
F 1 "4u7" H 8965 5055 50  0000 L CNN
F 2 "Capacitor_SMD:C_0805_2012Metric" H 8888 4950 50  0001 C CNN
F 3 "~" H 8850 5100 50  0001 C CNN
	1    8850 5100
	1    0    0    -1  
$EndComp
Wire Wire Line
	8250 4650 8500 4650
Wire Wire Line
	8850 4650 8850 4950
Wire Wire Line
	8500 4650 8500 4850
Connection ~ 8500 4650
Wire Wire Line
	8500 4650 8850 4650
$Comp
L power:GND #PWR0126
U 1 1 60CA1E0A
P 8850 5500
F 0 "#PWR0126" H 8850 5250 50  0001 C CNN
F 1 "GND" H 8855 5327 50  0000 C CNN
F 2 "" H 8850 5500 50  0001 C CNN
F 3 "" H 8850 5500 50  0001 C CNN
	1    8850 5500
	1    0    0    -1  
$EndComp
Wire Wire Line
	8850 5250 8850 5450
Wire Wire Line
	8850 5450 8500 5450
Connection ~ 8850 5450
Wire Wire Line
	8850 5450 8850 5500
Wire Wire Line
	8500 5150 8500 5450
Connection ~ 8500 5450
Wire Wire Line
	8500 5450 8350 5450
$Comp
L Device:R R17
U 1 1 60CA1E17
P 6900 5050
F 0 "R17" H 6970 5096 50  0000 L CNN
F 1 "470R" H 6970 5005 50  0000 L CNN
F 2 "Resistor_SMD:R_0603_1608Metric" V 6830 5050 50  0001 C CNN
F 3 "~" H 6900 5050 50  0001 C CNN
	1    6900 5050
	1    0    0    -1  
$EndComp
Wire Wire Line
	7050 4750 6900 4750
Wire Wire Line
	6900 4750 6900 4900
Wire Wire Line
	6900 5200 6900 5450
Wire Wire Line
	6900 5450 7650 5450
Wire Wire Line
	8250 4550 8350 4550
Wire Wire Line
	8350 4550 8350 5450
Connection ~ 8350 5450
Wire Wire Line
	8350 5450 7650 5450
Connection ~ 7650 5450
$Comp
L Device:C C23
U 1 1 60CA1E26
P 9100 4550
F 0 "C23" H 9215 4596 50  0000 L CNN
F 1 "10u" H 9215 4505 50  0000 L CNN
F 2 "Capacitor_SMD:C_0805_2012Metric" H 9138 4400 50  0001 C CNN
F 3 "~" H 9100 4550 50  0001 C CNN
	1    9100 4550
	1    0    0    -1  
$EndComp
$Comp
L power:GND #PWR0127
U 1 1 60CA1E2C
P 9100 4700
F 0 "#PWR0127" H 9100 4450 50  0001 C CNN
F 1 "GND" H 9105 4527 50  0000 C CNN
F 2 "" H 9100 4700 50  0001 C CNN
F 3 "" H 9100 4700 50  0001 C CNN
	1    9100 4700
	1    0    0    -1  
$EndComp
Wire Wire Line
	8250 4450 8250 4350
Wire Wire Line
	8250 4350 9100 4350
Wire Wire Line
	9100 4350 9100 4400
Connection ~ 8250 4350
Wire Wire Line
	7050 4550 7050 4450
Connection ~ 7050 4450
Wire Wire Line
	7050 4450 7050 4350
$Comp
L Device:C C24
U 1 1 60CA1E39
P 6650 4600
F 0 "C24" H 6765 4646 50  0000 L CNN
F 1 "47u" H 6765 4555 50  0000 L CNN
F 2 "Capacitor_SMD:C_1206_3216Metric" H 6688 4450 50  0001 C CNN
F 3 "~" H 6650 4600 50  0001 C CNN
	1    6650 4600
	1    0    0    -1  
$EndComp
$Comp
L Device:L L3
U 1 1 60CA1E40
P 6450 4350
F 0 "L3" V 6640 4350 50  0000 L CNN
F 1 "10u" V 6550 4300 50  0000 L CNN
F 2 "SamacSys_Parts:ASPI0403S100MT" H 6450 4350 50  0001 C CNN
F 3 "~" H 6450 4350 50  0001 C CNN
F 4 "ASPI-0403S-470M-TCT-ND" V 6450 4350 50  0001 C CNN "DigiKey_Part_Number"
	1    6450 4350
	0    -1   -1   0   
$EndComp
$Comp
L Device:C C25
U 1 1 60CA1E46
P 6250 4950
F 0 "C25" H 6365 4996 50  0000 L CNN
F 1 "47u" H 6365 4905 50  0000 L CNN
F 2 "Capacitor_SMD:C_1206_3216Metric" H 6288 4800 50  0001 C CNN
F 3 "~" H 6250 4950 50  0001 C CNN
	1    6250 4950
	1    0    0    -1  
$EndComp
Wire Wire Line
	6900 5450 6650 5450
Wire Wire Line
	6250 5450 6250 5100
Connection ~ 6900 5450
Wire Wire Line
	6250 4800 6250 4350
Wire Wire Line
	6250 4350 6300 4350
Connection ~ 7050 4350
Wire Wire Line
	6600 4350 6650 4350
Wire Wire Line
	6650 4350 6650 4450
Connection ~ 6650 4350
Wire Wire Line
	6650 4350 7050 4350
Wire Wire Line
	6650 4750 6650 5450
Connection ~ 6650 5450
Wire Wire Line
	6650 5450 6250 5450
Text HLabel 9250 4350 2    50   Output ~ 0
+6V_B
Wire Wire Line
	9250 4350 9100 4350
Connection ~ 9100 4350
$Comp
L Device:Ferrite_Bead FB?
U 1 1 60CDF353
P 5800 2350
AR Path="/60CDF353" Ref="FB?"  Part="1" 
AR Path="/62CB939A/60CDF353" Ref="FB?"  Part="1" 
AR Path="/62CB50CE/60CDF353" Ref="L13"  Part="1" 
F 0 "L13" V 5600 2300 50  0000 L CNN
F 1 "MFB-201209-0600PN" V 5650 2250 50  0001 L CNN
F 2 "Inductor_SMD:L_0805_2012Metric" V 5730 2350 50  0001 C CNN
F 3 "~" H 5800 2350 50  0001 C CNN
	1    5800 2350
	0    1    1    0   
$EndComp
$Comp
L Device:C C20
U 1 1 60CE4EC9
P 5550 2700
F 0 "C20" H 5665 2746 50  0000 L CNN
F 1 "47u" H 5665 2655 50  0000 L CNN
F 2 "Capacitor_SMD:C_1206_3216Metric" H 5588 2550 50  0001 C CNN
F 3 "~" H 5550 2700 50  0001 C CNN
	1    5550 2700
	1    0    0    -1  
$EndComp
Wire Wire Line
	4350 2600 4350 2900
Wire Wire Line
	4350 2900 5350 2900
Wire Wire Line
	5350 2900 5350 2350
Wire Wire Line
	5350 2350 5550 2350
Wire Wire Line
	5550 2350 5550 2550
Connection ~ 5550 2350
Wire Wire Line
	5550 2350 5650 2350
$Comp
L power:GND #PWR0128
U 1 1 60CF0CC1
P 5550 2950
F 0 "#PWR0128" H 5550 2700 50  0001 C CNN
F 1 "GND" H 5555 2777 50  0000 C CNN
F 2 "" H 5550 2950 50  0001 C CNN
F 3 "" H 5550 2950 50  0001 C CNN
	1    5550 2950
	1    0    0    -1  
$EndComp
Wire Wire Line
	5550 2950 5550 2850
Wire Wire Line
	6250 4350 6000 4350
Wire Wire Line
	6000 4350 6000 2350
Wire Wire Line
	6000 2350 6250 2350
Connection ~ 6250 4350
Connection ~ 6250 2350
Wire Wire Line
	6000 2350 5950 2350
Connection ~ 6000 2350
Wire Wire Line
	4350 2500 4250 2500
Wire Wire Line
	4250 2500 4250 2900
Wire Wire Line
	4350 2400 3850 2400
Wire Wire Line
	3850 2500 3850 2400
Connection ~ 3850 2400
Wire Wire Line
	3850 2400 3750 2400
Wire Wire Line
	3850 2800 3850 2900
Wire Wire Line
	3850 2900 4250 2900
Connection ~ 4250 2900
Wire Wire Line
	4250 2900 4250 2950
Text HLabel 3550 1550 2    50   Input ~ 0
48V
Text HLabel 2150 2500 0    50   Input ~ 0
6V_EN
Wire Wire Line
	2150 2500 2250 2500
Connection ~ 2250 2500
NoConn ~ 8250 2750
NoConn ~ 7050 2650
$EndSCHEMATC
