ISO-10303-21;
HEADER;
FILE_DESCRIPTION (( 'STEP AP214' ),
    '1' );
FILE_NAME ('heatsink_bar.STEP',
    '2019-10-14T14:50:42',
    ( '' ),
    ( '' ),
    'SwSTEP 2.0',
    'SolidWorks 2016',
    '' );
FILE_SCHEMA (( 'AUTOMOTIVE_DESIGN' ));
ENDSEC;

DATA;
#1 = ADVANCED_FACE ( 'NONE', ( #369, #404 ), #188, .F. ) ;
#2 = CARTESIAN_POINT ( 'NONE',  ( 12.50000000000000000, 5.000000000000019500, 6.500000000000000900 ) ) ;
#3 = ORIENTED_EDGE ( 'NONE', *, *, #575, .F. ) ;
#4 = DIRECTION ( 'NONE',  ( -0.0000000000000000000, -0.0000000000000000000, 1.000000000000000000 ) ) ;
#5 = VERTEX_POINT ( 'NONE', #275 ) ;
#6 = SURFACE_STYLE_FILL_AREA ( #168 ) ;
#7 = CARTESIAN_POINT ( 'NONE',  ( -50.00000000000000000, 0.0000000000000000000, 8.000000000000000000 ) ) ;
#8 = ADVANCED_FACE ( 'NONE', ( #486 ), #137, .F. ) ;
#9 = DIRECTION ( 'NONE',  ( 1.000000000000000000, 0.0000000000000000000, 0.0000000000000000000 ) ) ;
#10 = DIRECTION ( 'NONE',  ( -0.0000000000000000000, -0.0000000000000000000, 1.000000000000000000 ) ) ;
#11 = FACE_BOUND ( 'NONE', #157, .T. ) ;
#12 = CARTESIAN_POINT ( 'NONE',  ( 77.50000000000000000, -10.00000000000000000, 0.0000000000000000000 ) ) ;
#13 = EDGE_CURVE ( 'NONE', #233, #669, #356, .T. ) ;
#14 = AXIS2_PLACEMENT_3D ( 'NONE', #67, #464, #125 ) ;
#15 = ORIENTED_EDGE ( 'NONE', *, *, #60, .T. ) ;
#16 = LINE ( 'NONE', #199, #37 ) ;
#17 = CARTESIAN_POINT ( 'NONE',  ( -77.50000000000000000, -10.00000000000000000, 0.0000000000000000000 ) ) ;
#18 = DIRECTION ( 'NONE',  ( -0.0000000000000000000, -0.0000000000000000000, 1.000000000000000000 ) ) ;
#19 = CIRCLE ( 'NONE', #58, 2.000000000000001800 ) ;
#20 = EDGE_CURVE ( 'NONE', #455, #455, #34, .T. ) ;
#21 = DIRECTION ( 'NONE',  ( 1.000000000000000000, 0.0000000000000000000, 0.0000000000000000000 ) ) ;
#22 = PRESENTATION_LAYER_ASSIGNMENT (  '', '', ( #741 ) ) ;
#23 = DIRECTION ( 'NONE',  ( -0.0000000000000000000, -0.0000000000000000000, 1.000000000000000000 ) ) ;
#24 = ORIENTED_EDGE ( 'NONE', *, *, #20, .T. ) ;
#25 = EDGE_LOOP ( 'NONE', ( #310 ) ) ;
#26 = EDGE_LOOP ( 'NONE', ( #241 ) ) ;
#27 = CARTESIAN_POINT ( 'NONE',  ( 13.74999999999999800, 5.000000000000019500, 0.0000000000000000000 ) ) ;
#28 = CIRCLE ( 'NONE', #654, 1.250000000000001100 ) ;
#29 = AXIS2_PLACEMENT_3D ( 'NONE', #104, #444, #389 ) ;
#30 = CIRCLE ( 'NONE', #365, 2.000000000000000000 ) ;
#31 = EDGE_CURVE ( 'NONE', #754, #754, #336, .T. ) ;
#32 = CARTESIAN_POINT ( 'NONE',  ( -10.50000000000000000, 5.000000000000016000, 8.000000000000000000 ) ) ;
#33 = CARTESIAN_POINT ( 'NONE',  ( 0.0000000000000000000, 0.0000000000000000000, 0.0000000000000000000 ) ) ;
#34 = CIRCLE ( 'NONE', #171, 1.250000000000001100 ) ;
#35 = PRESENTATION_STYLE_ASSIGNMENT (( #320 ) ) ;
#36 = EDGE_LOOP ( 'NONE', ( #47 ) ) ;
#37 = VECTOR ( 'NONE', #87, 1000.000000000000000 ) ;
#38 = CYLINDRICAL_SURFACE ( 'NONE', #194, 2.000000000000001800 ) ;
#39 = PRODUCT_DEFINITION_CONTEXT ( 'detailed design', #166, 'design' ) ;
#40 = AXIS2_PLACEMENT_3D ( 'NONE', #184, #592, #521 ) ;
#41 = AXIS2_PLACEMENT_3D ( 'NONE', #482, #597, #21 ) ;
#42 = CARTESIAN_POINT ( 'NONE',  ( 77.50000000000000000, -10.00000000000000000, 8.000000000000000000 ) ) ;
#43 = CARTESIAN_POINT ( 'NONE',  ( -77.50000000000000000, 10.00000000000000000, 8.000000000000000000 ) ) ;
#44 = VERTEX_POINT ( 'NONE', #666 ) ;
#45 = EDGE_LOOP ( 'NONE', ( #201 ) ) ;
#46 = CARTESIAN_POINT ( 'NONE',  ( -77.50000000000000000, -10.00000000000000000, 8.000000000000000000 ) ) ;
#47 = ORIENTED_EDGE ( 'NONE', *, *, #575, .T. ) ;
#48 = DIRECTION ( 'NONE',  ( 1.000000000000000000, 0.0000000000000000000, 0.0000000000000000000 ) ) ;
#49 = CYLINDRICAL_SURFACE ( 'NONE', #383, 1.250000000000001100 ) ;
#50 = DIRECTION ( 'NONE',  ( 0.0000000000000000000, 0.0000000000000000000, -1.000000000000000000 ) ) ;
#51 = CARTESIAN_POINT ( 'NONE',  ( -37.50000000000000000, 5.000000000000009800, 8.000000000000000000 ) ) ;
#52 = VECTOR ( 'NONE', #306, 1000.000000000000000 ) ;
#53 = EDGE_LOOP ( 'NONE', ( #496 ) ) ;
#54 = LINE ( 'NONE', #85, #627 ) ;
#55 = DIRECTION ( 'NONE',  ( 1.000000000000000000, 0.0000000000000000000, 0.0000000000000000000 ) ) ;
#56 = ORIENTED_EDGE ( 'NONE', *, *, #604, .T. ) ;
#57 = EDGE_CURVE ( 'NONE', #5, #233, #644, .T. ) ;
#58 = AXIS2_PLACEMENT_3D ( 'NONE', #586, #235, #635 ) ;
#59 = CIRCLE ( 'NONE', #29, 1.250000000000000000 ) ;
#60 = EDGE_CURVE ( 'NONE', #287, #287, #30, .T. ) ;
#61 = DIRECTION ( 'NONE',  ( 1.000000000000000000, 0.0000000000000000000, 0.0000000000000000000 ) ) ;
#62 = FACE_OUTER_BOUND ( 'NONE', #361, .T. ) ;
#63 = MECHANICAL_DESIGN_GEOMETRIC_PRESENTATION_REPRESENTATION (  '', ( #741 ), #102 ) ;
#64 = VERTEX_POINT ( 'NONE', #153 ) ;
#65 = EDGE_LOOP ( 'NONE', ( #619 ) ) ;
#66 = DIRECTION ( 'NONE',  ( -1.000000000000000000, 0.0000000000000000000, -0.0000000000000000000 ) ) ;
#67 = CARTESIAN_POINT ( 'NONE',  ( -50.00000000000000000, 0.0000000000000000000, 0.0000000000000000000 ) ) ;
#68 = ORIENTED_EDGE ( 'NONE', *, *, #737, .T. ) ;
#69 = ADVANCED_FACE ( 'NONE', ( #493, #234 ), #363, .F. ) ;
#70 = ADVANCED_FACE ( 'NONE', ( #219, #154 ), #124, .F. ) ;
#71 = DIRECTION ( 'NONE',  ( 0.0000000000000000000, 1.000000000000000000, 0.0000000000000000000 ) ) ;
#72 = DIRECTION ( 'NONE',  ( 1.000000000000000000, 0.0000000000000000000, 0.0000000000000000000 ) ) ;
#73 = EDGE_CURVE ( 'NONE', #141, #141, #305, .T. ) ;
#74 = EDGE_LOOP ( 'NONE', ( #513 ) ) ;
#75 = DIRECTION ( 'NONE',  ( -0.0000000000000000000, -0.0000000000000000000, 1.000000000000000000 ) ) ;
#76 = LINE ( 'NONE', #480, #91 ) ;
#77 = EDGE_LOOP ( 'NONE', ( #286 ) ) ;
#78 = CYLINDRICAL_SURFACE ( 'NONE', #291, 1.249999999999999300 ) ;
#79 = PLANE ( 'NONE',  #629 ) ;
#80 = DIRECTION ( 'NONE',  ( 0.0000000000000000000, 0.0000000000000000000, 1.000000000000000000 ) ) ;
#81 = AXIS2_PLACEMENT_3D ( 'NONE', #130, #535, #174 ) ;
#82 = AXIS2_PLACEMENT_3D ( 'NONE', #311, #144, #603 ) ;
#83 = VERTEX_POINT ( 'NONE', #376 ) ;
#84 = ORIENTED_EDGE ( 'NONE', *, *, #622, .F. ) ;
#85 = CARTESIAN_POINT ( 'NONE',  ( -77.50000000000000000, 10.00000000000000000, 0.0000000000000000000 ) ) ;
#86 = ORIENTED_EDGE ( 'NONE', *, *, #452, .F. ) ;
#87 = DIRECTION ( 'NONE',  ( 1.000000000000000000, 0.0000000000000000000, 0.0000000000000000000 ) ) ;
#88 = CARTESIAN_POINT ( 'NONE',  ( 51.25000000000000700, 0.0000000000000000000, 0.0000000000000000000 ) ) ;
#89 = CARTESIAN_POINT ( 'NONE',  ( -48.75000000000000000, 0.0000000000000000000, 8.000000000000000000 ) ) ;
#90 = ORIENTED_EDGE ( 'NONE', *, *, #268, .T. ) ;
#91 = VECTOR ( 'NONE', #652, 1000.000000000000000 ) ;
#92 = FACE_BOUND ( 'NONE', #397, .T. ) ;
#93 = ORIENTED_EDGE ( 'NONE', *, *, #379, .T. ) ;
#94 =( NAMED_UNIT ( * ) PLANE_ANGLE_UNIT ( ) SI_UNIT ( $, .RADIAN. ) );
#95 = FACE_OUTER_BOUND ( 'NONE', #98, .T. ) ;
#96 = EDGE_CURVE ( 'NONE', #736, #736, #485, .T. ) ;
#97 = AXIS2_PLACEMENT_3D ( 'NONE', #541, #647, #462 ) ;
#98 = EDGE_LOOP ( 'NONE', ( #24 ) ) ;
#99 = VERTEX_POINT ( 'NONE', #608 ) ;
#100 = FACE_OUTER_BOUND ( 'NONE', #429, .T. ) ;
#101 = EDGE_LOOP ( 'NONE', ( #307 ) ) ;
#102 =( GEOMETRIC_REPRESENTATION_CONTEXT ( 3 ) GLOBAL_UNCERTAINTY_ASSIGNED_CONTEXT ( ( #529 ) ) GLOBAL_UNIT_ASSIGNED_CONTEXT ( ( #686, #282, #624 ) ) REPRESENTATION_CONTEXT ( 'NONE', 'WORKASPACE' ) );
#103 = DIRECTION ( 'NONE',  ( -0.0000000000000000000, -0.0000000000000000000, 1.000000000000000000 ) ) ;
#104 = CARTESIAN_POINT ( 'NONE',  ( 0.0000000000000000000, 0.0000000000000000000, 8.000000000000000000 ) ) ;
#105 = DIRECTION ( 'NONE',  ( -0.0000000000000000000, -0.0000000000000000000, 1.000000000000000000 ) ) ;
#106 = FACE_BOUND ( 'NONE', #476, .T. ) ;
#107 = DIRECTION ( 'NONE',  ( -0.0000000000000000000, -0.0000000000000000000, 1.000000000000000000 ) ) ;
#108 = ORIENTED_EDGE ( 'NONE', *, *, #705, .F. ) ;
#109 = FACE_BOUND ( 'NONE', #580, .T. ) ;
#110 = EDGE_CURVE ( 'NONE', #264, #669, #491, .T. ) ;
#111 = ORIENTED_EDGE ( 'NONE', *, *, #277, .F. ) ;
#112 = APPLICATION_PROTOCOL_DEFINITION ( 'draft international standard', 'automotive_design', 1998, #449 ) ;
#113 = DIRECTION ( 'NONE',  ( 1.000000000000000000, 0.0000000000000000000, 0.0000000000000000000 ) ) ;
#114 = EDGE_LOOP ( 'NONE', ( #564 ) ) ;
#115 = VERTEX_POINT ( 'NONE', #88 ) ;
#116 = DIRECTION ( 'NONE',  ( 0.0000000000000000000, 0.0000000000000000000, -1.000000000000000000 ) ) ;
#117 = AXIS2_PLACEMENT_3D ( 'NONE', #245, #712, #422 ) ;
#118 = AXIS2_PLACEMENT_3D ( 'NONE', #606, #259, #662 ) ;
#119 = FACE_OUTER_BOUND ( 'NONE', #279, .T. ) ;
#120 = ORIENTED_EDGE ( 'NONE', *, *, #265, .T. ) ;
#121 = CARTESIAN_POINT ( 'NONE',  ( -62.50000000000000000, 5.000000000000007100, 0.0000000000000000000 ) ) ;
#122 = DIRECTION ( 'NONE',  ( 1.000000000000000000, 0.0000000000000000000, 0.0000000000000000000 ) ) ;
#123 = ADVANCED_FACE ( 'NONE', ( #539 ), #518, .F. ) ;
#124 = PLANE ( 'NONE',  #558 ) ;
#125 = DIRECTION ( 'NONE',  ( 1.000000000000000000, 0.0000000000000000000, 0.0000000000000000000 ) ) ;
#126 = CARTESIAN_POINT ( 'NONE',  ( 12.50000000000000000, 5.000000000000019500, 8.000000000000000000 ) ) ;
#127 = ADVANCED_FACE ( 'NONE', ( #483, #731 ), #612, .F. ) ;
#128 = ORIENTED_EDGE ( 'NONE', *, *, #379, .F. ) ;
#129 = EDGE_LOOP ( 'NONE', ( #327 ) ) ;
#130 = CARTESIAN_POINT ( 'NONE',  ( 12.50000000000000000, 5.000000000000019500, 0.0000000000000000000 ) ) ;
#131 = CARTESIAN_POINT ( 'NONE',  ( -12.50000000000000000, 5.000000000000016000, 8.000000000000000000 ) ) ;
#132 = FACE_BOUND ( 'NONE', #655, .T. ) ;
#133 = LINE ( 'NONE', #582, #752 ) ;
#134 = CARTESIAN_POINT ( 'NONE',  ( 0.0000000000000000000, 0.0000000000000000000, 0.0000000000000000000 ) ) ;
#135 = EDGE_CURVE ( 'NONE', #469, #233, #133, .T. ) ;
#136 = AXIS2_PLACEMENT_3D ( 'NONE', #523, #583, #122 ) ;
#137 = PLANE ( 'NONE',  #284 ) ;
#138 = ORIENTED_EDGE ( 'NONE', *, *, #31, .T. ) ;
#139 = PRODUCT_DEFINITION_CONTEXT ( 'detailed design', #281, 'design' ) ;
#140 = CARTESIAN_POINT ( 'NONE',  ( -12.50000000000000000, 5.000000000000016000, 6.500000000000000900 ) ) ;
#141 = VERTEX_POINT ( 'NONE', #314 ) ;
#142 = FACE_OUTER_BOUND ( 'NONE', #357, .T. ) ;
#143 = ORIENTED_EDGE ( 'NONE', *, *, #537, .F. ) ;
#144 = DIRECTION ( 'NONE',  ( -0.0000000000000000000, -0.0000000000000000000, 1.000000000000000000 ) ) ;
#145 = AXIS2_PLACEMENT_3D ( 'NONE', #218, #329, #568 ) ;
#146 = CARTESIAN_POINT ( 'NONE',  ( 63.75000000000000000, 5.000000000000023100, 0.0000000000000000000 ) ) ;
#147 = ORIENTED_EDGE ( 'NONE', *, *, #692, .F. ) ;
#148 = CARTESIAN_POINT ( 'NONE',  ( 38.75000000000000000, 5.000000000000019500, 0.0000000000000000000 ) ) ;
#149 = FACE_OUTER_BOUND ( 'NONE', #613, .T. ) ;
#150 = ORIENTED_EDGE ( 'NONE', *, *, #676, .T. ) ;
#151 = PRESENTATION_STYLE_ASSIGNMENT (( #337 ) ) ;
#152 = EDGE_CURVE ( 'NONE', #578, #578, #411, .T. ) ;
#153 = CARTESIAN_POINT ( 'NONE',  ( 39.50000000000000000, 5.000000000000019500, 8.000000000000000000 ) ) ;
#154 = FACE_OUTER_BOUND ( 'NONE', #569, .T. ) ;
#155 = ORIENTED_EDGE ( 'NONE', *, *, #589, .T. ) ;
#156 = CYLINDRICAL_SURFACE ( 'NONE', #136, 2.000000000000000000 ) ;
#157 = EDGE_LOOP ( 'NONE', ( #86 ) ) ;
#158 =( GEOMETRIC_REPRESENTATION_CONTEXT ( 3 ) GLOBAL_UNCERTAINTY_ASSIGNED_CONTEXT ( ( #663 ) ) GLOBAL_UNIT_ASSIGNED_CONTEXT ( ( #436, #94, #495 ) ) REPRESENTATION_CONTEXT ( 'NONE', 'WORKASPACE' ) );
#159 = CARTESIAN_POINT ( 'NONE',  ( -77.50000000000000000, 10.00000000000000000, 8.000000000000000000 ) ) ;
#160 = FACE_BOUND ( 'NONE', #347, .T. ) ;
#161 = ORIENTED_EDGE ( 'NONE', *, *, #13, .T. ) ;
#162 = DIRECTION ( 'NONE',  ( -1.000000000000000000, 0.0000000000000000000, -0.0000000000000000000 ) ) ;
#163 = ORIENTED_EDGE ( 'NONE', *, *, #221, .T. ) ;
#164 = FACE_OUTER_BOUND ( 'NONE', #129, .T. ) ;
#165 = DIRECTION ( 'NONE',  ( 1.000000000000000000, 0.0000000000000000000, 0.0000000000000000000 ) ) ;
#166 = APPLICATION_CONTEXT ( 'automotive_design' ) ;
#167 = CARTESIAN_POINT ( 'NONE',  ( 37.50000000000000000, 5.000000000000019500, 6.500000000000000900 ) ) ;
#168 = FILL_AREA_STYLE ('',( #283 ) ) ;
#169 = EDGE_LOOP ( 'NONE', ( #407, #321, #442, #150 ) ) ;
#170 = CIRCLE ( 'NONE', #118, 2.000000000000001800 ) ;
#171 = AXIS2_PLACEMENT_3D ( 'NONE', #703, #353, #639 ) ;
#172 = AXIS2_PLACEMENT_3D ( 'NONE', #351, #4, #412 ) ;
#173 = FACE_OUTER_BOUND ( 'NONE', #53, .T. ) ;
#174 = DIRECTION ( 'NONE',  ( 1.000000000000000000, 0.0000000000000000000, 0.0000000000000000000 ) ) ;
#175 = DIRECTION ( 'NONE',  ( -0.0000000000000000000, -0.0000000000000000000, 1.000000000000000000 ) ) ;
#176 = AXIS2_PLACEMENT_3D ( 'NONE', #510, #107, #447 ) ;
#177 = CARTESIAN_POINT ( 'NONE',  ( -36.25000000000000000, 5.000000000000009800, 6.500000000000000900 ) ) ;
#178 = EDGE_LOOP ( 'NONE', ( #346 ) ) ;
#179 = ADVANCED_FACE ( 'NONE', ( #11, #730, #132, #750, #594, #106, #679, #532, #160, #149 ), #475, .F. ) ;
#180 = CYLINDRICAL_SURFACE ( 'NONE', #500, 1.249999999999998900 ) ;
#181 = DIRECTION ( 'NONE',  ( 1.000000000000000000, 0.0000000000000000000, 0.0000000000000000000 ) ) ;
#182 = DIRECTION ( 'NONE',  ( 0.0000000000000000000, 1.000000000000000000, 0.0000000000000000000 ) ) ;
#183 = DIRECTION ( 'NONE',  ( 1.000000000000000000, 0.0000000000000000000, 0.0000000000000000000 ) ) ;
#184 = CARTESIAN_POINT ( 'NONE',  ( 37.50000000000000000, 5.000000000000019500, 8.000000000000000000 ) ) ;
#185 = DIRECTION ( 'NONE',  ( 1.000000000000000000, 0.0000000000000000000, 0.0000000000000000000 ) ) ;
#186 = EDGE_CURVE ( 'NONE', #425, #425, #502, .T. ) ;
#187 = ADVANCED_FACE ( 'NONE', ( #92, #499 ), #473, .F. ) ;
#188 = CYLINDRICAL_SURFACE ( 'NONE', #248, 2.000000000000001800 ) ;
#189 = COLOUR_RGB ( '',0.7921568627450980000, 0.8196078431372548800, 0.9333333333333333500 ) ;
#190 = CARTESIAN_POINT ( 'NONE',  ( -12.50000000000000000, 5.000000000000016000, 6.500000000000000900 ) ) ;
#191 = VERTEX_POINT ( 'NONE', #240 ) ;
#192 = FACE_OUTER_BOUND ( 'NONE', #466, .T. ) ;
#193 = DIRECTION ( 'NONE',  ( -1.000000000000000000, 0.0000000000000000000, -0.0000000000000000000 ) ) ;
#194 = AXIS2_PLACEMENT_3D ( 'NONE', #507, #105, #48 ) ;
#195 = FACE_OUTER_BOUND ( 'NONE', #620, .T. ) ;
#196 = CARTESIAN_POINT ( 'NONE',  ( -37.50000000000000000, 5.000000000000009800, 8.000000000000000000 ) ) ;
#197 = DIRECTION ( 'NONE',  ( 1.000000000000000000, 0.0000000000000000000, 0.0000000000000000000 ) ) ;
#198 = AXIS2_PLACEMENT_3D ( 'NONE', #602, #299, #9 ) ;
#199 = CARTESIAN_POINT ( 'NONE',  ( -77.50000000000000000, -10.00000000000000000, 8.000000000000000000 ) ) ;
#200 = VERTEX_POINT ( 'NONE', #266 ) ;
#201 = ORIENTED_EDGE ( 'NONE', *, *, #73, .T. ) ;
#202 = ORIENTED_EDGE ( 'NONE', *, *, #135, .F. ) ;
#203 = EDGE_LOOP ( 'NONE', ( #120 ) ) ;
#204 = CARTESIAN_POINT ( 'NONE',  ( 14.50000000000000000, 5.000000000000019500, 6.500000000000000900 ) ) ;
#205 = CIRCLE ( 'NONE', #616, 1.250000000000001100 ) ;
#206 = CARTESIAN_POINT ( 'NONE',  ( -61.25000000000000000, 5.000000000000007100, 6.500000000000000900 ) ) ;
#207 = CARTESIAN_POINT ( 'NONE',  ( -60.50000000000000000, 5.000000000000007100, 8.000000000000000000 ) ) ;
#208 = VECTOR ( 'NONE', #468, 1000.000000000000000 ) ;
#209 = ORIENTED_EDGE ( 'NONE', *, *, #494, .T. ) ;
#210 = FACE_OUTER_BOUND ( 'NONE', #438, .T. ) ;
#211 = ORIENTED_EDGE ( 'NONE', *, *, #737, .F. ) ;
#212 = CIRCLE ( 'NONE', #374, 1.249999999999997800 ) ;
#213 = AXIS2_PLACEMENT_3D ( 'NONE', #126, #528, #183 ) ;
#214 = DIRECTION ( 'NONE',  ( 0.0000000000000000000, -1.000000000000000000, 0.0000000000000000000 ) ) ;
#215 = VERTEX_POINT ( 'NONE', #492 ) ;
#216 = EDGE_LOOP ( 'NONE', ( #633 ) ) ;
#217 = ORIENTED_EDGE ( 'NONE', *, *, #550, .F. ) ;
#218 = CARTESIAN_POINT ( 'NONE',  ( -12.50000000000000000, 5.000000000000016000, 0.0000000000000000000 ) ) ;
#219 = FACE_BOUND ( 'NONE', #524, .T. ) ;
#220 = PLANE ( 'NONE',  #445 ) ;
#221 = EDGE_CURVE ( 'NONE', #669, #191, #701, .T. ) ;
#222 = ORIENTED_EDGE ( 'NONE', *, *, #729, .T. ) ;
#223 = APPLICATION_PROTOCOL_DEFINITION ( 'draft international standard', 'automotive_design', 1998, #394 ) ;
#224 = FACE_OUTER_BOUND ( 'NONE', #65, .T. ) ;
#225 = ORIENTED_EDGE ( 'NONE', *, *, #57, .T. ) ;
#226 = CIRCLE ( 'NONE', #176, 1.250000000000001100 ) ;
#227 = DIRECTION ( 'NONE',  ( 1.000000000000000000, 0.0000000000000000000, 0.0000000000000000000 ) ) ;
#228 = VERTEX_POINT ( 'NONE', #726 ) ;
#229 = AXIS2_PLACEMENT_3D ( 'NONE', #290, #742, #414 ) ;
#230 = STYLED_ITEM ( 'NONE', ( #35 ), #392 ) ;
#231 = EDGE_LOOP ( 'NONE', ( #434 ) ) ;
#232 = DIRECTION ( 'NONE',  ( -0.0000000000000000000, -0.0000000000000000000, 1.000000000000000000 ) ) ;
#233 = VERTEX_POINT ( 'NONE', #390 ) ;
#234 = FACE_OUTER_BOUND ( 'NONE', #675, .T. ) ;
#235 = DIRECTION ( 'NONE',  ( -0.0000000000000000000, -0.0000000000000000000, 1.000000000000000000 ) ) ;
#236 = EDGE_CURVE ( 'NONE', #270, #270, #437, .T. ) ;
#237 = ADVANCED_FACE ( 'NONE', ( #62, #300 ), #49, .F. ) ;
#238 = CARTESIAN_POINT ( 'NONE',  ( 62.50000000000000000, 5.000000000000023100, 0.0000000000000000000 ) ) ;
#239 = ADVANCED_FACE ( 'NONE', ( #247, #637 ), #180, .F. ) ;
#240 = CARTESIAN_POINT ( 'NONE',  ( 77.50000000000000000, 10.00000000000000000, 0.0000000000000000000 ) ) ;
#241 = ORIENTED_EDGE ( 'NONE', *, *, #421, .T. ) ;
#242 = LINE ( 'NONE', #367, #358 ) ;
#243 = EDGE_LOOP ( 'NONE', ( #757 ) ) ;
#244 = FACE_OUTER_BOUND ( 'NONE', #596, .T. ) ;
#245 = CARTESIAN_POINT ( 'NONE',  ( 0.0000000000000000000, 0.0000000000000000000, 8.000000000000000000 ) ) ;
#246 = DIRECTION ( 'NONE',  ( 1.000000000000000000, 0.0000000000000000000, 0.0000000000000000000 ) ) ;
#247 = FACE_OUTER_BOUND ( 'NONE', #178, .T. ) ;
#248 = AXIS2_PLACEMENT_3D ( 'NONE', #196, #103, #227 ) ;
#249 = AXIS2_PLACEMENT_3D ( 'NONE', #420, #75, #474 ) ;
#250 = CARTESIAN_POINT ( 'NONE',  ( -77.50000000000000000, -10.00000000000000000, 8.000000000000000000 ) ) ;
#251 = EDGE_LOOP ( 'NONE', ( #588 ) ) ;
#252 = VERTEX_POINT ( 'NONE', #206 ) ;
#253 = CARTESIAN_POINT ( 'NONE',  ( 77.50000000000000000, -10.00000000000000000, 8.000000000000000000 ) ) ;
#254 = CARTESIAN_POINT ( 'NONE',  ( 77.50000000000000000, 10.00000000000000000, 8.000000000000000000 ) ) ;
#255 = FACE_BOUND ( 'NONE', #101, .T. ) ;
#256 = EDGE_LOOP ( 'NONE', ( #661 ) ) ;
#257 = DIRECTION ( 'NONE',  ( -0.0000000000000000000, -0.0000000000000000000, 1.000000000000000000 ) ) ;
#258 = AXIS2_PLACEMENT_3D ( 'NONE', #51, #574, #512 ) ;
#259 = DIRECTION ( 'NONE',  ( -0.0000000000000000000, -0.0000000000000000000, 1.000000000000000000 ) ) ;
#260 = CARTESIAN_POINT ( 'NONE',  ( 1.250000000000000000, 0.0000000000000000000, 8.000000000000000000 ) ) ;
#261 = EDGE_LOOP ( 'NONE', ( #696 ) ) ;
#262 = UNCERTAINTY_MEASURE_WITH_UNIT (LENGTH_MEASURE( 1.000000000000000100E-005 ), #732, 'distance_accuracy_value', 'NONE');
#263 = FACE_BOUND ( 'NONE', #278, .T. ) ;
#264 = VERTEX_POINT ( 'NONE', #42 ) ;
#265 = EDGE_CURVE ( 'NONE', #115, #115, #205, .T. ) ;
#266 = CARTESIAN_POINT ( 'NONE',  ( 64.50000000000000000, 5.000000000000023100, 8.000000000000000000 ) ) ;
#267 = FILL_AREA_STYLE ('',( #728 ) ) ;
#268 = EDGE_CURVE ( 'NONE', #715, #715, #28, .T. ) ;
#269 = EDGE_LOOP ( 'NONE', ( #385 ) ) ;
#270 = VERTEX_POINT ( 'NONE', #432 ) ;
#271 = FACE_OUTER_BOUND ( 'NONE', #719, .T. ) ;
#272 = ORIENTED_EDGE ( 'NONE', *, *, #747, .T. ) ;
#273 = PRESENTATION_LAYER_ASSIGNMENT (  '', '', ( #230 ) ) ;
#274 = PLANE ( 'NONE',  #689 ) ;
#275 = CARTESIAN_POINT ( 'NONE',  ( -77.50000000000000000, -10.00000000000000000, 8.000000000000000000 ) ) ;
#276 = DIRECTION ( 'NONE',  ( -0.0000000000000000000, -0.0000000000000000000, 1.000000000000000000 ) ) ;
#277 = EDGE_CURVE ( 'NONE', #636, #488, #470, .T. ) ;
#278 = EDGE_LOOP ( 'NONE', ( #508 ) ) ;
#279 = EDGE_LOOP ( 'NONE', ( #84 ) ) ;
#280 = VECTOR ( 'NONE', #461, 1000.000000000000000 ) ;
#281 = APPLICATION_CONTEXT ( 'automotive_design' ) ;
#282 =( NAMED_UNIT ( * ) PLANE_ANGLE_UNIT ( ) SI_UNIT ( $, .RADIAN. ) );
#283 = FILL_AREA_STYLE_COLOUR ( '', #448 ) ;
#284 = AXIS2_PLACEMENT_3D ( 'NONE', #253, #479, #80 ) ;
#285 = AXIS2_PLACEMENT_3D ( 'NONE', #7, #416, #72 ) ;
#286 = ORIENTED_EDGE ( 'NONE', *, *, #550, .T. ) ;
#287 = VERTEX_POINT ( 'NONE', #204 ) ;
#288 = CIRCLE ( 'NONE', #366, 2.000000000000001800 ) ;
#289 = ORIENTED_EDGE ( 'NONE', *, *, #152, .F. ) ;
#290 = CARTESIAN_POINT ( 'NONE',  ( -61.25000000000000000, 5.000000000000007100, 6.500000000000000900 ) ) ;
#291 = AXIS2_PLACEMENT_3D ( 'NONE', #396, #334, #165 ) ;
#292 = ADVANCED_FACE ( 'NONE', ( #317 ), #387, .F. ) ;
#293 = DIRECTION ( 'NONE',  ( -1.000000000000000000, 0.0000000000000000000, -0.0000000000000000000 ) ) ;
#294 = DIRECTION ( 'NONE',  ( -0.0000000000000000000, -0.0000000000000000000, 1.000000000000000000 ) ) ;
#295 = EDGE_LOOP ( 'NONE', ( #706 ) ) ;
#296 = ORIENTED_EDGE ( 'NONE', *, *, #611, .T. ) ;
#297 = ADVANCED_FACE ( 'NONE', ( #621, #489 ), #400, .F. ) ;
#298 = FACE_OUTER_BOUND ( 'NONE', #295, .T. ) ;
#299 = DIRECTION ( 'NONE',  ( -0.0000000000000000000, -0.0000000000000000000, 1.000000000000000000 ) ) ;
#300 = FACE_OUTER_BOUND ( 'NONE', #674, .T. ) ;
#301 = DIRECTION ( 'NONE',  ( -0.0000000000000000000, -0.0000000000000000000, 1.000000000000000000 ) ) ;
#302 = EDGE_CURVE ( 'NONE', #561, #561, #609, .T. ) ;
#303 = CARTESIAN_POINT ( 'NONE',  ( -62.50000000000000000, 5.000000000000007100, 6.500000000000000900 ) ) ;
#304 = DIRECTION ( 'NONE',  ( 1.000000000000000000, 0.0000000000000000000, 0.0000000000000000000 ) ) ;
#305 = CIRCLE ( 'NONE', #519, 1.250000000000001100 ) ;
#306 = DIRECTION ( 'NONE',  ( 1.000000000000000000, 0.0000000000000000000, 0.0000000000000000000 ) ) ;
#307 = ORIENTED_EDGE ( 'NONE', *, *, #335, .T. ) ;
#308 = DIRECTION ( 'NONE',  ( -0.0000000000000000000, -0.0000000000000000000, -1.000000000000000000 ) ) ;
#309 = CIRCLE ( 'NONE', #14, 1.250000000000001100 ) ;
#310 = ORIENTED_EDGE ( 'NONE', *, *, #566, .T. ) ;
#311 = CARTESIAN_POINT ( 'NONE',  ( -12.50000000000000000, 5.000000000000016000, 8.000000000000000000 ) ) ;
#312 = MECHANICAL_DESIGN_GEOMETRIC_PRESENTATION_REPRESENTATION (  '', ( #230 ), #344 ) ;
#313 = EDGE_LOOP ( 'NONE', ( #217 ) ) ;
#314 = CARTESIAN_POINT ( 'NONE',  ( -36.25000000000000000, 5.000000000000009800, 0.0000000000000000000 ) ) ;
#315 = MANIFOLD_SOLID_BREP ( 'Tap Drill for M3 Tap2', #402 ) ;
#316 = ORIENTED_EDGE ( 'NONE', *, *, #721, .T. ) ;
#317 = FACE_OUTER_BOUND ( 'NONE', #377, .T. ) ;
#318 = CARTESIAN_POINT ( 'NONE',  ( -36.25000000000000000, 5.000000000000009800, 6.500000000000000900 ) ) ;
#319 = CARTESIAN_POINT ( 'NONE',  ( -35.50000000000000000, 5.000000000000009800, 6.500000000000000900 ) ) ;
#320 = SURFACE_STYLE_USAGE ( .BOTH. , #670 ) ;
#321 = ORIENTED_EDGE ( 'NONE', *, *, #57, .F. ) ;
#322 = CYLINDRICAL_SURFACE ( 'NONE', #82, 1.249999999999999300 ) ;
#323 = AXIS2_PLACEMENT_3D ( 'NONE', #238, #526, #181 ) ;
#324 = AXIS2_PLACEMENT_3D ( 'NONE', #762, #294, #700 ) ;
#325 = CIRCLE ( 'NONE', #213, 2.000000000000000000 ) ;
#326 = CARTESIAN_POINT ( 'NONE',  ( -77.50000000000000000, 10.00000000000000000, 0.0000000000000000000 ) ) ;
#327 = ORIENTED_EDGE ( 'NONE', *, *, #73, .F. ) ;
#328 = EDGE_LOOP ( 'NONE', ( #682 ) ) ;
#329 = DIRECTION ( 'NONE',  ( -0.0000000000000000000, -0.0000000000000000000, 1.000000000000000000 ) ) ;
#330 = ORIENTED_EDGE ( 'NONE', *, *, #96, .F. ) ;
#331 = VECTOR ( 'NONE', #690, 1000.000000000000000 ) ;
#332 = DIRECTION ( 'NONE',  ( 1.000000000000000000, 0.0000000000000000000, 0.0000000000000000000 ) ) ;
#333 = DIRECTION ( 'NONE',  ( 0.0000000000000000000, 0.0000000000000000000, 1.000000000000000000 ) ) ;
#334 = DIRECTION ( 'NONE',  ( -0.0000000000000000000, -0.0000000000000000000, 1.000000000000000000 ) ) ;
#335 = EDGE_CURVE ( 'NONE', #403, #403, #556, .T. ) ;
#336 = CIRCLE ( 'NONE', #323, 1.250000000000001100 ) ;
#337 = SURFACE_STYLE_USAGE ( .BOTH. , #399 ) ;
#338 = ORIENTED_EDGE ( 'NONE', *, *, #676, .F. ) ;
#339 = CYLINDRICAL_SURFACE ( 'NONE', #41, 1.250000000000001100 ) ;
#340 = DIRECTION ( 'NONE',  ( -1.000000000000000000, 0.0000000000000000000, -0.0000000000000000000 ) ) ;
#341 = CIRCLE ( 'NONE', #733, 1.250000000000001100 ) ;
#342 = DIRECTION ( 'NONE',  ( 1.000000000000000000, 0.0000000000000000000, 0.0000000000000000000 ) ) ;
#343 = CARTESIAN_POINT ( 'NONE',  ( -37.50000000000000000, 5.000000000000009800, 6.500000000000000900 ) ) ;
#344 =( GEOMETRIC_REPRESENTATION_CONTEXT ( 3 ) GLOBAL_UNCERTAINTY_ASSIGNED_CONTEXT ( ( #262 ) ) GLOBAL_UNIT_ASSIGNED_CONTEXT ( ( #732, #382, #501 ) ) REPRESENTATION_CONTEXT ( 'NONE', 'WORKASPACE' ) );
#345 = VERTEX_POINT ( 'NONE', #610 ) ;
#346 = ORIENTED_EDGE ( 'NONE', *, *, #421, .F. ) ;
#347 = EDGE_LOOP ( 'NONE', ( #3 ) ) ;
#348 = ADVANCED_FACE ( 'NONE', ( #164, #398 ), #538, .F. ) ;
#349 = ORIENTED_EDGE ( 'NONE', *, *, #452, .T. ) ;
#350 = DIRECTION ( 'NONE',  ( 1.000000000000000000, 0.0000000000000000000, 0.0000000000000000000 ) ) ;
#351 = CARTESIAN_POINT ( 'NONE',  ( -12.50000000000000000, 5.000000000000016000, 8.000000000000000000 ) ) ;
#352 = ADVANCED_FACE ( 'NONE', ( #298, #95 ), #78, .F. ) ;
#353 = DIRECTION ( 'NONE',  ( -0.0000000000000000000, -0.0000000000000000000, 1.000000000000000000 ) ) ;
#354 = DIRECTION ( 'NONE',  ( -0.0000000000000000000, -0.0000000000000000000, 1.000000000000000000 ) ) ;
#355 = DIRECTION ( 'NONE',  ( 1.000000000000000000, 0.0000000000000000000, 0.0000000000000000000 ) ) ;
#356 = LINE ( 'NONE', #17, #52 ) ;
#357 = EDGE_LOOP ( 'NONE', ( #393 ) ) ;
#358 = VECTOR ( 'NONE', #426, 1000.000000000000000 ) ;
#359 = DIRECTION ( 'NONE',  ( 1.000000000000000000, 0.0000000000000000000, 0.0000000000000000000 ) ) ;
#360 = CARTESIAN_POINT ( 'NONE',  ( -62.50000000000000000, 5.000000000000007100, 8.000000000000000000 ) ) ;
#361 = EDGE_LOOP ( 'NONE', ( #330 ) ) ;
#362 = FACE_OUTER_BOUND ( 'NONE', #77, .T. ) ;
#363 = PLANE ( 'NONE',  #481 ) ;
#364 = CARTESIAN_POINT ( 'NONE',  ( -62.50000000000000000, 5.000000000000007100, 8.000000000000000000 ) ) ;
#365 = AXIS2_PLACEMENT_3D ( 'NONE', #2, #699, #350 ) ;
#366 = AXIS2_PLACEMENT_3D ( 'NONE', #642, #301, #710 ) ;
#367 = CARTESIAN_POINT ( 'NONE',  ( 77.50000000000000000, -10.00000000000000000, 8.000000000000000000 ) ) ;
#368 = CARTESIAN_POINT ( 'NONE',  ( 0.0000000000000000000, 0.0000000000000000000, 0.0000000000000000000 ) ) ;
#369 = FACE_OUTER_BOUND ( 'NONE', #256, .T. ) ;
#370 = VERTEX_POINT ( 'NONE', #89 ) ;
#371 = ORIENTED_EDGE ( 'NONE', *, *, #650, .F. ) ;
#372 = EDGE_LOOP ( 'NONE', ( #155 ) ) ;
#373 = CARTESIAN_POINT ( 'NONE',  ( 62.50000000000000000, 5.000000000000023100, 6.500000000000000900 ) ) ;
#374 = AXIS2_PLACEMENT_3D ( 'NONE', #677, #276, #567 ) ;
#375 = CARTESIAN_POINT ( 'NONE',  ( -60.50000000000000000, 5.000000000000007100, 6.500000000000000900 ) ) ;
#376 = CARTESIAN_POINT ( 'NONE',  ( 39.50000000000000000, 5.000000000000019500, 6.500000000000000900 ) ) ;
#377 = EDGE_LOOP ( 'NONE', ( #161, #657, #415, #225 ) ) ;
#378 = LINE ( 'NONE', #714, #668 ) ;
#379 = EDGE_CURVE ( 'NONE', #252, #252, #226, .T. ) ;
#380 = EDGE_LOOP ( 'NONE', ( #418 ) ) ;
#381 = FACE_BOUND ( 'NONE', #114, .T. ) ;
#382 =( NAMED_UNIT ( * ) PLANE_ANGLE_UNIT ( ) SI_UNIT ( $, .RADIAN. ) );
#383 = AXIS2_PLACEMENT_3D ( 'NONE', #471, #460, #755 ) ;
#384 = VERTEX_POINT ( 'NONE', #318 ) ;
#385 = ORIENTED_EDGE ( 'NONE', *, *, #152, .T. ) ;
#386 = PRODUCT_DEFINITION ( 'UNKNOWN', '', #659, #139 ) ;
#387 = PLANE ( 'NONE',  #542 ) ;
#388 = EDGE_LOOP ( 'NONE', ( #296 ) ) ;
#389 = DIRECTION ( 'NONE',  ( 1.000000000000000000, 0.0000000000000000000, 0.0000000000000000000 ) ) ;
#390 = CARTESIAN_POINT ( 'NONE',  ( -77.50000000000000000, -10.00000000000000000, 0.0000000000000000000 ) ) ;
#391 = DIRECTION ( 'NONE',  ( -1.000000000000000000, 0.0000000000000000000, -0.0000000000000000000 ) ) ;
#392 = ADVANCED_BREP_SHAPE_REPRESENTATION ( 'heatsink_bar', ( #315, #463 ), #158 ) ;
#393 = ORIENTED_EDGE ( 'NONE', *, *, #265, .F. ) ;
#394 = APPLICATION_CONTEXT ( 'automotive_design' ) ;
#395 = FACE_OUTER_BOUND ( 'NONE', #727, .T. ) ;
#396 = CARTESIAN_POINT ( 'NONE',  ( 12.50000000000000000, 5.000000000000019500, 8.000000000000000000 ) ) ;
#397 = EDGE_LOOP ( 'NONE', ( #128 ) ) ;
#398 = FACE_OUTER_BOUND ( 'NONE', #231, .T. ) ;
#399 = SURFACE_SIDE_STYLE ('',( #6 ) ) ;
#400 = PLANE ( 'NONE',  #581 ) ;
#401 = AXIS2_PLACEMENT_3D ( 'NONE', #704, #354, #640 ) ;
#402 = CLOSED_SHELL ( 'NONE', ( #8, #472, #123, #292, #179, #643, #352, #69, #530, #702, #419, #127, #585, #297, #467, #237, #187, #638, #348, #70, #1, #708, #413, #631, #590, #525, #239 ) ) ;
#403 = VERTEX_POINT ( 'NONE', #551 ) ;
#404 = FACE_OUTER_BOUND ( 'NONE', #646, .T. ) ;
#405 = DIRECTION ( 'NONE',  ( 1.000000000000000000, 0.0000000000000000000, 0.0000000000000000000 ) ) ;
#406 = FACE_OUTER_BOUND ( 'NONE', #25, .T. ) ;
#407 = ORIENTED_EDGE ( 'NONE', *, *, #135, .T. ) ;
#408 = AXIS2_PLACEMENT_3D ( 'NONE', #681, #678, #162 ) ;
#409 = DIRECTION ( 'NONE',  ( 0.0000000000000000000, 0.0000000000000000000, 1.000000000000000000 ) ) ;
#410 = CARTESIAN_POINT ( 'NONE',  ( 13.75000000000000200, 5.000000000000019500, 6.500000000000000900 ) ) ;
#411 = CIRCLE ( 'NONE', #758, 2.000000000000001800 ) ;
#412 = DIRECTION ( 'NONE',  ( 1.000000000000000000, 0.0000000000000000000, 0.0000000000000000000 ) ) ;
#413 = ADVANCED_FACE ( 'NONE', ( #687, #671 ), #220, .F. ) ;
#414 = DIRECTION ( 'NONE',  ( -1.000000000000000000, 0.0000000000000000000, -0.0000000000000000000 ) ) ;
#415 = ORIENTED_EDGE ( 'NONE', *, *, #747, .F. ) ;
#416 = DIRECTION ( 'NONE',  ( -0.0000000000000000000, -0.0000000000000000000, 1.000000000000000000 ) ) ;
#417 = FACE_BOUND ( 'NONE', #45, .T. ) ;
#418 = ORIENTED_EDGE ( 'NONE', *, *, #566, .F. ) ;
#419 = ADVANCED_FACE ( 'NONE', ( #381, #362 ), #745, .F. ) ;
#420 = CARTESIAN_POINT ( 'NONE',  ( 37.50000000000000000, 5.000000000000019500, 8.000000000000000000 ) ) ;
#421 = EDGE_CURVE ( 'NONE', #99, #99, #212, .T. ) ;
#422 = DIRECTION ( 'NONE',  ( -1.000000000000000000, 0.0000000000000000000, -0.0000000000000000000 ) ) ;
#423 = DIRECTION ( 'NONE',  ( 1.000000000000000000, 0.0000000000000000000, 0.0000000000000000000 ) ) ;
#424 = ORIENTED_EDGE ( 'NONE', *, *, #604, .F. ) ;
#425 = VERTEX_POINT ( 'NONE', #27 ) ;
#426 = DIRECTION ( 'NONE',  ( 0.0000000000000000000, 1.000000000000000000, 0.0000000000000000000 ) ) ;
#427 = AXIS2_PLACEMENT_3D ( 'NONE', #516, #453, #55 ) ;
#428 = FACE_BOUND ( 'NONE', #26, .T. ) ;
#429 = EDGE_LOOP ( 'NONE', ( #289 ) ) ;
#430 = AXIS2_PLACEMENT_3D ( 'NONE', #33, #333, #748 ) ;
#431 = DIRECTION ( 'NONE',  ( 1.000000000000000000, 0.0000000000000000000, 0.0000000000000000000 ) ) ;
#432 = CARTESIAN_POINT ( 'NONE',  ( 51.25000000000000700, 0.0000000000000000000, 8.000000000000000000 ) ) ;
#433 = ORIENTED_EDGE ( 'NONE', *, *, #692, .T. ) ;
#434 = ORIENTED_EDGE ( 'NONE', *, *, #509, .T. ) ;
#435 = CARTESIAN_POINT ( 'NONE',  ( 14.50000000000000000, 5.000000000000019500, 8.000000000000000000 ) ) ;
#436 =( LENGTH_UNIT ( ) NAMED_UNIT ( * ) SI_UNIT ( .MILLI., .METRE. ) );
#437 = CIRCLE ( 'NONE', #198, 1.250000000000001100 ) ;
#438 = EDGE_LOOP ( 'NONE', ( #90 ) ) ;
#439 = SURFACE_STYLE_FILL_AREA ( #267 ) ;
#440 = AXIS2_PLACEMENT_3D ( 'NONE', #190, #593, #246 ) ;
#441 = FACE_OUTER_BOUND ( 'NONE', #607, .T. ) ;
#442 = ORIENTED_EDGE ( 'NONE', *, *, #688, .F. ) ;
#443 = CARTESIAN_POINT ( 'NONE',  ( -77.50000000000000000, 10.00000000000000000, 8.000000000000000000 ) ) ;
#444 = DIRECTION ( 'NONE',  ( -0.0000000000000000000, -0.0000000000000000000, 1.000000000000000000 ) ) ;
#445 = AXIS2_PLACEMENT_3D ( 'NONE', #571, #50, #391 ) ;
#446 = EDGE_LOOP ( 'NONE', ( #68 ) ) ;
#447 = DIRECTION ( 'NONE',  ( 1.000000000000000000, 0.0000000000000000000, 0.0000000000000000000 ) ) ;
#448 = COLOUR_RGB ( '',0.7921568627450980000, 0.8196078431372548800, 0.9333333333333333500 ) ;
#449 = APPLICATION_CONTEXT ( 'automotive_design' ) ;
#450 = CARTESIAN_POINT ( 'NONE',  ( -77.50000000000000000, -10.00000000000000000, 8.000000000000000000 ) ) ;
#451 = FACE_BOUND ( 'NONE', #203, .T. ) ;
#452 = EDGE_CURVE ( 'NONE', #693, #693, #59, .T. ) ;
#453 = DIRECTION ( 'NONE',  ( -0.0000000000000000000, -0.0000000000000000000, 1.000000000000000000 ) ) ;
#454 = EDGE_LOOP ( 'NONE', ( #459 ) ) ;
#455 = VERTEX_POINT ( 'NONE', #720 ) ;
#456 = CARTESIAN_POINT ( 'NONE',  ( 63.75000000000000000, 5.000000000000023100, 6.500000000000000900 ) ) ;
#457 = PRODUCT_DEFINITION_SHAPE ( 'NONE', 'NONE',  #547 ) ;
#458 = FACE_OUTER_BOUND ( 'NONE', #36, .T. ) ;
#459 = ORIENTED_EDGE ( 'NONE', *, *, #186, .T. ) ;
#460 = DIRECTION ( 'NONE',  ( -0.0000000000000000000, -0.0000000000000000000, 1.000000000000000000 ) ) ;
#461 = DIRECTION ( 'NONE',  ( -0.0000000000000000000, -0.0000000000000000000, -1.000000000000000000 ) ) ;
#462 = DIRECTION ( 'NONE',  ( 1.000000000000000000, 0.0000000000000000000, 0.0000000000000000000 ) ) ;
#463 = AXIS2_PLACEMENT_3D ( 'NONE', #368, #409, #680 ) ;
#464 = DIRECTION ( 'NONE',  ( -0.0000000000000000000, -0.0000000000000000000, 1.000000000000000000 ) ) ;
#465 = ORIENTED_EDGE ( 'NONE', *, *, #236, .T. ) ;
#466 = EDGE_LOOP ( 'NONE', ( #740 ) ) ;
#467 = ADVANCED_FACE ( 'NONE', ( #244, #517 ), #38, .F. ) ;
#468 = DIRECTION ( 'NONE',  ( -0.0000000000000000000, -0.0000000000000000000, -1.000000000000000000 ) ) ;
#469 = VERTEX_POINT ( 'NONE', #326 ) ;
#470 = LINE ( 'NONE', #443, #331 ) ;
#471 = CARTESIAN_POINT ( 'NONE',  ( -62.50000000000000000, 5.000000000000007100, 8.000000000000000000 ) ) ;
#472 = ADVANCED_FACE ( 'NONE', ( #628 ), #274, .F. ) ;
#473 = PLANE ( 'NONE',  #229 ) ;
#474 = DIRECTION ( 'NONE',  ( 1.000000000000000000, 0.0000000000000000000, 0.0000000000000000000 ) ) ;
#475 = PLANE ( 'NONE',  #117 ) ;
#476 = EDGE_LOOP ( 'NONE', ( #371 ) ) ;
#477 = CIRCLE ( 'NONE', #717, 2.000000000000001800 ) ;
#478 = FACE_OUTER_BOUND ( 'NONE', #724, .T. ) ;
#479 = DIRECTION ( 'NONE',  ( -1.000000000000000000, 0.0000000000000000000, 0.0000000000000000000 ) ) ;
#480 = CARTESIAN_POINT ( 'NONE',  ( -77.50000000000000000, -10.00000000000000000, 8.000000000000000000 ) ) ;
#481 = AXIS2_PLACEMENT_3D ( 'NONE', #410, #634, #293 ) ;
#482 = CARTESIAN_POINT ( 'NONE',  ( 37.50000000000000000, 5.000000000000019500, 8.000000000000000000 ) ) ;
#483 = FACE_OUTER_BOUND ( 'NONE', #313, .T. ) ;
#484 = DIRECTION ( 'NONE',  ( -1.000000000000000000, -0.0000000000000000000, -0.0000000000000000000 ) ) ;
#485 = CIRCLE ( 'NONE', #598, 1.250000000000001100 ) ;
#486 = FACE_OUTER_BOUND ( 'NONE', #533, .T. ) ;
#487 = ORIENTED_EDGE ( 'NONE', *, *, #763, .T. ) ;
#488 = VERTEX_POINT ( 'NONE', #43 ) ;
#489 = FACE_OUTER_BOUND ( 'NONE', #446, .T. ) ;
#490 = CARTESIAN_POINT ( 'NONE',  ( 38.75000000000000000, 5.000000000000019500, 6.500000000000000900 ) ) ;
#491 = LINE ( 'NONE', #761, #280 ) ;
#492 = CARTESIAN_POINT ( 'NONE',  ( -35.50000000000000000, 5.000000000000009800, 8.000000000000000000 ) ) ;
#493 = FACE_BOUND ( 'NONE', #243, .T. ) ;
#494 = EDGE_CURVE ( 'NONE', #543, #543, #498, .T. ) ;
#495 =( NAMED_UNIT ( * ) SI_UNIT ( $, .STERADIAN. ) SOLID_ANGLE_UNIT ( ) );
#496 = ORIENTED_EDGE ( 'NONE', *, *, #31, .F. ) ;
#497 = FACE_OUTER_BOUND ( 'NONE', #515, .T. ) ;
#498 = CIRCLE ( 'NONE', #722, 1.250000000000001100 ) ;
#499 = FACE_OUTER_BOUND ( 'NONE', #269, .T. ) ;
#500 = AXIS2_PLACEMENT_3D ( 'NONE', #709, #691, #355 ) ;
#501 =( NAMED_UNIT ( * ) SI_UNIT ( $, .STERADIAN. ) SOLID_ANGLE_UNIT ( ) );
#502 = CIRCLE ( 'NONE', #81, 1.249999999999997600 ) ;
#503 = VERTEX_POINT ( 'NONE', #207 ) ;
#504 = ORIENTED_EDGE ( 'NONE', *, *, #60, .F. ) ;
#505 = CARTESIAN_POINT ( 'NONE',  ( 50.00000000000000000, 0.0000000000000000000, 0.0000000000000000000 ) ) ;
#506 = EDGE_LOOP ( 'NONE', ( #626 ) ) ;
#507 = CARTESIAN_POINT ( 'NONE',  ( 62.50000000000000000, 5.000000000000023100, 8.000000000000000000 ) ) ;
#508 = ORIENTED_EDGE ( 'NONE', *, *, #96, .T. ) ;
#509 = EDGE_CURVE ( 'NONE', #384, #384, #341, .T. ) ;
#510 = CARTESIAN_POINT ( 'NONE',  ( -62.50000000000000000, 5.000000000000007100, 6.500000000000000900 ) ) ;
#511 = PRODUCT_CONTEXT ( 'NONE', #449, 'mechanical' ) ;
#512 = DIRECTION ( 'NONE',  ( 1.000000000000000000, 0.0000000000000000000, 0.0000000000000000000 ) ) ;
#513 = ORIENTED_EDGE ( 'NONE', *, *, #302, .T. ) ;
#514 = LINE ( 'NONE', #254, #649 ) ;
#515 = EDGE_LOOP ( 'NONE', ( #552 ) ) ;
#516 = CARTESIAN_POINT ( 'NONE',  ( 37.50000000000000000, 5.000000000000019500, 0.0000000000000000000 ) ) ;
#517 = FACE_OUTER_BOUND ( 'NONE', #746, .T. ) ;
#518 = PLANE ( 'NONE',  #716 ) ;
#519 = AXIS2_PLACEMENT_3D ( 'NONE', #697, #232, #630 ) ;
#520 = AXIS2_PLACEMENT_3D ( 'NONE', #364, #18, #423 ) ;
#521 = DIRECTION ( 'NONE',  ( 1.000000000000000000, 0.0000000000000000000, 0.0000000000000000000 ) ) ;
#522 = VERTEX_POINT ( 'NONE', #435 ) ;
#523 = CARTESIAN_POINT ( 'NONE',  ( 12.50000000000000000, 5.000000000000019500, 8.000000000000000000 ) ) ;
#524 = EDGE_LOOP ( 'NONE', ( #753 ) ) ;
#525 = ADVANCED_FACE ( 'NONE', ( #478, #651 ), #615, .F. ) ;
#526 = DIRECTION ( 'NONE',  ( -0.0000000000000000000, -0.0000000000000000000, 1.000000000000000000 ) ) ;
#527 = DIRECTION ( 'NONE',  ( 0.0000000000000000000, -0.0000000000000000000, 1.000000000000000000 ) ) ;
#528 = DIRECTION ( 'NONE',  ( -0.0000000000000000000, -0.0000000000000000000, 1.000000000000000000 ) ) ;
#529 = UNCERTAINTY_MEASURE_WITH_UNIT (LENGTH_MEASURE( 1.000000000000000100E-005 ), #686, 'distance_accuracy_value', 'NONE');
#530 = ADVANCED_FACE ( 'NONE', ( #195, #458 ), #156, .F. ) ;
#531 = DIRECTION ( 'NONE',  ( -0.0000000000000000000, -0.0000000000000000000, 1.000000000000000000 ) ) ;
#532 = FACE_BOUND ( 'NONE', #667, .T. ) ;
#533 = EDGE_LOOP ( 'NONE', ( #163, #108, #147, #546 ) ) ;
#534 = CIRCLE ( 'NONE', #672, 1.250000000000001100 ) ;
#535 = DIRECTION ( 'NONE',  ( -0.0000000000000000000, -0.0000000000000000000, 1.000000000000000000 ) ) ;
#536 = ORIENTED_EDGE ( 'NONE', *, *, #221, .F. ) ;
#537 = EDGE_CURVE ( 'NONE', #228, #228, #309, .T. ) ;
#538 = CYLINDRICAL_SURFACE ( 'NONE', #258, 1.250000000000001100 ) ;
#539 = FACE_OUTER_BOUND ( 'NONE', #169, .T. ) ;
#540 = DIRECTION ( 'NONE',  ( -0.0000000000000000000, -0.0000000000000000000, 1.000000000000000000 ) ) ;
#541 = CARTESIAN_POINT ( 'NONE',  ( -50.00000000000000000, 0.0000000000000000000, 8.000000000000000000 ) ) ;
#542 = AXIS2_PLACEMENT_3D ( 'NONE', #450, #182, #527 ) ;
#543 = VERTEX_POINT ( 'NONE', #665 ) ;
#544 = EDGE_LOOP ( 'NONE', ( #316, #338, #111, #560 ) ) ;
#545 = CYLINDRICAL_SURFACE ( 'NONE', #559, 2.000000000000000000 ) ;
#546 = ORIENTED_EDGE ( 'NONE', *, *, #110, .T. ) ;
#547 = PRODUCT_DEFINITION ( 'UNKNOWN', '', #584, #39 ) ;
#548 = PRODUCT ( 'heatsink_bar', 'heatsink_bar', '', ( #623 ) ) ;
#549 = CARTESIAN_POINT ( 'NONE',  ( 62.50000000000000000, 5.000000000000023100, 6.500000000000000900 ) ) ;
#550 = EDGE_CURVE ( 'NONE', #83, #83, #19, .T. ) ;
#551 = CARTESIAN_POINT ( 'NONE',  ( -11.25000000000000400, 5.000000000000016000, 0.0000000000000000000 ) ) ;
#552 = ORIENTED_EDGE ( 'NONE', *, *, #335, .F. ) ;
#553 = FACE_BOUND ( 'NONE', #454, .T. ) ;
#554 = CARTESIAN_POINT ( 'NONE',  ( -10.50000000000000000, 5.000000000000016000, 6.500000000000000900 ) ) ;
#555 = EDGE_LOOP ( 'NONE', ( #684 ) ) ;
#556 = CIRCLE ( 'NONE', #145, 1.249999999999997600 ) ;
#557 = PRODUCT_DEFINITION_SHAPE ( 'NONE', 'NONE',  #386 ) ;
#558 = AXIS2_PLACEMENT_3D ( 'NONE', #177, #587, #66 ) ;
#559 = AXIS2_PLACEMENT_3D ( 'NONE', #131, #531, #185 ) ;
#560 = ORIENTED_EDGE ( 'NONE', *, *, #705, .T. ) ;
#561 = VERTEX_POINT ( 'NONE', #148 ) ;
#562 = EDGE_LOOP ( 'NONE', ( #349 ) ) ;
#563 = CIRCLE ( 'NONE', #249, 2.000000000000001800 ) ;
#564 = ORIENTED_EDGE ( 'NONE', *, *, #268, .F. ) ;
#565 = DIRECTION ( 'NONE',  ( 0.0000000000000000000, -0.0000000000000000000, -1.000000000000000000 ) ) ;
#566 = EDGE_CURVE ( 'NONE', #673, #673, #756, .T. ) ;
#567 = DIRECTION ( 'NONE',  ( 1.000000000000000000, 0.0000000000000000000, 0.0000000000000000000 ) ) ;
#568 = DIRECTION ( 'NONE',  ( 1.000000000000000000, 0.0000000000000000000, 0.0000000000000000000 ) ) ;
#569 = EDGE_LOOP ( 'NONE', ( #487 ) ) ;
#570 = FACE_BOUND ( 'NONE', #711, .T. ) ;
#571 = CARTESIAN_POINT ( 'NONE',  ( -11.25000000000000000, 5.000000000000016000, 6.500000000000000900 ) ) ;
#572 = ORIENTED_EDGE ( 'NONE', *, *, #611, .F. ) ;
#573 = APPLICATION_PROTOCOL_DEFINITION ( 'draft international standard', 'automotive_design', 1998, #166 ) ;
#574 = DIRECTION ( 'NONE',  ( -0.0000000000000000000, -0.0000000000000000000, 1.000000000000000000 ) ) ;
#575 = EDGE_CURVE ( 'NONE', #522, #522, #325, .T. ) ;
#576 = DIRECTION ( 'NONE',  ( -0.0000000000000000000, -0.0000000000000000000, 1.000000000000000000 ) ) ;
#577 = ORIENTED_EDGE ( 'NONE', *, *, #236, .F. ) ;
#578 = VERTEX_POINT ( 'NONE', #375 ) ;
#579 = CYLINDRICAL_SURFACE ( 'NONE', #324, 1.250000000000001100 ) ;
#580 = EDGE_LOOP ( 'NONE', ( #138 ) ) ;
#581 = AXIS2_PLACEMENT_3D ( 'NONE', #456, #751, #340 ) ;
#582 = CARTESIAN_POINT ( 'NONE',  ( -77.50000000000000000, -10.00000000000000000, 0.0000000000000000000 ) ) ;
#583 = DIRECTION ( 'NONE',  ( -0.0000000000000000000, -0.0000000000000000000, 1.000000000000000000 ) ) ;
#584 = PRODUCT_DEFINITION_FORMATION_WITH_SPECIFIED_SOURCE ( 'ANY', '', #660, .NOT_KNOWN. ) ;
#585 = ADVANCED_FACE ( 'NONE', ( #173, #441 ), #579, .F. ) ;
#586 = CARTESIAN_POINT ( 'NONE',  ( 37.50000000000000000, 5.000000000000019500, 6.500000000000000900 ) ) ;
#587 = DIRECTION ( 'NONE',  ( 0.0000000000000000000, 0.0000000000000000000, -1.000000000000000000 ) ) ;
#588 = ORIENTED_EDGE ( 'NONE', *, *, #622, .T. ) ;
#589 = EDGE_CURVE ( 'NONE', #370, #370, #738, .T. ) ;
#590 = ADVANCED_FACE ( 'NONE', ( #142, #271 ), #718, .F. ) ;
#591 = ORIENTED_EDGE ( 'NONE', *, *, #277, .T. ) ;
#592 = DIRECTION ( 'NONE',  ( -0.0000000000000000000, -0.0000000000000000000, 1.000000000000000000 ) ) ;
#593 = DIRECTION ( 'NONE',  ( -0.0000000000000000000, -0.0000000000000000000, 1.000000000000000000 ) ) ;
#594 = FACE_BOUND ( 'NONE', #735, .T. ) ;
#595 = CARTESIAN_POINT ( 'NONE',  ( 77.50000000000000000, -10.00000000000000000, 0.0000000000000000000 ) ) ;
#596 = EDGE_LOOP ( 'NONE', ( #211 ) ) ;
#597 = DIRECTION ( 'NONE',  ( -0.0000000000000000000, -0.0000000000000000000, 1.000000000000000000 ) ) ;
#598 = AXIS2_PLACEMENT_3D ( 'NONE', #121, #175, #342 ) ;
#599 = AXIS2_PLACEMENT_3D ( 'NONE', #360, #10, #304 ) ;
#600 = CIRCLE ( 'NONE', #440, 2.000000000000000000 ) ;
#601 = ORIENTED_EDGE ( 'NONE', *, *, #721, .F. ) ;
#602 = CARTESIAN_POINT ( 'NONE',  ( 50.00000000000000000, 0.0000000000000000000, 8.000000000000000000 ) ) ;
#603 = DIRECTION ( 'NONE',  ( 1.000000000000000000, 0.0000000000000000000, 0.0000000000000000000 ) ) ;
#604 = EDGE_CURVE ( 'NONE', #215, #215, #288, .T. ) ;
#605 = CARTESIAN_POINT ( 'NONE',  ( 62.50000000000000000, 5.000000000000023100, 8.000000000000000000 ) ) ;
#606 = CARTESIAN_POINT ( 'NONE',  ( -37.50000000000000000, 5.000000000000009800, 6.500000000000000900 ) ) ;
#607 = EDGE_LOOP ( 'NONE', ( #209 ) ) ;
#608 = CARTESIAN_POINT ( 'NONE',  ( 1.249999999999997800, 0.0000000000000000000, 0.0000000000000000000 ) ) ;
#609 = CIRCLE ( 'NONE', #427, 1.250000000000001100 ) ;
#610 = CARTESIAN_POINT ( 'NONE',  ( -11.25000000000000000, 5.000000000000016000, 6.500000000000000900 ) ) ;
#611 = EDGE_CURVE ( 'NONE', #64, #64, #563, .T. ) ;
#612 = CYLINDRICAL_SURFACE ( 'NONE', #40, 2.000000000000001800 ) ;
#613 = EDGE_LOOP ( 'NONE', ( #433, #591, #694, #272 ) ) ;
#614 = CIRCLE ( 'NONE', #759, 2.000000000000001800 ) ;
#615 = CYLINDRICAL_SURFACE ( 'NONE', #97, 1.250000000000001100 ) ;
#616 = AXIS2_PLACEMENT_3D ( 'NONE', #505, #743, #332 ) ;
#617 = PRODUCT_RELATED_PRODUCT_CATEGORY ( 'part', '', ( #660 ) ) ;
#618 = ORIENTED_EDGE ( 'NONE', *, *, #537, .T. ) ;
#619 = ORIENTED_EDGE ( 'NONE', *, *, #302, .F. ) ;
#620 = EDGE_LOOP ( 'NONE', ( #504 ) ) ;
#621 = FACE_BOUND ( 'NONE', #216, .T. ) ;
#622 = EDGE_CURVE ( 'NONE', #656, #656, #600, .T. ) ;
#623 = PRODUCT_CONTEXT ( 'NONE', #394, 'mechanical' ) ;
#624 =( NAMED_UNIT ( * ) SI_UNIT ( $, .STERADIAN. ) SOLID_ANGLE_UNIT ( ) );
#625 = VECTOR ( 'NONE', #71, 1000.000000000000000 ) ;
#626 = ORIENTED_EDGE ( 'NONE', *, *, #729, .F. ) ;
#627 = VECTOR ( 'NONE', #484, 1000.000000000000000 ) ;
#628 = FACE_OUTER_BOUND ( 'NONE', #544, .T. ) ;
#629 = AXIS2_PLACEMENT_3D ( 'NONE', #134, #648, #193 ) ;
#630 = DIRECTION ( 'NONE',  ( 1.000000000000000000, 0.0000000000000000000, 0.0000000000000000000 ) ) ;
#631 = ADVANCED_FACE ( 'NONE', ( #119, #406 ), #545, .F. ) ;
#632 = VERTEX_POINT ( 'NONE', #319 ) ;
#633 = ORIENTED_EDGE ( 'NONE', *, *, #494, .F. ) ;
#634 = DIRECTION ( 'NONE',  ( 0.0000000000000000000, 0.0000000000000000000, -1.000000000000000000 ) ) ;
#635 = DIRECTION ( 'NONE',  ( 1.000000000000000000, 0.0000000000000000000, 0.0000000000000000000 ) ) ;
#636 = VERTEX_POINT ( 'NONE', #713 ) ;
#637 = FACE_OUTER_BOUND ( 'NONE', #562, .T. ) ;
#638 = ADVANCED_FACE ( 'NONE', ( #100, #695 ), #725, .F. ) ;
#639 = DIRECTION ( 'NONE',  ( 1.000000000000000000, 0.0000000000000000000, 0.0000000000000000000 ) ) ;
#640 = DIRECTION ( 'NONE',  ( 1.000000000000000000, 0.0000000000000000000, 0.0000000000000000000 ) ) ;
#641 = DIRECTION ( 'NONE',  ( -0.0000000000000000000, -1.000000000000000000, -0.0000000000000000000 ) ) ;
#642 = CARTESIAN_POINT ( 'NONE',  ( -37.50000000000000000, 5.000000000000009800, 8.000000000000000000 ) ) ;
#643 = ADVANCED_FACE ( 'NONE', ( #428, #570, #451, #255, #417, #263, #109, #707, #553, #395 ), #79, .T. ) ;
#644 = LINE ( 'NONE', #250, #208 ) ;
#645 = DIRECTION ( 'NONE',  ( -0.0000000000000000000, -0.0000000000000000000, 1.000000000000000000 ) ) ;
#646 = EDGE_LOOP ( 'NONE', ( #56 ) ) ;
#647 = DIRECTION ( 'NONE',  ( -0.0000000000000000000, -0.0000000000000000000, 1.000000000000000000 ) ) ;
#648 = DIRECTION ( 'NONE',  ( 0.0000000000000000000, 0.0000000000000000000, -1.000000000000000000 ) ) ;
#649 = VECTOR ( 'NONE', #653, 1000.000000000000000 ) ;
#650 = EDGE_CURVE ( 'NONE', #503, #503, #683, .T. ) ;
#651 = FACE_OUTER_BOUND ( 'NONE', #372, .T. ) ;
#652 = DIRECTION ( 'NONE',  ( -0.0000000000000000000, -1.000000000000000000, -0.0000000000000000000 ) ) ;
#653 = DIRECTION ( 'NONE',  ( -0.0000000000000000000, -0.0000000000000000000, -1.000000000000000000 ) ) ;
#654 = AXIS2_PLACEMENT_3D ( 'NONE', #167, #749, #113 ) ;
#655 = EDGE_LOOP ( 'NONE', ( #577 ) ) ;
#656 = VERTEX_POINT ( 'NONE', #554 ) ;
#657 = ORIENTED_EDGE ( 'NONE', *, *, #110, .F. ) ;
#658 = DIRECTION ( 'NONE',  ( 1.000000000000000000, 0.0000000000000000000, 0.0000000000000000000 ) ) ;
#659 = PRODUCT_DEFINITION_FORMATION_WITH_SPECIFIED_SOURCE ( 'ANY', '', #548, .NOT_KNOWN. ) ;
#660 = PRODUCT ( 'heatsink_bar', 'heatsink_bar', '', ( #511 ) ) ;
#661 = ORIENTED_EDGE ( 'NONE', *, *, #763, .F. ) ;
#662 = DIRECTION ( 'NONE',  ( 1.000000000000000000, 0.0000000000000000000, 0.0000000000000000000 ) ) ;
#663 = UNCERTAINTY_MEASURE_WITH_UNIT (LENGTH_MEASURE( 1.000000000000000100E-005 ), #436, 'distance_accuracy_value', 'NONE');
#664 = EDGE_CURVE ( 'NONE', #345, #345, #534, .T. ) ;
#665 = CARTESIAN_POINT ( 'NONE',  ( 63.75000000000000000, 5.000000000000023100, 6.500000000000000900 ) ) ;
#666 = CARTESIAN_POINT ( 'NONE',  ( 64.50000000000000000, 5.000000000000023100, 6.500000000000000900 ) ) ;
#667 = EDGE_LOOP ( 'NONE', ( #572 ) ) ;
#668 = VECTOR ( 'NONE', #308, 1000.000000000000000 ) ;
#669 = VERTEX_POINT ( 'NONE', #595 ) ;
#670 = SURFACE_SIDE_STYLE ('',( #439 ) ) ;
#671 = FACE_OUTER_BOUND ( 'NONE', #251, .T. ) ;
#672 = AXIS2_PLACEMENT_3D ( 'NONE', #140, #540, #197 ) ;
#673 = VERTEX_POINT ( 'NONE', #32 ) ;
#674 = EDGE_LOOP ( 'NONE', ( #93 ) ) ;
#675 = EDGE_LOOP ( 'NONE', ( #15 ) ) ;
#676 = EDGE_CURVE ( 'NONE', #488, #469, #378, .T. ) ;
#677 = CARTESIAN_POINT ( 'NONE',  ( 0.0000000000000000000, 0.0000000000000000000, 0.0000000000000000000 ) ) ;
#678 = DIRECTION ( 'NONE',  ( 0.0000000000000000000, 0.0000000000000000000, -1.000000000000000000 ) ) ;
#679 = FACE_BOUND ( 'NONE', #506, .T. ) ;
#680 = DIRECTION ( 'NONE',  ( 1.000000000000000000, 0.0000000000000000000, 0.0000000000000000000 ) ) ;
#681 = CARTESIAN_POINT ( 'NONE',  ( 38.75000000000000000, 5.000000000000019500, 6.500000000000000900 ) ) ;
#682 = ORIENTED_EDGE ( 'NONE', *, *, #650, .T. ) ;
#683 = CIRCLE ( 'NONE', #520, 2.000000000000001800 ) ;
#684 = ORIENTED_EDGE ( 'NONE', *, *, #664, .F. ) ;
#685 = APPLICATION_PROTOCOL_DEFINITION ( 'draft international standard', 'automotive_design', 1998, #281 ) ;
#686 =( LENGTH_UNIT ( ) NAMED_UNIT ( * ) SI_UNIT ( .MILLI., .METRE. ) );
#687 = FACE_BOUND ( 'NONE', #555, .T. ) ;
#688 = EDGE_CURVE ( 'NONE', #488, #5, #76, .T. ) ;
#689 = AXIS2_PLACEMENT_3D ( 'NONE', #159, #214, #565 ) ;
#690 = DIRECTION ( 'NONE',  ( -1.000000000000000000, -0.0000000000000000000, -0.0000000000000000000 ) ) ;
#691 = DIRECTION ( 'NONE',  ( -0.0000000000000000000, -0.0000000000000000000, 1.000000000000000000 ) ) ;
#692 = EDGE_CURVE ( 'NONE', #264, #636, #242, .T. ) ;
#693 = VERTEX_POINT ( 'NONE', #260 ) ;
#694 = ORIENTED_EDGE ( 'NONE', *, *, #688, .T. ) ;
#695 = FACE_OUTER_BOUND ( 'NONE', #328, .T. ) ;
#696 = ORIENTED_EDGE ( 'NONE', *, *, #589, .F. ) ;
#697 = CARTESIAN_POINT ( 'NONE',  ( -37.50000000000000000, 5.000000000000009800, 0.0000000000000000000 ) ) ;
#698 = PRODUCT_RELATED_PRODUCT_CATEGORY ( 'part', '', ( #548 ) ) ;
#699 = DIRECTION ( 'NONE',  ( -0.0000000000000000000, -0.0000000000000000000, 1.000000000000000000 ) ) ;
#700 = DIRECTION ( 'NONE',  ( 1.000000000000000000, 0.0000000000000000000, 0.0000000000000000000 ) ) ;
#701 = LINE ( 'NONE', #12, #625 ) ;
#702 = ADVANCED_FACE ( 'NONE', ( #224, #210 ), #339, .F. ) ;
#703 = CARTESIAN_POINT ( 'NONE',  ( 12.50000000000000000, 5.000000000000019500, 6.500000000000000900 ) ) ;
#704 = CARTESIAN_POINT ( 'NONE',  ( 50.00000000000000000, 0.0000000000000000000, 8.000000000000000000 ) ) ;
#705 = EDGE_CURVE ( 'NONE', #636, #191, #514, .T. ) ;
#706 = ORIENTED_EDGE ( 'NONE', *, *, #186, .F. ) ;
#707 = FACE_BOUND ( 'NONE', #74, .T. ) ;
#708 = ADVANCED_FACE ( 'NONE', ( #497, #192 ), #322, .F. ) ;
#709 = CARTESIAN_POINT ( 'NONE',  ( 0.0000000000000000000, 0.0000000000000000000, 8.000000000000000000 ) ) ;
#710 = DIRECTION ( 'NONE',  ( 1.000000000000000000, 0.0000000000000000000, 0.0000000000000000000 ) ) ;
#711 = EDGE_LOOP ( 'NONE', ( #618 ) ) ;
#712 = DIRECTION ( 'NONE',  ( 0.0000000000000000000, 0.0000000000000000000, -1.000000000000000000 ) ) ;
#713 = CARTESIAN_POINT ( 'NONE',  ( 77.50000000000000000, 10.00000000000000000, 8.000000000000000000 ) ) ;
#714 = CARTESIAN_POINT ( 'NONE',  ( -77.50000000000000000, 10.00000000000000000, 8.000000000000000000 ) ) ;
#715 = VERTEX_POINT ( 'NONE', #490 ) ;
#716 = AXIS2_PLACEMENT_3D ( 'NONE', #46, #61, #116 ) ;
#717 = AXIS2_PLACEMENT_3D ( 'NONE', #605, #257, #658 ) ;
#718 = CYLINDRICAL_SURFACE ( 'NONE', #401, 1.250000000000001100 ) ;
#719 = EDGE_LOOP ( 'NONE', ( #465 ) ) ;
#720 = CARTESIAN_POINT ( 'NONE',  ( 13.75000000000000200, 5.000000000000019500, 6.500000000000000900 ) ) ;
#721 = EDGE_CURVE ( 'NONE', #191, #469, #54, .T. ) ;
#722 = AXIS2_PLACEMENT_3D ( 'NONE', #549, #576, #739 ) ;
#723 = CARTESIAN_POINT ( 'NONE',  ( -61.25000000000000000, 5.000000000000007100, 0.0000000000000000000 ) ) ;
#724 = EDGE_LOOP ( 'NONE', ( #143 ) ) ;
#725 = CYLINDRICAL_SURFACE ( 'NONE', #599, 2.000000000000001800 ) ;
#726 = CARTESIAN_POINT ( 'NONE',  ( -48.75000000000000000, 0.0000000000000000000, 0.0000000000000000000 ) ) ;
#727 = EDGE_LOOP ( 'NONE', ( #536, #744, #202, #601 ) ) ;
#728 = FILL_AREA_STYLE_COLOUR ( '', #189 ) ;
#729 = EDGE_CURVE ( 'NONE', #200, #200, #477, .T. ) ;
#730 = FACE_BOUND ( 'NONE', #261, .T. ) ;
#731 = FACE_OUTER_BOUND ( 'NONE', #388, .T. ) ;
#732 =( LENGTH_UNIT ( ) NAMED_UNIT ( * ) SI_UNIT ( .MILLI., .METRE. ) );
#733 = AXIS2_PLACEMENT_3D ( 'NONE', #343, #760, #405 ) ;
#734 = SHAPE_DEFINITION_REPRESENTATION ( #557, #392 ) ;
#735 = EDGE_LOOP ( 'NONE', ( #424 ) ) ;
#736 = VERTEX_POINT ( 'NONE', #723 ) ;
#737 = EDGE_CURVE ( 'NONE', #44, #44, #614, .T. ) ;
#738 = CIRCLE ( 'NONE', #285, 1.250000000000001100 ) ;
#739 = DIRECTION ( 'NONE',  ( 1.000000000000000000, 0.0000000000000000000, 0.0000000000000000000 ) ) ;
#740 = ORIENTED_EDGE ( 'NONE', *, *, #664, .T. ) ;
#741 = STYLED_ITEM ( 'NONE', ( #151 ), #315 ) ;
#742 = DIRECTION ( 'NONE',  ( 0.0000000000000000000, 0.0000000000000000000, -1.000000000000000000 ) ) ;
#743 = DIRECTION ( 'NONE',  ( -0.0000000000000000000, -0.0000000000000000000, 1.000000000000000000 ) ) ;
#744 = ORIENTED_EDGE ( 'NONE', *, *, #13, .F. ) ;
#745 = PLANE ( 'NONE',  #408 ) ;
#746 = EDGE_LOOP ( 'NONE', ( #222 ) ) ;
#747 = EDGE_CURVE ( 'NONE', #5, #264, #16, .T. ) ;
#748 = DIRECTION ( 'NONE',  ( 1.000000000000000000, 0.0000000000000000000, 0.0000000000000000000 ) ) ;
#749 = DIRECTION ( 'NONE',  ( -0.0000000000000000000, -0.0000000000000000000, 1.000000000000000000 ) ) ;
#750 = FACE_BOUND ( 'NONE', #380, .T. ) ;
#751 = DIRECTION ( 'NONE',  ( 0.0000000000000000000, 0.0000000000000000000, -1.000000000000000000 ) ) ;
#752 = VECTOR ( 'NONE', #641, 1000.000000000000000 ) ;
#753 = ORIENTED_EDGE ( 'NONE', *, *, #509, .F. ) ;
#754 = VERTEX_POINT ( 'NONE', #146 ) ;
#755 = DIRECTION ( 'NONE',  ( 1.000000000000000000, 0.0000000000000000000, 0.0000000000000000000 ) ) ;
#756 = CIRCLE ( 'NONE', #172, 2.000000000000000000 ) ;
#757 = ORIENTED_EDGE ( 'NONE', *, *, #20, .F. ) ;
#758 = AXIS2_PLACEMENT_3D ( 'NONE', #303, #645, #359 ) ;
#759 = AXIS2_PLACEMENT_3D ( 'NONE', #373, #23, #431 ) ;
#760 = DIRECTION ( 'NONE',  ( -0.0000000000000000000, -0.0000000000000000000, 1.000000000000000000 ) ) ;
#761 = CARTESIAN_POINT ( 'NONE',  ( 77.50000000000000000, -10.00000000000000000, 8.000000000000000000 ) ) ;
#762 = CARTESIAN_POINT ( 'NONE',  ( 62.50000000000000000, 5.000000000000023100, 8.000000000000000000 ) ) ;
#763 = EDGE_CURVE ( 'NONE', #632, #632, #170, .T. ) ;
ENDSEC;
END-ISO-10303-21;
