Drill report for C:\Users\Maji\KiCad\CANbus_adapter\CANbus_adapter.kicad_pcb
Created on 03/07/2020 13:35:16

Copper Layer Stackup:
    =============================================================
    L1 :  F.Cu                      front
    L2 :  B.Cu                      back


Drill file 'CANbus_adapter.drl' contains
    plated through holes:
    =============================================================
    T1  0.60mm  0.024"  (19 holes)
    T2  1.00mm  0.039"  (30 holes)

    Total plated holes count 49


Not plated through holes are merged with plated holes
    unplated through holes:
    =============================================================
    T3  3.35mm  0.132"  (4 holes)

    Total unplated holes count 4
