EESchema Schematic File Version 4
EELAYER 30 0
EELAYER END
$Descr A4 11693 8268
encoding utf-8
Sheet 1 1
Title "CAN bus ADAPTER"
Date "2019-04-30"
Rev "A"
Comp "Cavendish Laboratory"
Comment1 ""
Comment2 "http://git.mrao.cam.ac.uk/shc44/can-bus"
Comment3 "to Bus Pirate v3 or Raspberry Pi I2C"
Comment4 "Adapter for the HERA pseudo CAN bus"
$EndDescr
$Comp
L myLibrary:PCA9600 U2
U 1 1 5CC99C71
P 7150 4800
F 0 "U2" H 7050 5350 50  0000 L CNN
F 1 "PCA9600" H 6800 5250 50  0000 L CNN
F 2 "Package_SO:TSSOP-8_3x3mm_P0.65mm" H 7150 4800 50  0001 C CNN
F 3 "" H 7150 4800 50  0001 C CNN
F 4 "NXP" H 7150 4800 50  0001 C CNN "Mfg. Name"
F 5 "PCA9600DP" H 7150 4800 50  0001 C CNN "Mfg. Part No."
F 6 "Digi-Key" H 7150 4800 50  0001 C CNN "Distrib. Name"
F 7 "568-4716-1-ND" H 7150 4800 50  0001 C CNN "Distrib. Part No."
	1    7150 4800
	-1   0    0    -1  
$EndComp
$Comp
L Device:R R2
U 1 1 5CCAE50A
P 4100 3700
F 0 "R2" H 4170 3746 50  0000 L CNN
F 1 "1k2" H 4170 3655 50  0000 L CNN
F 2 "Resistor_SMD:R_0805_2012Metric" V 4030 3700 50  0001 C CNN
F 3 "~" H 4100 3700 50  0001 C CNN
F 4 "Digi-Key" H 4100 3700 50  0001 C CNN "Distrib. Name"
F 5 "311-1.20KCRCT-ND" H 4100 3700 50  0001 C CNN "Distrib. Part No."
	1    4100 3700
	1    0    0    -1  
$EndComp
$Comp
L Device:R R4
U 1 1 5CCAF90F
P 4100 4100
F 0 "R4" H 4170 4146 50  0000 L CNN
F 1 "1k2" H 4170 4055 50  0000 L CNN
F 2 "Resistor_SMD:R_0805_2012Metric" V 4030 4100 50  0001 C CNN
F 3 "~" H 4100 4100 50  0001 C CNN
F 4 "Digi-Key" H 4100 4100 50  0001 C CNN "Distrib. Name"
F 5 "311-1.20KCRCT-ND" H 4100 4100 50  0001 C CNN "Distrib. Part No."
	1    4100 4100
	1    0    0    -1  
$EndComp
$Comp
L Device:R R8
U 1 1 5CCB0221
P 4100 5300
F 0 "R8" H 4170 5346 50  0000 L CNN
F 1 "1k2" H 4170 5255 50  0000 L CNN
F 2 "Resistor_SMD:R_0805_2012Metric" V 4030 5300 50  0001 C CNN
F 3 "~" H 4100 5300 50  0001 C CNN
F 4 "Digi-Key" H 4100 5300 50  0001 C CNN "Distrib. Name"
F 5 "311-1.20KCRCT-ND" H 4100 5300 50  0001 C CNN "Distrib. Part No."
	1    4100 5300
	1    0    0    -1  
$EndComp
$Comp
L Device:R R12
U 1 1 5CCB107A
P 4100 5750
F 0 "R12" H 4170 5796 50  0000 L CNN
F 1 "1k2" H 4170 5705 50  0000 L CNN
F 2 "Resistor_SMD:R_0805_2012Metric" V 4030 5750 50  0001 C CNN
F 3 "~" H 4100 5750 50  0001 C CNN
F 4 "Digi-Key" H 4100 5750 50  0001 C CNN "Distrib. Name"
F 5 "311-1.20KCRCT-ND" H 4100 5750 50  0001 C CNN "Distrib. Part No."
	1    4100 5750
	1    0    0    -1  
$EndComp
$Comp
L Device:C C4
U 1 1 5CCB14ED
P 4450 5650
F 0 "C4" H 4565 5696 50  0000 L CNN
F 1 "47n" H 4565 5605 50  0000 L CNN
F 2 "Capacitor_SMD:C_0805_2012Metric" H 4488 5500 50  0001 C CNN
F 3 "~" H 4450 5650 50  0001 C CNN
F 4 "Digi-Key" H 4450 5650 50  0001 C CNN "Distrib. Name"
F 5 "399-1166-1-ND" H 4450 5650 50  0001 C CNN "Distrib. Part No."
	1    4450 5650
	1    0    0    -1  
$EndComp
$Comp
L Device:C C3
U 1 1 5CCB1D06
P 4450 4050
F 0 "C3" H 4565 4096 50  0000 L CNN
F 1 "47n" H 4565 4005 50  0000 L CNN
F 2 "Capacitor_SMD:C_0805_2012Metric" H 4488 3900 50  0001 C CNN
F 3 "~" H 4450 4050 50  0001 C CNN
F 4 "Digi-Key" H 4450 4050 50  0001 C CNN "Distrib. Name"
F 5 "399-1166-1-ND" H 4450 4050 50  0001 C CNN "Distrib. Part No."
	1    4450 4050
	1    0    0    -1  
$EndComp
Wire Wire Line
	4100 5600 4100 5500
Wire Wire Line
	4100 5500 4450 5500
Connection ~ 4100 5500
Wire Wire Line
	4100 5500 4100 5450
Wire Wire Line
	4100 3850 4100 3900
Wire Wire Line
	4100 3900 4450 3900
Connection ~ 4100 3900
Wire Wire Line
	4100 3900 4100 3950
Wire Wire Line
	4950 5500 4750 5500
Wire Wire Line
	4750 5500 4750 5100
Wire Wire Line
	4750 5100 4100 5100
Wire Wire Line
	4100 5100 4100 5150
Connection ~ 4100 5100
Wire Wire Line
	4100 5100 3600 5100
Wire Wire Line
	4750 6050 4100 6050
Wire Wire Line
	4750 6050 4750 5700
Wire Wire Line
	4750 5700 4950 5700
$Comp
L power:GND #PWR018
U 1 1 5CCBE815
P 4950 6000
F 0 "#PWR018" H 4950 5750 50  0001 C CNN
F 1 "GND" H 4955 5827 50  0000 C CNN
F 2 "" H 4950 6000 50  0001 C CNN
F 3 "" H 4950 6000 50  0001 C CNN
	1    4950 6000
	1    0    0    -1  
$EndComp
Wire Wire Line
	4950 5900 4950 6000
Wire Wire Line
	4100 5900 4100 6050
Connection ~ 4100 6050
Wire Wire Line
	4100 6050 3600 6050
$Comp
L myLibrary:PCA82C251 U3
U 1 1 5CCC321D
P 5350 5600
F 0 "U3" H 5550 6150 50  0000 R CNN
F 1 "PCA82C251" H 5550 6050 50  0000 R CNN
F 2 "Package_SO:SOIC-8_3.9x4.9mm_P1.27mm" H 5350 5550 50  0001 C CNN
F 3 "http://www.nxp.com/documents/data_sheet/PCA82C251.pdf" H 5350 5550 50  0001 C CNN
F 4 "NXP" H 5350 5600 50  0001 C CNN "Mfg. Name"
F 5 "PCA82C251T" H 5350 5600 50  0001 C CNN "Mfg. Part No."
F 6 "Digi-Key" H 5350 5600 50  0001 C CNN "Distrib. Name"
F 7 "568-8673-1-ND" H 5350 5600 50  0001 C CNN "Distrib. Part No."
	1    5350 5600
	-1   0    0    -1  
$EndComp
$Comp
L myLibrary:PCA82C251 U1
U 1 1 5CCC56BD
P 5350 4000
F 0 "U1" H 5550 4550 50  0000 R CNN
F 1 "PCA82C251" H 5550 4450 50  0000 R CNN
F 2 "Package_SO:SOIC-8_3.9x4.9mm_P1.27mm" H 5350 3950 50  0001 C CNN
F 3 "http://www.nxp.com/documents/data_sheet/PCA82C251.pdf" H 5350 3950 50  0001 C CNN
F 4 "NXP" H 5350 4000 50  0001 C CNN "Mfg. Name"
F 5 "PCA82C251T" H 5350 4000 50  0001 C CNN "Mfg. Part No."
F 6 "Digi-Key" H 5350 4000 50  0001 C CNN "Distrib. Name"
F 7 "568-8673-1-ND" H 5350 4000 50  0001 C CNN "Distrib. Part No."
	1    5350 4000
	-1   0    0    -1  
$EndComp
$Comp
L power:GND #PWR011
U 1 1 5CCB3569
P 4950 4400
F 0 "#PWR011" H 4950 4150 50  0001 C CNN
F 1 "GND" H 4955 4227 50  0000 C CNN
F 2 "" H 4950 4400 50  0001 C CNN
F 3 "" H 4950 4400 50  0001 C CNN
	1    4950 4400
	1    0    0    -1  
$EndComp
Wire Wire Line
	4950 4300 4950 4400
Wire Wire Line
	4950 4100 4750 4100
Wire Wire Line
	4750 4100 4750 4450
Wire Wire Line
	4750 4450 4100 4450
Wire Wire Line
	4950 3900 4750 3900
Wire Wire Line
	4750 3900 4750 3500
Wire Wire Line
	4750 3500 4100 3500
Wire Wire Line
	4100 3500 4100 3550
Connection ~ 4100 3500
Wire Wire Line
	4100 4250 4100 4450
Connection ~ 4100 4450
Wire Wire Line
	4100 4450 3700 4450
Wire Wire Line
	6750 4500 6650 4500
Wire Wire Line
	6650 4500 6650 3900
Wire Wire Line
	6650 3900 5750 3900
Wire Wire Line
	6750 4700 6550 4700
Wire Wire Line
	6550 4700 6550 4300
Wire Wire Line
	6550 4300 5750 4300
Wire Wire Line
	6750 4900 6250 4900
Wire Wire Line
	6250 4900 6250 5500
Wire Wire Line
	6250 5500 5750 5500
Wire Wire Line
	6750 5100 6350 5100
Wire Wire Line
	6350 5100 6350 5900
Wire Wire Line
	6350 5900 5750 5900
$Comp
L Device:R R7
U 1 1 5CCDDE15
P 6250 4700
F 0 "R7" H 6320 4746 50  0000 L CNN
F 1 "10k" H 6320 4655 50  0000 L CNN
F 2 "Resistor_SMD:R_0805_2012Metric" V 6180 4700 50  0001 C CNN
F 3 "~" H 6250 4700 50  0001 C CNN
F 4 "Digi-Key" H 6250 4700 50  0001 C CNN "Distrib. Name"
F 5 "311-10.0KCRCT-ND" H 6250 4700 50  0001 C CNN "Distrib. Part No."
	1    6250 4700
	1    0    0    -1  
$EndComp
$Comp
L Device:R R3
U 1 1 5CCDE645
P 6650 3700
F 0 "R3" H 6720 3746 50  0000 L CNN
F 1 "10k" H 6720 3655 50  0000 L CNN
F 2 "Resistor_SMD:R_0805_2012Metric" V 6580 3700 50  0001 C CNN
F 3 "~" H 6650 3700 50  0001 C CNN
F 4 "Digi-Key" H 6650 3700 50  0001 C CNN "Distrib. Name"
F 5 "311-10.0KCRCT-ND" H 6650 3700 50  0001 C CNN "Distrib. Part No."
	1    6650 3700
	1    0    0    -1  
$EndComp
$Comp
L power:+5V #PWR04
U 1 1 5CCE0551
P 5850 3550
F 0 "#PWR04" H 5850 3400 50  0001 C CNN
F 1 "+5V" H 5865 3723 50  0000 C CNN
F 2 "" H 5850 3550 50  0001 C CNN
F 3 "" H 5850 3550 50  0001 C CNN
	1    5850 3550
	1    0    0    -1  
$EndComp
$Comp
L power:+5V #PWR016
U 1 1 5CCE2921
P 5850 5250
F 0 "#PWR016" H 5850 5100 50  0001 C CNN
F 1 "+5V" H 5865 5423 50  0000 C CNN
F 2 "" H 5850 5250 50  0001 C CNN
F 3 "" H 5850 5250 50  0001 C CNN
	1    5850 5250
	1    0    0    -1  
$EndComp
$Comp
L power:+5V #PWR012
U 1 1 5CCE3229
P 6250 4550
F 0 "#PWR012" H 6250 4400 50  0001 C CNN
F 1 "+5V" H 6265 4723 50  0000 C CNN
F 2 "" H 6250 4550 50  0001 C CNN
F 3 "" H 6250 4550 50  0001 C CNN
	1    6250 4550
	1    0    0    -1  
$EndComp
$Comp
L power:+5V #PWR05
U 1 1 5CCE38FD
P 6650 3550
F 0 "#PWR05" H 6650 3400 50  0001 C CNN
F 1 "+5V" H 6665 3723 50  0000 C CNN
F 2 "" H 6650 3550 50  0001 C CNN
F 3 "" H 6650 3550 50  0001 C CNN
	1    6650 3550
	1    0    0    -1  
$EndComp
$Comp
L power:+5V #PWR010
U 1 1 5CCE4400
P 7050 4200
F 0 "#PWR010" H 7050 4050 50  0001 C CNN
F 1 "+5V" H 7065 4373 50  0000 C CNN
F 2 "" H 7050 4200 50  0001 C CNN
F 3 "" H 7050 4200 50  0001 C CNN
	1    7050 4200
	1    0    0    -1  
$EndComp
Wire Wire Line
	6250 4850 6250 4900
Connection ~ 6250 4900
Wire Wire Line
	6650 3850 6650 3900
Connection ~ 6650 3900
Wire Wire Line
	5850 5300 5850 5250
Wire Wire Line
	5750 5300 5850 5300
Wire Wire Line
	5750 3700 5850 3700
Wire Wire Line
	5850 3700 5850 3550
$Comp
L power:GND #PWR015
U 1 1 5CCF8D4F
P 7600 5200
F 0 "#PWR015" H 7600 4950 50  0001 C CNN
F 1 "GND" H 7605 5027 50  0000 C CNN
F 2 "" H 7600 5200 50  0001 C CNN
F 3 "" H 7600 5200 50  0001 C CNN
	1    7600 5200
	1    0    0    -1  
$EndComp
$Comp
L Device:R R5
U 1 1 5CD13513
P 3700 4150
F 0 "R5" H 3770 4196 50  0000 L CNN
F 1 "100R" H 3770 4105 50  0000 L CNN
F 2 "Resistor_SMD:R_0805_2012Metric" V 3630 4150 50  0001 C CNN
F 3 "~" H 3700 4150 50  0001 C CNN
F 4 "Digi-Key" H 3700 4150 50  0001 C CNN "Distrib. Name"
F 5 "311-100CRCT-ND" H 3700 4150 50  0001 C CNN "Distrib. Part No."
	1    3700 4150
	1    0    0    -1  
$EndComp
$Comp
L Device:R R11
U 1 1 5CD13C6C
P 3600 5750
F 0 "R11" H 3670 5796 50  0000 L CNN
F 1 "100R" H 3670 5705 50  0000 L CNN
F 2 "Resistor_SMD:R_0805_2012Metric" V 3530 5750 50  0001 C CNN
F 3 "~" H 3600 5750 50  0001 C CNN
F 4 "Digi-Key" H 3600 5750 50  0001 C CNN "Distrib. Name"
F 5 "311-100CRCT-ND" H 3600 5750 50  0001 C CNN "Distrib. Part No."
	1    3600 5750
	1    0    0    -1  
$EndComp
$Comp
L Device:Jumper_NO_Small JP2
U 1 1 5CD15213
P 3700 3750
F 0 "JP2" V 3654 3798 50  0000 L CNN
F 1 "Term" V 3745 3798 50  0000 L CNN
F 2 "Connector_PinHeader_2.54mm:PinHeader_1x02_P2.54mm_Vertical" H 3700 3750 50  0001 C CNN
F 3 "~" H 3700 3750 50  0001 C CNN
F 4 "Digi-Key" V 3700 3750 50  0001 C CNN "Distrib. Name"
F 5 "S1011EC-02-ND" V 3700 3750 50  0001 C CNN "Distrib. Part No."
	1    3700 3750
	0    1    1    0   
$EndComp
$Comp
L Device:Jumper_NO_Small JP3
U 1 1 5CD18072
P 3600 5350
F 0 "JP3" V 3554 5398 50  0000 L CNN
F 1 "Term" V 3645 5398 50  0000 L CNN
F 2 "Connector_PinHeader_2.54mm:PinHeader_1x02_P2.54mm_Vertical" H 3600 5350 50  0001 C CNN
F 3 "~" H 3600 5350 50  0001 C CNN
F 4 "Digi-Key" V 3600 5350 50  0001 C CNN "Distrib. Name"
F 5 "S1011EC-02-ND" V 3600 5350 50  0001 C CNN "Distrib. Part No."
	1    3600 5350
	0    1    1    0   
$EndComp
Wire Wire Line
	4100 3500 3700 3500
Wire Wire Line
	3700 3500 3700 3650
Connection ~ 3700 3500
Wire Wire Line
	3700 3500 3550 3500
Wire Wire Line
	3700 3850 3700 4000
Wire Wire Line
	3700 4300 3700 4450
Connection ~ 3700 4450
Wire Wire Line
	3700 4450 3450 4450
Wire Wire Line
	3600 5100 3600 5250
Connection ~ 3600 5100
Wire Wire Line
	3600 5100 3250 5100
Wire Wire Line
	3600 5450 3600 5600
Wire Wire Line
	3600 5900 3600 6050
Connection ~ 3600 6050
Wire Wire Line
	3600 6050 3150 6050
Wire Wire Line
	7550 4500 7750 4500
Wire Wire Line
	7550 4900 8050 4900
Wire Wire Line
	9350 5500 9350 4750
Wire Wire Line
	9350 4750 8950 4750
$Comp
L power:GND #PWR014
U 1 1 5CD44007
P 9050 5100
F 0 "#PWR014" H 9050 4850 50  0001 C CNN
F 1 "GND" H 9055 4927 50  0000 C CNN
F 2 "" H 9050 5100 50  0001 C CNN
F 3 "" H 9050 5100 50  0001 C CNN
	1    9050 5100
	1    0    0    -1  
$EndComp
Wire Wire Line
	9050 5050 9050 5100
Wire Wire Line
	8300 5400 9250 5400
Wire Wire Line
	9250 5400 9250 4850
Wire Wire Line
	9250 4850 8950 4850
$Comp
L Device:C C1
U 1 1 5CD4E68E
P 7950 2050
F 0 "C1" H 8065 2096 50  0000 L CNN
F 1 "100n" H 8065 2005 50  0000 L CNN
F 2 "Capacitor_SMD:C_0805_2012Metric" H 7988 1900 50  0001 C CNN
F 3 "~" H 7950 2050 50  0001 C CNN
F 4 "Digi-Key" H 7950 2050 50  0001 C CNN "Distrib. Name"
F 5 "478-1395-1-ND" H 7950 2050 50  0001 C CNN "Distrib. Part No."
	1    7950 2050
	1    0    0    -1  
$EndComp
Wire Wire Line
	9050 2200 9050 2250
Wire Wire Line
	9050 2250 8500 2250
Wire Wire Line
	7950 2200 7950 2250
Wire Wire Line
	9550 3200 9550 4950
Wire Wire Line
	9550 4950 8950 4950
$Comp
L Device:C C2
U 1 1 5CD51D18
P 8500 2050
F 0 "C2" H 8615 2096 50  0000 L CNN
F 1 "100n" H 8615 2005 50  0000 L CNN
F 2 "Capacitor_SMD:C_0805_2012Metric" H 8538 1900 50  0001 C CNN
F 3 "~" H 8500 2050 50  0001 C CNN
F 4 "Digi-Key" H 8500 2050 50  0001 C CNN "Distrib. Name"
F 5 "478-1395-1-ND" H 8500 2050 50  0001 C CNN "Distrib. Part No."
	1    8500 2050
	1    0    0    -1  
$EndComp
Wire Wire Line
	9050 1900 9050 1850
$Comp
L Device:R R6
U 1 1 5CD9E375
P 5850 4550
F 0 "R6" H 5920 4596 50  0000 L CNN
F 1 "68k" H 5920 4505 50  0000 L CNN
F 2 "Resistor_SMD:R_0805_2012Metric" V 5780 4550 50  0001 C CNN
F 3 "~" H 5850 4550 50  0001 C CNN
F 4 "Digi-Key" H 5850 4550 50  0001 C CNN "Distrib. Name"
F 5 "311-68.0KCRCT-ND" H 5850 4550 50  0001 C CNN "Distrib. Part No."
	1    5850 4550
	1    0    0    -1  
$EndComp
$Comp
L Device:R R13
U 1 1 5CD9EF46
P 5850 6150
F 0 "R13" H 5920 6196 50  0000 L CNN
F 1 "68k" H 5920 6105 50  0000 L CNN
F 2 "Resistor_SMD:R_0805_2012Metric" V 5780 6150 50  0001 C CNN
F 3 "~" H 5850 6150 50  0001 C CNN
F 4 "Digi-Key" H 5850 6150 50  0001 C CNN "Distrib. Name"
F 5 "311-68.0KCRCT-ND" H 5850 6150 50  0001 C CNN "Distrib. Part No."
	1    5850 6150
	1    0    0    -1  
$EndComp
Wire Wire Line
	5850 6000 5850 5700
Wire Wire Line
	5850 5700 5750 5700
Wire Wire Line
	5850 4400 5850 4100
Wire Wire Line
	5850 4100 5750 4100
$Comp
L power:GND #PWR013
U 1 1 5CDAD3CF
P 5850 4700
F 0 "#PWR013" H 5850 4450 50  0001 C CNN
F 1 "GND" H 5855 4527 50  0000 C CNN
F 2 "" H 5850 4700 50  0001 C CNN
F 3 "" H 5850 4700 50  0001 C CNN
	1    5850 4700
	1    0    0    -1  
$EndComp
$Comp
L power:GND #PWR021
U 1 1 5CDAD6AE
P 5850 6300
F 0 "#PWR021" H 5850 6050 50  0001 C CNN
F 1 "GND" H 5855 6127 50  0000 C CNN
F 2 "" H 5850 6300 50  0001 C CNN
F 3 "" H 5850 6300 50  0001 C CNN
	1    5850 6300
	1    0    0    -1  
$EndComp
NoConn ~ 8950 4650
NoConn ~ 8450 4950
NoConn ~ 8450 4850
NoConn ~ 8450 4650
NoConn ~ 4950 5300
NoConn ~ 4950 3700
Text Label 8450 4750 2    50   ~ 0
MOSI
Text Label 8950 4750 0    50   ~ 0
CLK
$Comp
L power:Earth #PWR09
U 1 1 5CDF5FD9
P 4450 4200
F 0 "#PWR09" H 4450 3950 50  0001 C CNN
F 1 "Earth" H 4450 4050 50  0001 C CNN
F 2 "" H 4450 4200 50  0001 C CNN
F 3 "~" H 4450 4200 50  0001 C CNN
	1    4450 4200
	1    0    0    -1  
$EndComp
$Comp
L power:Earth #PWR017
U 1 1 5CDF68A5
P 4450 5800
F 0 "#PWR017" H 4450 5550 50  0001 C CNN
F 1 "Earth" H 4450 5650 50  0001 C CNN
F 2 "" H 4450 5800 50  0001 C CNN
F 3 "~" H 4450 5800 50  0001 C CNN
	1    4450 5800
	1    0    0    -1  
$EndComp
Connection ~ 4950 2950
Wire Wire Line
	4950 2950 4950 3000
Wire Wire Line
	4950 2950 4950 2850
Wire Wire Line
	4650 2950 4950 2950
Wire Wire Line
	4650 2900 4650 2950
Wire Wire Line
	4650 2550 4350 2550
Connection ~ 4650 2550
Wire Wire Line
	4650 2550 4650 2600
Connection ~ 4350 2550
Wire Wire Line
	4950 2550 4650 2550
Wire Wire Line
	4950 2650 4950 2550
$Comp
L Device:R R1
U 1 1 5CE1A41E
P 4650 2750
F 0 "R1" H 4720 2796 50  0000 L CNN
F 1 "10k" H 4720 2705 50  0000 L CNN
F 2 "Resistor_SMD:R_0805_2012Metric" V 4580 2750 50  0001 C CNN
F 3 "~" H 4650 2750 50  0001 C CNN
F 4 "Digi-Key" H 4650 2750 50  0001 C CNN "Distrib. Name"
F 5 "311-10.0KCRCT-ND" H 4650 2750 50  0001 C CNN "Distrib. Part No."
	1    4650 2750
	1    0    0    -1  
$EndComp
$Comp
L Device:Jumper_NO_Small JP1
U 1 1 5CE04AB0
P 4950 2750
F 0 "JP1" V 4904 2798 50  0000 L CNN
F 1 "Ground" V 4995 2798 50  0000 L CNN
F 2 "Connector_PinHeader_2.54mm:PinHeader_1x02_P2.54mm_Vertical" H 4950 2750 50  0001 C CNN
F 3 "~" H 4950 2750 50  0001 C CNN
F 4 "Digi-Key" V 4950 2750 50  0001 C CNN "Distrib. Name"
F 5 "S1011EC-02-ND" V 4950 2750 50  0001 C CNN "Distrib. Part No."
	1    4950 2750
	0    1    1    0   
$EndComp
$Comp
L power:GND #PWR03
U 1 1 5CDFE42C
P 4950 3000
F 0 "#PWR03" H 4950 2750 50  0001 C CNN
F 1 "GND" H 4955 2827 50  0000 C CNN
F 2 "" H 4950 3000 50  0001 C CNN
F 3 "" H 4950 3000 50  0001 C CNN
	1    4950 3000
	1    0    0    -1  
$EndComp
Wire Wire Line
	4350 2600 4350 2550
$Comp
L power:Earth #PWR02
U 1 1 5CDEF88D
P 4350 2600
F 0 "#PWR02" H 4350 2350 50  0001 C CNN
F 1 "Earth" H 4350 2450 50  0001 C CNN
F 2 "" H 4350 2600 50  0001 C CNN
F 3 "~" H 4350 2600 50  0001 C CNN
	1    4350 2600
	1    0    0    -1  
$EndComp
Wire Wire Line
	3150 1950 3950 1950
Connection ~ 3150 1950
Wire Wire Line
	3250 1850 3950 1850
Connection ~ 3250 1850
Connection ~ 3450 1650
Wire Wire Line
	3450 4450 3450 2850
Wire Wire Line
	3550 1550 3950 1550
Connection ~ 3550 1550
Wire Wire Line
	3550 3500 3550 2750
Wire Wire Line
	3150 6050 3150 3050
Wire Wire Line
	3250 5100 3250 2950
$Comp
L myLibrary:RJ45_CANbus J2
U 1 1 5CCA1428
P 4350 1950
F 0 "J2" H 4150 2600 50  0000 L CNN
F 1 "CAN Bus" H 4150 2500 50  0000 L CNN
F 2 "SamacSys_Parts:09455511100" H 4350 1950 50  0001 C CNN
F 3 "https://b2b.harting.com/ebusiness/en_us/RJI-RJ45-jack-Cat-5-SMT-angled/09455511100" H 4350 1950 50  0001 C CNN
F 4 "Harting" H 4350 1950 50  0001 C CNN "Mfg. Name"
F 5 "09455511100" H 4350 1950 50  0001 C CNN "Mfg. Part No."
F 6 "Digi-Key" H 4350 1950 50  0001 C CNN "Distrib. Name"
F 7 "1195-3699-ND" H 4350 1950 50  0001 C CNN "Distrib. Part No."
	1    4350 1950
	1    0    0    -1  
$EndComp
$Comp
L Connector:Conn_01x04_Male J3
U 1 1 5CE41C3A
P 2700 2850
F 0 "J3" H 2700 3150 50  0000 L CNN
F 1 "CAN Bus" H 2700 3050 50  0000 L CNN
F 2 "Connector_PinHeader_2.54mm:PinHeader_1x04_P2.54mm_Vertical" H 2700 2850 50  0001 C CNN
F 3 "~" H 2700 2850 50  0001 C CNN
F 4 "Digi-Key" H 2700 2850 50  0001 C CNN "Distrib. Name"
F 5 "S1011E-04-ND" H 2700 2850 50  0001 C CNN "Distrib. Part No."
	1    2700 2850
	1    0    0    -1  
$EndComp
$Comp
L Connector:Conn_01x04_Male J4
U 1 1 5CE4261F
P 2700 3550
F 0 "J4" H 2700 3850 50  0000 L CNN
F 1 "Ground" H 2700 3750 50  0000 L CNN
F 2 "Connector_PinHeader_2.54mm:PinHeader_1x04_P2.54mm_Vertical" H 2700 3550 50  0001 C CNN
F 3 "~" H 2700 3550 50  0001 C CNN
F 4 "Digi-Key" H 2700 3550 50  0001 C CNN "Distrib. Name"
F 5 "S1011E-04-ND" H 2700 3550 50  0001 C CNN "Distrib. Part No."
	1    2700 3550
	1    0    0    -1  
$EndComp
Wire Wire Line
	3950 1650 3450 1650
$Comp
L power:GND #PWR07
U 1 1 5CE6F6F0
P 2900 3850
F 0 "#PWR07" H 2900 3600 50  0001 C CNN
F 1 "GND" H 2905 3677 50  0000 C CNN
F 2 "" H 2900 3850 50  0001 C CNN
F 3 "" H 2900 3850 50  0001 C CNN
	1    2900 3850
	1    0    0    -1  
$EndComp
Wire Wire Line
	2900 3450 2900 3550
Connection ~ 2900 3550
Wire Wire Line
	2900 3550 2900 3650
Connection ~ 2900 3650
Wire Wire Line
	2900 3650 2900 3750
Connection ~ 2900 3750
Wire Wire Line
	2900 3750 2900 3850
Wire Wire Line
	2900 2750 3550 2750
Connection ~ 3550 2750
Wire Wire Line
	3550 2750 3550 1550
Wire Wire Line
	2900 2850 3450 2850
Connection ~ 3450 2850
Wire Wire Line
	3450 2850 3450 1650
Wire Wire Line
	2900 2950 3250 2950
Connection ~ 3250 2950
Wire Wire Line
	3250 2950 3250 1850
Wire Wire Line
	2900 3050 3150 3050
Connection ~ 3150 3050
Wire Wire Line
	3150 3050 3150 1950
$Comp
L myLibrary:RJ45_CANbus J1
U 1 1 5CCA1EFB
P 2250 1950
F 0 "J1" H 2350 2600 50  0000 L CNN
F 1 "CAN Bus" H 2150 2500 50  0000 L CNN
F 2 "SamacSys_Parts:09455511100" H 2250 1950 50  0001 C CNN
F 3 "https://b2b.harting.com/ebusiness/en_us/RJI-RJ45-jack-Cat-5-SMT-angled/09455511100" H 2250 1950 50  0001 C CNN
F 4 "Harting" H 2250 1950 50  0001 C CNN "Mfg. Name"
F 5 "09455511100" H 2250 1950 50  0001 C CNN "Mfg. Part No."
F 6 "Digi-Key" H 2250 1950 50  0001 C CNN "Distrib. Name"
F 7 "1195-3699-ND" H 2250 1950 50  0001 C CNN "Distrib. Part No."
	1    2250 1950
	-1   0    0    -1  
$EndComp
Wire Wire Line
	2650 1550 3550 1550
Wire Wire Line
	3450 1650 2650 1650
Wire Wire Line
	2650 1750 3950 1750
Wire Wire Line
	2650 1850 3250 1850
Wire Wire Line
	2650 1950 3150 1950
Wire Wire Line
	2650 2050 3950 2050
Wire Wire Line
	2650 2150 3950 2150
Wire Wire Line
	2650 2250 3950 2250
$Comp
L power:Earth #PWR01
U 1 1 5CDEF196
P 2250 2550
F 0 "#PWR01" H 2250 2300 50  0001 C CNN
F 1 "Earth" H 2250 2400 50  0001 C CNN
F 2 "" H 2250 2550 50  0001 C CNN
F 3 "~" H 2250 2550 50  0001 C CNN
	1    2250 2550
	1    0    0    -1  
$EndComp
Wire Wire Line
	7550 5100 7600 5100
Wire Wire Line
	7600 5100 7600 5200
$Comp
L Device:C C5
U 1 1 5CFCADA5
P 9050 2050
F 0 "C5" H 9165 2096 50  0000 L CNN
F 1 "100n" H 9165 2005 50  0000 L CNN
F 2 "Capacitor_SMD:C_0805_2012Metric" H 9088 1900 50  0001 C CNN
F 3 "~" H 9050 2050 50  0001 C CNN
F 4 "Digi-Key" H 9050 2050 50  0001 C CNN "Distrib. Name"
F 5 "478-1395-1-ND" H 9050 2050 50  0001 C CNN "Distrib. Part No."
	1    9050 2050
	1    0    0    -1  
$EndComp
Wire Wire Line
	8500 1900 8500 1850
Connection ~ 8500 1850
Wire Wire Line
	8500 1850 9050 1850
Wire Wire Line
	8500 2200 8500 2250
Connection ~ 8500 2250
Wire Wire Line
	8500 2250 7950 2250
$Comp
L Connector_Generic:Conn_02x03_Odd_Even J6
U 1 1 5EF491B9
P 8650 4000
F 0 "J6" H 8600 4300 50  0000 L CNN
F 1 "RaspPi" H 8600 4200 50  0000 L CNN
F 2 "Connector_IDC:IDC-Header_2x03_P2.54mm_Vertical" H 8650 4000 50  0001 C CNN
F 3 "~" H 8650 4000 50  0001 C CNN
F 4 "Digi-Key" H 8650 4000 50  0001 C CNN "Distrib. Name"
F 5 "609-2846-ND" H 8650 4000 50  0001 C CNN "Distrib. Part No."
F 6 "Amphenol" H 8650 4000 50  0001 C CNN "Mfg. Name"
F 7 "75867-131LF" H 8650 4000 50  0001 C CNN "Mfg. Part No."
	1    8650 4000
	1    0    0    -1  
$EndComp
$Comp
L Connector_Generic:Conn_02x05_Odd_Even J5
U 1 1 5EF4ABE2
P 8650 4850
F 0 "J5" H 8650 5300 50  0000 C CNN
F 1 "BusPirate v3" H 8600 5200 50  0000 L CNN
F 2 "Connector_IDC:IDC-Header_2x05_P2.54mm_Vertical" H 8650 4850 50  0001 C CNN
F 3 "~" H 8650 4850 50  0001 C CNN
F 4 "Digi-Key" H 8650 4850 50  0001 C CNN "Distrib. Name"
F 5 "609-3592-ND" H 8650 4850 50  0001 C CNN "Distrib. Part No."
F 6 "Amphenol" H 8650 4850 50  0001 C CNN "Mfg. Name"
F 7 "52601-S10-4LF" H 8650 4850 50  0001 C CNN "Mfg. Part No."
	1    8650 4850
	1    0    0    -1  
$EndComp
$Comp
L power:GND #PWR019
U 1 1 5CDD4A0C
P 9550 5750
F 0 "#PWR019" H 9550 5500 50  0001 C CNN
F 1 "GND" H 9555 5577 50  0000 C CNN
F 2 "" H 9550 5750 50  0001 C CNN
F 3 "" H 9550 5750 50  0001 C CNN
	1    9550 5750
	1    0    0    -1  
$EndComp
$Comp
L Device:LED D1
U 1 1 5CDC701C
P 9550 5600
F 0 "D1" V 9589 5482 50  0000 R CNN
F 1 "Power" V 9498 5482 50  0000 R CNN
F 2 "LED_SMD:LED_0805_2012Metric" H 9550 5600 50  0001 C CNN
F 3 "~" H 9550 5600 50  0001 C CNN
F 4 "Lite-On" V 9550 5600 50  0001 C CNN "Mfg. Name"
F 5 "LTST-C170CKT" V 9550 5600 50  0001 C CNN "Mfg. Part No."
F 6 "Digi-Key" V 9550 5600 50  0001 C CNN "Distrib. Name"
F 7 "160-1176-1-ND" V 9550 5600 50  0001 C CNN "Distrib. Part No."
	1    9550 5600
	0    -1   -1   0   
$EndComp
$Comp
L Device:R R9
U 1 1 5CDC65BB
P 9550 5300
F 0 "R9" H 9620 5346 50  0000 L CNN
F 1 "3k3" H 9620 5255 50  0000 L CNN
F 2 "Resistor_SMD:R_0805_2012Metric" V 9480 5300 50  0001 C CNN
F 3 "~" H 9550 5300 50  0001 C CNN
F 4 "Digi-Key" H 9550 5300 50  0001 C CNN "Distrib. Name"
F 5 "311-3.30KCRCT-ND" H 9550 5300 50  0001 C CNN "Distrib. Part No."
	1    9550 5300
	1    0    0    -1  
$EndComp
Wire Wire Line
	8300 5050 8300 5400
Wire Wire Line
	8300 5050 8450 5050
Text Label 8950 4650 0    50   ~ 0
CS
Text Label 8950 4850 0    50   ~ 0
VPU
Text Label 8950 4950 0    50   ~ 0
5V
Text Label 8950 5050 0    50   ~ 0
GND
Text Label 8450 4650 2    50   ~ 0
MISO
Text Label 8450 4850 2    50   ~ 0
AUX
Text Label 8450 4950 2    50   ~ 0
ADC
Text Label 8450 5050 2    50   ~ 0
3.3V
Text Notes 7550 4500 0    50   ~ 0
SDA
Text Notes 7550 4900 0    50   ~ 0
SCL
Wire Wire Line
	7750 4750 8450 4750
Wire Wire Line
	8050 5500 9350 5500
$Comp
L Jumper:SolderJumper_3_Bridged12 JP4
U 1 1 5EFE2879
P 8400 3450
F 0 "JP4" V 8446 3518 50  0000 L CNN
F 1 "PullUp" V 8355 3518 50  0000 L CNN
F 2 "Jumper:SolderJumper-3_P1.3mm_Bridged12_RoundedPad1.0x1.5mm" H 8400 3450 50  0001 C CNN
F 3 "~" H 8400 3450 50  0001 C CNN
	1    8400 3450
	0    1    -1   0   
$EndComp
$Comp
L Device:R R10
U 1 1 5EFEB80C
P 7750 3700
F 0 "R10" H 7820 3746 50  0000 L CNN
F 1 "10k" H 7820 3655 50  0000 L CNN
F 2 "Resistor_SMD:R_0805_2012Metric" V 7680 3700 50  0001 C CNN
F 3 "~" H 7750 3700 50  0001 C CNN
F 4 "Digi-Key" H 7750 3700 50  0001 C CNN "Distrib. Name"
F 5 "311-10.0KCRCT-ND" H 7750 3700 50  0001 C CNN "Distrib. Part No."
	1    7750 3700
	1    0    0    -1  
$EndComp
$Comp
L Device:R R14
U 1 1 5EFF02A1
P 8050 3700
F 0 "R14" H 8120 3746 50  0000 L CNN
F 1 "10k" H 8120 3655 50  0000 L CNN
F 2 "Resistor_SMD:R_0805_2012Metric" V 7980 3700 50  0001 C CNN
F 3 "~" H 8050 3700 50  0001 C CNN
F 4 "Digi-Key" H 8050 3700 50  0001 C CNN "Distrib. Name"
F 5 "311-10.0KCRCT-ND" H 8050 3700 50  0001 C CNN "Distrib. Part No."
	1    8050 3700
	1    0    0    -1  
$EndComp
Wire Wire Line
	8400 3650 8400 3900
$Comp
L power:GND #PWR022
U 1 1 5F0219CD
P 9000 4150
F 0 "#PWR022" H 9000 3900 50  0001 C CNN
F 1 "GND" H 9005 3977 50  0000 C CNN
F 2 "" H 9000 4150 50  0001 C CNN
F 3 "" H 9000 4150 50  0001 C CNN
	1    9000 4150
	1    0    0    -1  
$EndComp
Wire Wire Line
	9000 4150 9000 4100
Wire Wire Line
	9000 4100 8950 4100
Wire Wire Line
	7750 4000 8450 4000
Connection ~ 7750 4500
Wire Wire Line
	8050 4100 8450 4100
Connection ~ 8050 4900
Wire Wire Line
	9050 5050 8950 5050
Wire Wire Line
	8400 3900 8450 3900
Wire Wire Line
	8050 3850 8050 4100
Connection ~ 8050 4100
Wire Wire Line
	7750 3850 7750 4000
Connection ~ 7750 4000
Wire Wire Line
	8250 3450 8050 3450
Wire Wire Line
	7750 3450 7750 3550
Wire Wire Line
	8050 3550 8050 3450
Connection ~ 8050 3450
Wire Wire Line
	8050 3450 7750 3450
Text Label 8400 4000 2    50   ~ 0
SDA
Text Label 8400 4100 2    50   ~ 0
SCL
Text Label 8400 3900 2    50   ~ 0
3.3V
Wire Wire Line
	8950 4000 9000 4000
Wire Wire Line
	8950 3900 9000 3900
Connection ~ 9000 3900
Text Label 9000 4000 0    50   ~ 0
5V
Wire Wire Line
	8400 3200 8400 3250
Wire Wire Line
	9000 3200 8400 3200
Connection ~ 9550 4950
Wire Wire Line
	9550 3200 9000 3200
Connection ~ 9000 3200
$Comp
L power:+5V #PWR020
U 1 1 5F1501E5
P 9550 3200
F 0 "#PWR020" H 9550 3050 50  0001 C CNN
F 1 "+5V" H 9565 3373 50  0000 C CNN
F 2 "" H 9550 3200 50  0001 C CNN
F 3 "" H 9550 3200 50  0001 C CNN
	1    9550 3200
	1    0    0    -1  
$EndComp
Connection ~ 9550 3200
Wire Wire Line
	7950 1850 8500 1850
Wire Wire Line
	7950 1900 7950 1850
$Comp
L power:+5V #PWR06
U 1 1 5F16A2F2
P 9050 1850
F 0 "#PWR06" H 9050 1700 50  0001 C CNN
F 1 "+5V" H 9065 2023 50  0000 C CNN
F 2 "" H 9050 1850 50  0001 C CNN
F 3 "" H 9050 1850 50  0001 C CNN
	1    9050 1850
	1    0    0    -1  
$EndComp
Connection ~ 9050 1850
$Comp
L power:GND #PWR08
U 1 1 5F186B77
P 9050 2250
F 0 "#PWR08" H 9050 2000 50  0001 C CNN
F 1 "GND" H 9055 2077 50  0000 C CNN
F 2 "" H 9050 2250 50  0001 C CNN
F 3 "" H 9050 2250 50  0001 C CNN
	1    9050 2250
	1    0    0    -1  
$EndComp
Connection ~ 9050 2250
Text Label 9000 3900 0    50   ~ 0
5V
Text Label 9000 4100 0    50   ~ 0
GND
Wire Wire Line
	9000 3900 9000 3200
Wire Wire Line
	9000 3900 9000 4000
Wire Wire Line
	7750 4500 7750 4000
Wire Wire Line
	8050 4900 8050 4100
Wire Wire Line
	7750 4500 7750 4750
Wire Wire Line
	8050 4900 8050 5500
Wire Wire Line
	9550 4950 9550 5150
Text Notes 2550 3450 1    50   ~ 0
TEST POINTS
Text Notes 5350 2900 0    50   ~ 0
CAN bus 'earth'\nsignal ground\n(join for lab use)
$EndSCHEMATC
