key,title,authors,journal,issn,volume,issue,pages,day,month,year,publisher,pmc_id,pubmed_id,url,abstract,doi,duplicate_of,updated_of
LSR34782,Analytical and Clinical Comparison of Three Nucleic Acid Amplification Tests for SARS-CoV-2 Detection.,"Smith, E; Zhen, W; Manji, R; Schron, D; Duong, S; Berry, GJ",J. Clin. Microbiol.,1098-660X,,,,,Jun,2020,,,32571894,https://www.ncbi.nlm.nih.gov/pubmed/32571894,"Severe Acute Respiratory Syndrome Coronavirus 2 (SARS-CoV-2) was first identified in December 2019 and has quickly become a worldwide pandemic. In response, many diagnostic manufacturers have developed molecular assays for SARS-CoV-2 under the Food and Drug Administration (FDA) Emergency Use Authorization (EUA) pathway. This study compared 3 of these assays: the Hologic Panther Fusion SARS-CoV-2 assay (Fusion), the Hologic Aptima SARS-CoV-2 assay (Aptima) and the BioFire Defense COVID-19 test (BioFire), to determine analytical and clinical performance, as well as workflow. All 3 assays showed a similar limit of detection (LOD) using inactivated virus, with 100% detection ranging from 500-1,000 genome equivalents/ml, whereas use of a quantified RNA transcript standard showed the same trend, but had values ranging from 62.5 to 125 copies/ml, confirming variability in absolute quantification of reference standards. The clinical correlation found that the Fusion and BioFire assays had a positive percent agreement (PPA) of 98.7%, followed by the Aptima assay at 94.7% when compared to the consensus result. All three assays exhibited 100% negative percent agreement (NPA). Analysis of discordant results revealed that all 4 samples missed by the Aptima assay had Ct values >37 on the Fusion assay.In conclusion, while all three assays showed similar relative LODs, we showed differences in absolute LODs depending on which standard was employed. In addition, the Fusion and BioFire assays showed better clinical performance, while the Aptima assay showed a modest decrease in overall PPA. These findings should be kept in mind when making platform testing decisions.",10.1128/JCM.01134-20,LSR18614,
LSR40849,CT in relation to RT-PCR in diagnosing COVID-19 in The Netherlands: A prospective study.,"Gietema, HA; Zelis, N; Nobel, JM; Lambriks, LJG; van Alphen, LB; Oude Lashof, AML; Wildberger, JE; Nelissen, IC; Stassen, PM",PLoS ONE,1932-6203,15,7,e0235844,,,2020,,,32645053,https://www.ncbi.nlm.nih.gov/pubmed/32645053,"Early differentiation between emergency department (ED) patients with and without corona virus disease (COVID-19) is very important. Chest CT scan may be helpful in early diagnosing of COVID-19. We investigated the diagnostic accuracy of CT using RT-PCR for SARS-CoV-2 as reference standard and investigated reasons for discordant results between the two tests. In this prospective single centre study in the Netherlands, all adult symptomatic ED patients had both a CT scan and a RT-PCR upon arrival at the ED. CT results were compared with PCR test(s). Diagnostic accuracy was calculated. Discordant results were investigated using discharge diagnoses. Between March 13th and March 24th 2020, 193 symptomatic ED patients were included. In total, 43.0% of patients had a positive PCR and 56.5% a positive CT, resulting in a sensitivity of 89.2%, specificity 68.2%, likelihood ratio (LR)+ 2.81 and LR- 0.16. Sensitivity was higher in patients with high risk pneumonia (CURB-65 score ≥3; n = 17, 100%) and with sepsis (SOFA score ≥2; n = 137, 95.5%). Of the 35 patients (31.8%) with a suspicious CT and a negative RT-PCR, 9 had another respiratory viral pathogen, and in 7 patients, COVID-19 was considered likely. One of nine patients with a non-suspicious CT and a positive PCR had developed symptoms within 48 hours before scanning. The accuracy of chest CT in symptomatic ED patients is high, but used as a single diagnostic test, CT can not safely diagnose or exclude COVID-19. However, CT can be used as a quick tool to categorize patients into 'probably positive' and 'probably negative' cohorts.",10.1371/journal.pone.0235844,LSR9624,
LSR41615,Community-acquired bacterial pneumonia in adults: An update,"Eshwara, V.K.; Mukhopadhyay, C.; Rello, J.",Indian J. Med. Res.,0971-5916,151,4,287-302,,April,2020,,,,https://doi.org/10.4103/ijmr.IJMR-1678-19,"Community-acquired pneumonia (CAP) is the prominent cause of mortality and morbidity with important clinical impact across the globe. India accounts for 23 per cent of global pneumonia burden with case fatality rates between 14 and 30 per cent, and Streptococcus pneumoniae is considered a major bacterial aetiology. Emerging pathogens like Burkholderia pseudomallei is increasingly recognized as an important cause of CAP in Southeast Asian countries. Initial management in the primary care depends on clinical assessment while the hospitalized patients require combinations of clinical scores, chest radiography and various microbiological and biomarker assays. This comprehensive diagnostic approach together with additional sampling and molecular tests in selected high-risk patients should be practiced. Inappropriate therapy in CAP in hospitalized patients lengthens hospital stay and increases cost and mortality. In addition, emergence of multidrug-resistant organisms poses tough challenges in deciding empirical as well as definitive therapy. Developing local evidence on the cause and management should be a priority to improve health outcomes in CAP.<ovid:br/>Copyright © 2020 Indian Council of Medical Research. All rights reserved.",10.4103/ijmr.IJMR-1678-19,LSR31222,
LSR43389,Frailty and Mortality in Hospitalized Older Adults With COVID-19: Retrospective Observational Study,"De Smet, R.; Mellaerts, B.; Vandewinckele, H.; Lybeert, P.; Frans, E.; Ombelet, S.; Lemahieu, W.; Symons, R.; Ho, E.; Frans, J.; Smismans, A.; Laurent, M.R.",J. Am. Med. Dir. Assoc.,1525-8610,21,7,928-932.e1,,July,2020,,,,https://doi.org/10.1016/j.jamda.2020.06.008,"Objectives: To determine the association between frailty and short-term mortality in older adults hospitalized for coronavirus disease 2019 (COVID-19). <ovid:br/>Design(s): Retrospective single-center observational study. Setting and participants: Eighty-one patients with COVID-19 confirmed by reverse-transcriptase polymerase chain reaction (RT-PCR), at the Geriatrics department of a general hospital in Belgium. Measurements: Frailty was graded according to the Rockwood Clinical Frailty Scale (CFS). Demographic, biochemical, and radiologic variables, comorbidities, symptoms, and treatment were extracted from electronic medical records. <ovid:br/>Result(s): Participants (N = 48 women, 59%) had a median age of 85 years (range 65-97 years) and a median CFS score of 7 (range 2-9); 42 (52%) were long-term care residents. Within 6 weeks, 18 patients died. Mortality was significantly but weakly associated with age (Spearman r = 0.241, P = .03) and CFS score (r = 0.282, P = .011), baseline lactate dehydrogenase (LDH; r = 0.301, P = .009), lymphocyte count (r = -0.262, P = .02), and RT-PCR cycle threshold (Ct, r = -0.285, P = .015). Mortality was not associated with long-term care residence, dementia, delirium, or polypharmacy. In multivariable logistic regression analyses, CFS, LDH, and RT-PCR Ct (but not age) remained independently associated with mortality. Both age and frailty had poor specificity to predict survival. A multivariable model combining age, CFS, LDH, and viral load significantly predicted survival. Conclusions and Implications: Although their prognosis is worse, even the oldest and most severely frail patients may benefit from hospitalization for COVID-19, if sufficient resources are available.<ovid:br/>Copyright © 2020 AMDA - The Society for Post-Acute and Long-Term Care Medicine",10.1016/j.jamda.2020.06.008,LSR22752,
LSR43862,Clinical and radiologic characteristics of covid-19 in patients with ckd,"Abrishami, A.; Khalili, N.; Dalili, N.; Tabari, R.K.; Farjad, R.; Samavat, S.; Naghadehi, A.N.; Haghighatkhah, H.; Nafar, M.; Sanei-Taheri, M.",Iran. J. Kidney Dis.,1735-8582,14,4,267-277,,July,2020,,,,http://www.ijkd.org/index.php/ijkd/article/download/5699/1171,"Introduction. In this study, we aimed to evaluate the presentation and outcome of COVID-19 in patients with chronic kidney disease (CKD). Methods. We included 43 patients with a past history of CKD and confirmed diagnosis of COVID-19. Patients were evaluated for demographic characteristics, clinical and laboratory data and findings of initial chest computed tomography (CT) and were followed until either death or discharge occurred. Then, study variables were compared based on final outcome and stage of CKD. Results. Mean age +/- SD of patients was 60.65 +/- 14.36 years; 65.1% were male. Five of 43 patients (11.6%) died on follow-up and the rest were discharged. Disease outcome did not differ across CKD stages (P >.05). More than half of the patients (58.1%) presented with severe disease on admission. Clinical symptoms were similar to those of non-CKD individuals. Mean duration of hospitalization was higher in those who died, although not significant (16.6 +/- 8.38 vs. 11 +/- 6.26, P >.05). The only hematologic parameter that significantly differed between survivors and non-survivors was lactase dehydrogenase level (P <.05). Ground-glass opacification and reticular pattern were the most frequent patterns on CT and pleural effusion existed in about one-fifth of all patients. A greater lower zone score was noted in deceased patients (P <.05). Conclusion. Patients with CKD are vulnerable to a more severe form of COVID-19 and experience a higher mortality rate than the general population; however, higher CKD stage is not related to worse prognosis or different imaging manifestation compared with lower stage.<ovid:br/>Copyright © 2020, Iranian Society of Nephrology. All rights reserved.",,LSR42389,
LSR44712,From community-acquired pneumonia to COVID-19: a deep learning-based method for quantitative analysis of COVID-19 on thick-section CT scans.,"Li, Z; Zhong, Z; Li, Y; Zhang, T; Gao, L; Jin, D; Sun, Y; Ye, X; Yu, L; Hu, Z; Xiao, J; Huang, L; Tang, Y",Eur Radiol,1432-1084,,,,,Jul,2020,,,32683550,https://www.ncbi.nlm.nih.gov/pubmed/32683550,"To develop a fully automated AI system to quantitatively assess the disease severity and disease progression of COVID-19 using thick-section chest CT images. In this retrospective study, an AI system was developed to automatically segment and quantify the COVID-19-infected lung regions on thick-section chest CT images. Five hundred thirty-one CT scans from 204 COVID-19 patients were collected from one appointed COVID-19 hospital. The automatically segmented lung abnormalities were compared with manual segmentation of two experienced radiologists using the Dice coefficient on a randomly selected subset (30 CT scans). Two imaging biomarkers were automatically computed, i.e., the portion of infection (POI) and the average infection HU (iHU), to assess disease severity and disease progression. The assessments were compared with patient status of diagnosis reports and key phrases extracted from radiology reports using the area under the receiver operating characteristic curve (AUC) and Cohen's kappa, respectively. The dice coefficient between the segmentation of the AI system and two experienced radiologists for the COVID-19-infected lung abnormalities was 0.74 ± 0.28 and 0.76 ± 0.29, respectively, which were close to the inter-observer agreement (0.79 ± 0.25). The computed two imaging biomarkers can distinguish between the severe and non-severe stages with an AUC of 0.97 (p value < 0.001). Very good agreement (κ = 0.8220) between the AI system and the radiologists was achieved on evaluating the changes in infection volumes. A deep learning-based AI system built on the thick-section CT imaging can accurately quantify the COVID-19-associated lung abnormalities and assess the disease severity and its progressions. • A deep learning-based AI system was able to accurately segment the infected lung regions by COVID-19 using the thick-section CT scans (Dice coefficient ≥ 0.74). • The computed imaging biomarkers were able to distinguish between the non-severe and severe COVID-19 stages (area under the receiver operating characteristic curve 0.97). • The infection volume changes computed by the AI system were able to assess the COVID-19 progression (Cohen's kappa 0.8220).",10.1007/s00330-020-07042-x,LSR8860,LSR8860
LSR49391,"Pooled RNA sample reverse transcriptase real time PCR assay for SARS CoV-2 infection: A reliable, faster and economical method.","Gupta, E; Padhi, A; Khodare, A; Agarwal, R; Ramachandran, K; Mehta, V; Kilikdar, M; Dubey, S; Kumar, G; Sarin, SK",PLoS ONE,1932-6203,15,7,e0236859,,,2020,,,32730368,https://www.ncbi.nlm.nih.gov/pubmed/32730368,"Corona virus disease 2019 (COVID-19) which initially started as a cluster of pneumonia cases in the Wuhan city of China has now become a full-blown pandemic. Timely diagnosis of COVID-19 is the key in containing the pandemic and breaking the chain of transmission. In low- and middle-income countries availability of testing kits has become the major bottleneck in testing. Novel methods like pooling of samples are the need of the hour. We undertook this study to evaluate a novel protocol of pooling of RNA samples/elutes in performance of PCR for SARS CoV-2 virus. Extracted RNA samples were randomly placed in pools of 8 on a 96 well plate. Both individual RNA (ID) and pooled RNA RT-qPCR for the screening E gene were done in the same plate and the positivity for the E gene was seen. The present study demonstrated that pool testing with RNA samples can easily detect even up to a single positive sample with Ct value as high as 38. The present study also showed that the results of pool testing is not affected by number of positive samples in a pool. Pooling of RNA samples can reduce the time and expense, and can help expand diagnostic capabilities, especially during constrained supply of reagents and PCR kits for the diagnosis of SARS-CoV-2 infection.",10.1371/journal.pone.0236859,LSR11208,
LSR49410,Inf-Net: Automatic COVID-19 Lung Infection Segmentation From CT Images.,"Fan, DP; Zhou, T; Ji, GP; Zhou, Y; Chen, G; Fu, H; Shen, J; Shao, L",IEEE Trans Med Imaging,1558-254X,39,8,2626-2637,,Aug,2020,,,32730213,https://www.ncbi.nlm.nih.gov/pubmed/32730213,"Coronavirus Disease 2019 (COVID-19) spread globally in early 2020, causing the world to face an existential health crisis. Automated detection of lung infections from computed tomography (CT) images offers a great potential to augment the traditional healthcare strategy for tackling COVID-19. However, segmenting infected regions from CT slices faces several challenges, including high variation in infection characteristics, and low intensity contrast between infections and normal tissues. Further, collecting a large amount of data is impractical within a short time period, inhibiting the training of a deep model. To address these challenges, a novel COVID-19 Lung Infection Segmentation Deep Network (Inf-Net) is proposed to automatically identify infected regions from chest CT slices. In our Inf-Net, a parallel partial decoder is used to aggregate the high-level features and generate a global map. Then, the implicit reverse attention and explicit edge-attention are utilized to model the boundaries and enhance the representations. Moreover, to alleviate the shortage of labeled data, we present a semi-supervised segmentation framework based on a randomly selected propagation strategy, which only requires a few labeled images and leverages primarily unlabeled data. Our semi-supervised framework can improve the learning ability and achieve a higher performance. Extensive experiments on our COVID-SemiSeg and real CT volumes demonstrate that the proposed Inf-Net outperforms most cutting-edge segmentation models and advances the state-of-the-art performance.",10.1109/TMI.2020.2996645,A2004.14133,
LSR49411,Dual-Sampling Attention Network for Diagnosis of COVID-19 From Community Acquired Pneumonia.,"Ouyang, X; Huo, J; Xia, L; Shan, F; Liu, J; Mo, Z; Yan, F; Ding, Z; Yang, Q; Song, B; Shi, F; Yuan, H; Wei, Y; Cao, X; Gao, Y; Wu, D; Wang, Q; Shen, D",IEEE Trans Med Imaging,1558-254X,39,8,2595-2605,,Aug,2020,,,32730212,https://www.ncbi.nlm.nih.gov/pubmed/32730212,"The coronavirus disease (COVID-19) is rapidly spreading all over the world, and has infected more than 1,436,000 people in more than 200 countries and territories as of April 9, 2020. Detecting COVID-19 at early stage is essential to deliver proper healthcare to the patients and also to protect the uninfected population. To this end, we develop a dual-sampling attention network to automatically diagnose COVID-19 from the community acquired pneumonia (CAP) in chest computed tomography (CT). In particular, we propose a novel online attention module with a 3D convolutional network (CNN) to focus on the infection regions in lungs when making decisions of diagnoses. Note that there exists imbalanced distribution of the sizes of the infection regions between COVID-19 and CAP, partially due to fast progress of COVID-19 after symptom onset. Therefore, we develop a dual-sampling strategy to mitigate the imbalanced learning. Our method is evaluated (to our best knowledge) upon the largest multi-center CT data for COVID-19 from 8 hospitals. In the training-validation stage, we collect 2186 CT scans from 1588 patients for a 5-fold cross-validation. In the testing stage, we employ another independent large-scale testing dataset including 2796 CT scans from 2057 patients. Results show that our algorithm can identify the COVID-19 images with the area under the receiver operating characteristic curve (AUC) value of 0.944, accuracy of 87.5%, sensitivity of 86.9%, specificity of 90.1%, and F1-score of 82.0%. With this performance, the proposed algorithm could potentially aid radiologists with COVID-19 diagnosis from CAP, especially in the early stage of the COVID-19 outbreak.",10.1109/TMI.2020.2995508,A2005.02690,A2005.02690
LSR50019,Lung computed tomography patterns of a cluster of asymptomatic young males with COVID-19 admitted to a teaching hospital in Kuala Lumpur,"Hau Ng, B.; Abeed, N.N.N.; Yu-Lin, A.B.; Hamid, M.F.A.; Ian Soo, C.; Kori, N.; Mukari, S.A.M.; Zainal, I.A.; Kamaruzaman, L.; Shamsi, M.Y.A.; Gafor, H.; Mustafa, N.; Wan Yahya, W.N.N.; Azmin, S.; Soong, K.C.; Munusamy, H.; Ching, Z.H.; Low, H.J.; Periyasamy, P.",Med. J. Malays.,0300-5283,75,4,368-371,,July,2020,,,,http://www.e-mjm.org/2020/v75n4/asymptomatic-COVID-19.pdf,"and objective: Coronavirus Disease 2019 (COVID-19) was first reported in Malaysia in March 2020. We describe here the clinical characteristics and computed tomography (CT) patterns in asymptomatic young patients who had laboratory-confirmed COVID-19. <ovid:br/>Method(s): This is a retrospective observational study where 25 male in-patients with laboratory-confirmed COVID-19 in Hospital Canselor Tuanku Muhriz. Demographics, clinical data and CT images of these patients were reviewed by 2 senior radiologists. <ovid:br/>Result(s): In total there were 25 patients (all males; mean age [+/-SD], 21.64+/-2.40 years; range, 18-27 years). Patients with abnormal chest CT showed a relatively low normal absolute lymphocytes count (median: 2.2 x 109/L) and absolute monocyte count (median: 0.5 x 109/L). Lactate dehydrogenase was elevated in 5 (20%) of the patients. The procalcitonin level was normal while elevated levels of alanine aminotransferase, total bilirubin, platelet and C-reactive protein were common. Baseline chest CT showed abnormalities in 6 patients. The distribution of the lesions were; upper lobe 3 (12%) lower lobe 3 (12%) with peripheral distribution 4 (16%). Of the 25 patients included, 4 (16%) had ground glass opacification (GGO), 1 (4%) had a small peripheral subpleural nodule, and 1 (4%) had a dense solitary granuloma. Four patients had typical CT features of COVID-19. <ovid:br/>Conclusion(s): We found that the CT imaging showed peripheral GGO in our patients. They remained clinically stable with no deterioration of their respiratory symptoms suggesting stability in lung involvement. We postulate that rapid changes in CT imaging may not be present in young, asymptomatic, non-smoking COVID-19 patients. Thus the use of CT thorax for early diagnosis may be reserved for patients in the older age groups, and not in younger patients.<ovid:br/>Copyright © 2020, Malaysian Medical Association. All rights reserved.",,LSR49610,
LSR51601,Multicenter comparison of the Cobas 6800 system with the RealStar RT-PCR kit for the detection of SARS-CoV-2,"Wirden, M.; Feghoul, L.; Bertine, M.; Nere, M.L.; Le Hingrat, Q.; Abdi, B.; Boutolleau, D.; Ferre, V.M.; Jary, A.; Delaugerre, C.; Marcelin, A.G.; Descamps, D.; Legoff, J.; Visseaux, B.; Chaix, M.L.",J. Clin. Virol.,1386-6532,130,,,,September,2020,,,,https://doi.org/10.1016/j.jcv.2020.104573,"RT-PCR testing is crucial in the diagnostic of SARS-CoV-2 infection. The use of reliable and comparable PCR assays is a cornerstone to allow use of different PCR assays depending on the local equipment. In this work, we provide a comparison of the Cobas (Roche) and the RealStar assay (Altona). <ovid:br/>Method(s): Assessment of the two assays was performed prospectively in three reference Parisians hospitals, using 170 clinical samples. They were tested with the Cobas assay, selected to obtain a distribution of cycle threshold (Ct) as large as possible, and tested with the RealStar assay with three largely available extraction platforms: QIAsymphony (Qiagen), MagNAPure (Roche) and NucliSENS-easyMag (BioMerieux). <ovid:br/>Result(s): Overall, the agreement (positive for at least one gene) was 76 %. This rate differed considerably depending on the Cobas Ct values for gene E: below 35 (n = 91), the concordance was 99 %. Regarding the positive Ct values, linear regression analysis showed a coefficient of determination (R<ovid:sup>2</ovid:sup>) of 0.88 and the Deming regression line revealed a strong correlation with a slope of 1.023 and an intercept of -3.9. Bland-Altman analysis showed that the mean difference (Cobas minus RealStar) was + 3.3 Ct, with a SD of + 2.3 Ct. <ovid:br/>Conclusion(s): In this comparison, both RealStar and Cobas assays provided comparable qualitative results and a high correlation when both tests were positive. Discrepancies exist after 35 Ct and varied depending on the extraction system used for the RealStar assay, probably due to a low viral load close to the detection limit of both assays.<ovid:br/>Copyright © 2020 Elsevier B.V.",10.1016/j.jcv.2020.104573,LSR37865,
LSR53350,Correlation between Chest Computed Tomography and Lung Ultrasonography in Patients with Coronavirus Disease 2019 (COVID-19).,"Tung-Chen, Y; Martí de Gracia, M; Díez-Tascón, A; Alonso-González, R; Agudo-Fernández, S; Parra-Gordo, ML; Ossaba-Vélez, S; Rodríguez-Fuertes, P; Llamas-Fuentes, R",Ultrasound Med Biol,1879-291X,,,,,Jul,2020,,,32771222,https://www.ncbi.nlm.nih.gov/pubmed/32771222,"There is growing evidence regarding chest X-ray and computed tomography (CT) findings for coronavirus disease 2019 (COVID-19). At present, the role of lung ultrasonography (LUS) has yet to be explored. The main purpose of this study was to evaluate the correlation between LUS findings and chest CT in patients confirmed to have (positive reverse transcription polymerase chain reaction [RT-PCR]) or clinically highly suspected of having (dyspnea, fever, myasthenia, gastrointestinal symptoms, dry cough, ageusia or anosmia) COVID-19. This prospective study was carried out in the emergency department, where patients confirmed of having or clinically highly suspected of having COVID-19 were recruited and underwent chest CT and concurrent LUS exam. An experienced emergency department physician performed the LUS exam blind to the clinical history and results of the CT scan, which were reviewed by two radiologists in consensus for signs compatible with COVID-19 (bilateral ground-glass opacities in peripheral distribution). A compatible LUS exam was considered a bilateral pattern of B-lines, irregular pleural line and subpleural consolidations. Between March and April 2020, 51 patients were consecutively enrolled. The indication for CT was a negative or indeterminate RT-PCR test (49.0%) followed by suspicion of pulmonary embolism (41.2%). Radiologic signs compatible with COVID-19 were present in 37 patients (72.5%) on CT scan and 40 patients (78.4%) on LUS exam. The presence of LUS findings was correlated with a positive CT scan suggestive of COVID-19 (odds ratio: 13.3, 95% confidence interval: 4.5-39.6, p < 0.001) with a sensitivity of 100.0%, specificity of 78.6%, positive predictive value of 92.5% and negative predictive value of 100.0%. There was no missed diagnosis of COVID-19 with LUS compared with CT in our cohort. The correlation between LUS score and CT total severity score was good (intraclass correlation coefficient: 0.803, 95% confidence interval: 0.60-0.90, p < 0.001). LUS exhibited similar accuracy compared with chest CT in the detection of lung abnormalities in COVID-19 patients.",10.1016/j.ultrasmedbio.2020.07.003,LSR16407,
LSR53678,Deep-COVID: Predicting COVID-19 from chest X-ray images using deep transfer learning.,"Minaee, S; Kafieh, R; Sonka, M; Yazdani, S; Jamalipour Soufi, G",Med Image Anal,1361-8423,65,,101794,,Jul,2020,,,32781377,https://www.ncbi.nlm.nih.gov/pubmed/32781377,"The COVID-19 pandemic is causing a major outbreak in more than 150 countries around the world, having a severe impact on the health and life of many people globally. One of the crucial step in fighting COVID-19 is the ability to detect the infected patients early enough, and put them under special care. Detecting this disease from radiography and radiology images is perhaps one of the fastest ways to diagnose the patients. Some of the early studies showed specific abnormalities in the chest radiograms of patients infected with COVID-19. Inspired by earlier works, we study the application of deep learning models to detect COVID-19 patients from their chest radiography images. We first prepare a dataset of 5000 Chest X-rays from the publicly available datasets. Images exhibiting COVID-19 disease presence were identified by board-certified radiologist. Transfer learning on a subset of 2000 radiograms was used to train four popular convolutional neural networks, including ResNet18, ResNet50, SqueezeNet, and DenseNet-121, to identify COVID-19 disease in the analyzed chest X-ray images. We evaluated these models on the remaining 3000 images, and most of these networks achieved a sensitivity rate of 98% ( ± 3%), while having a specificity rate of around 90%. Besides sensitivity and specificity rates, we also present the receiver operating characteristic (ROC) curve, precision-recall curve, average prediction, and confusion matrix of each model. We also used a technique to generate heatmaps of lung regions potentially infected by COVID-19 and show that the generated heatmaps contain most of the infected areas annotated by our board certified radiologist. While the achieved performance is very encouraging, further analysis is required on a larger set of COVID-19 images, to have a more reliable estimation of accuracy rates. The dataset, model implementations (in PyTorch), and evaluations, are all made publicly available for research community at https://github.com/shervinmin/DeepCovid.git.",10.1016/j.media.2020.101794,A2004.09363,A2004.09363
A2007.12303,COVID TV-UNet: Segmenting COVID-19 Chest CT Images Using Connectivity Imposed U-Net,Narges Saeedizadeh; Shervin Minaee; Rahele Kafieh; Shakib Yazdani; Milan Sonka,arXiv,,,,,6,8,2020,,,,http://arxiv.org/abs/2007.12303v3,"The novel corona-virus disease (COVID-19) pandemic has caused a major outbreak in more than 200 countries around the world, leading to a severe impact on the health and life of many people globally. As of mid-July 2020, more than 12 million people were infected, and more than 570,000 death were reported. Computed Tomography (CT) images can be used as an alternative to the time-consuming RT-PCR test, to detect COVID-19. In this work we propose a segmentation framework to detect chest regions in CT images, which are infected by COVID-19. We use an architecture similar to U-Net model, and train it to detect ground glass regions, on pixel level. As the infected regions tend to form a connected component (rather than randomly distributed pixels), we add a suitable regularization term to the loss function, to promote connectivity of the segmentation map for COVID-19 pixels. 2D-anisotropic total-variation is used for this purpose, and therefore the proposed model is called ""TV-UNet"". Through experimental results on a relatively large-scale CT segmentation dataset of around 900 images, we show that adding this new regularization term leads to 2\% gain on overall segmentation performance compared to the U-Net model. Our experimental analysis, ranging from visual evaluation of the predicted segmentation results to quantitative assessment of segmentation performance (precision, recall, Dice score, and mIoU) demonstrated great ability to identify COVID-19 associated regions of the lungs, achieving a mIoU rate of over 99\%, and a Dice score of around 86\%.",,LSR52539,
A2007.08028,Predicting Mechanical Ventilation Requirement and Mortality in COVID-19 using Radiomics and Deep Learning on Chest Radiographs: A Multi-Institutional Study,Joseph Bae; Saarthak Kapse; Gagandeep Singh; Tej Phatak; Jeremy Green; Nikhil Madan; Prateek Prasanna,arXiv,,,,,15,7,2020,,,,http://arxiv.org/abs/2007.08028v1,"Objectives: To predict mechanical ventilation requirement and mortality using computational modeling of chest radiographs (CXR) for coronavirus disease 2019 (COVID-19) patients. We also investigate the relative advantages of deep learning (DL), radiomics, and DL of radiomic-embedded feature maps in predicting these outcomes. Methods: This two-center, retrospective study analyzed deidentified CXRs taken from 514 patients suspected of COVID-19 infection on presentation at Stony Brook University Hospital (SBUH) and Newark Beth Israel Medical Center (NBIMC) between the months of March and June 2020. A DL segmentation pipeline was developed to generate masks for both lung fields and artifacts for each CXR. Machine learning classifiers to predict mechanical ventilation requirement and mortality were trained and evaluated on 353 baseline CXRs taken from COVID-19 positive patients. A novel radiomic embedding framework is also explored for outcome prediction. Results: Classification models for mechanical ventilation requirement (test N=154) and mortality (test N=190) had AUCs of up to 0.904 and 0.936, respectively. We also found that the inclusion of radiomic-embedded maps improved DL model predictions of clinical outcomes. Conclusions: We demonstrate the potential for computerized analysis of baseline CXR in predicting disease outcomes in COVID-19 patients. Our results also suggest that radiomic embedding improves DL models in medical image analysis, a technique that might be explored further in other pathologies. The models proposed in this study and the prognostic information they provide, complementary to other clinical data, might be used to aid physician decision making and resource allocation during the COVID-19 pandemic.",,LSR46292,
A2007.11450,4S-DT: Self Supervised Super Sample Decomposition for Transfer learning with application to COVID-19 detection,Asmaa Abbas; Mohammed M. Abdelsamea; Mohamed Gaber,arXiv,,,,,26,6,2020,,,,http://arxiv.org/abs/2007.11450v1,"Due to the high availability of large-scale annotated image datasets, knowledge transfer from pre-trained models showed outstanding performance in medical image classification. However, building a robust image classification model for datasets with data irregularity or imbalanced classes can be a very challenging task, especially in the medical imaging domain. In this paper, we propose a novel deep convolutional neural network, we called Self Supervised Super Sample Decomposition for Transfer learning (4S-DT) model.4S-DTencourages a coarse-to-fine transfer learning from large-scale image recognition tasks to a specific chest X-ray image classification task using a generic self-supervised sample decomposition approach. Our main contribution is a novel self-supervised learning mechanism guided by a super sample decomposition of unlabelled chest X-ray images. 4S-DT helps in improving the robustness of knowledge transformation via a downstream learning strategy with a class-decomposition layer to simplify the local structure of the data.4S-DT can deal with any irregularities in the image dataset by investigating its class boundaries using a downstream class-decomposition mechanism. We used 50,000 unlabelled chest X-ray images to achieve our coarse-to-fine transfer learning with an application to COVID-19 detection, as an exemplar. 4S-DT has achieved an accuracy of 97.54% (95% CI: 96.22%, 98.91%) in the detection of COVID-19 cases on an extended test set enriched by augmented images, out of which all real COVID-19 cases were detected, which was the highest accuracy obtained when compared to other methods.",,LSR34990,
A2004.07443,Relational Modeling for Robust and Efficient Pulmonary Lobe Segmentation in CT Scans,Weiyi Xie; Colin Jacobs; Jean-Paul Charbonnier; Bram van Ginneken,arXiv,,,,,12,5,2020,,,,http://arxiv.org/abs/2004.07443v4,"Pulmonary lobe segmentation in computed tomography scans is essential for regional assessment of pulmonary diseases. Recent works based on convolution neural networks have achieved good performance for this task. However, they are still limited in capturing structured relationships due to the nature of convolution. The shape of the pulmonary lobes affect each other and their borders relate to the appearance of other structures, such as vessels, airways, and the pleural wall. We argue that such structural relationships play a critical role in the accurate delineation of pulmonary lobes when the lungs are affected by diseases such as COVID-19 or COPD. In this paper, we propose a relational approach (RTSU-Net) that leverages structured relationships by introducing a novel non-local neural network module. The proposed module learns both visual and geometric relationships among all convolution features to produce self-attention weights. With a limited amount of training data available from COVID-19 subjects, we initially train and validate RTSU-Net on a cohort of 5000 subjects from the COPDGene study (4000 for training and 1000 for evaluation). Using models pre-trained on COPDGene, we apply transfer learning to retrain and evaluate RTSU-Net on 470 COVID-19 suspects (370 for retraining and 100 for evaluation). Experimental results show that RTSU-Net outperforms three baselines and performs robustly on cases with severe lung infection due to COVID-19.",,LSR49407,
A2003.11617,Covid-19: Automatic detection from X-Ray images utilizing Transfer Learning with Convolutional Neural Networks,Ioannis D. Apostolopoulos; Tzani Bessiana,arXiv,,,,,25,3,2020,,,,http://arxiv.org/abs/2003.11617v1,"In this study, a dataset of X-Ray images from patients with common pneumonia, Covid-19, and normal incidents was utilized for the automatic detection of the Coronavirus. The aim of the study is to evaluate the performance of state-of-the-art Convolutional Neural Network architectures proposed over recent years for medical image classification. Specifically, the procedure called transfer learning was adopted. With transfer learning, the detection of various abnormalities in small medical image datasets is an achievable target, often yielding remarkable results. The dataset utilized in this experiment is a collection of 1427 X-Ray images. 224 images with confirmed Covid-19, 700 images with confirmed common pneumonia, and 504 images of normal conditions are included. The data was collected from the available X-Ray images on public medical repositories. With transfer learning, an overall accuracy of 97.82% in the detection of Covid-19 is achieved.",,LSR29908,
,,,,,,,,,,,,,,,,,,
,,,,,,,,,,,,,,,,,,
,,,,,,,,,,,,,,,,,,
,,,,,,,,,,,,,,,,,,
,,,,,,,,,,,,,,,,,,
,,,,,,,,,,,,,,,,,,
,,,,,,,,,,,,,,,,,,
,,,,,,,,,,,,,,,,,,
,,,,,,,,,,,,,,,,,,
,,,,,,,,,,,,,,,,,,
,,,,,,,,,,,,,,,,,,
,,,,,,,,,,,,,,,,,,
,,,,,,,,,,,,,,,,,,
,,,,,,,,,,,,,,,,,,
,,,,,,,,,,,,,,,,,,
,,,,,,,,,,,,,,,,,,
,,,,,,,,,,,,,,,,,,
,,,,,,,,,,,,,,,,,,
,,,,,,,,,,,,,,,,,,
,,,,,,,,,,,,,,,,,,
,,,,,,,,,,,,,,,,,,
,,,,,,,,,,,,,,,,,,
,,,,,,,,,,,,,,,,,,
,,,,,,,,,,,,,,,,,,
,,,,,,,,,,,,,,,,,,
,,,,,,,,,,,,,,,,,,
,,,,,,,,,,,,,,,,,,
,,,,,,,,,,,,,,,,,,
,,,,,,,,,,,,,,,,,,
,,,,,,,,,,,,,,,,,,
,,,,,,,,,,,,,,,,,,
,,,,,,,,,,,,,,,,,,
,,,,,,,,,,,,,,,,,,
,,,,,,,,,,,,,,,,,,
,,,,,,,,,,,,,,,,,,
,,,,,,,,,,,,,,,,,,
,,,,,,,,,,,,,,,,,,
,,,,,,,,,,,,,,,,,,
,,,,,,,,,,,,,,,,,,
,,,,,,,,,,,,,,,,,,
,,,,,,,,,,,,,,,,,,
,,,,,,,,,,,,,,,,,,
,,,,,,,,,,,,,,,,,,
,,,,,,,,,,,,,,,,,,
,,,,,,,,,,,,,,,,,,
,,,,,,,,,,,,,,,,,,
,,,,,,,,,,,,,,,,,,
,,,,,,,,,,,,,,,,,,
,,,,,,,,,,,,,,,,,,
,,,,,,,,,,,,,,,,,,
,,,,,,,,,,,,,,,,,,
,,,,,,,,,,,,,,,,,,
,,,,,,,,,,,,,,,,,,
,,,,,,,,,,,,,,,,,,
,,,,,,,,,,,,,,,,,,
,,,,,,,,,,,,,,,,,,
,,,,,,,,,,,,,,,,,,
,,,,,,,,,,,,,,,,,,
,,,,,,,,,,,,,,,,,,
,,,,,,,,,,,,,,,,,,
,,,,,,,,,,,,,,,,,,
,,,,,,,,,,,,,,,,,,
,,,,,,,,,,,,,,,,,,
,,,,,,,,,,,,,,,,,,
,,,,,,,,,,,,,,,,,,
,,,,,,,,,,,,,,,,,,
,,,,,,,,,,,,,,,,,,
,,,,,,,,,,,,,,,,,,
,,,,,,,,,,,,,,,,,,
,,,,,,,,,,,,,,,,,,
,,,,,,,,,,,,,,,,,,
,,,,,,,,,,,,,,,,,,
,,,,,,,,,,,,,,,,,,
,,,,,,,,,,,,,,,,,,
,,,,,,,,,,,,,,,,,,
,,,,,,,,,,,,,,,,,,
,,,,,,,,,,,,,,,,,,
,,,,,,,,,,,,,,,,,,
,,,,,,,,,,,,,,,,,,
,,,,,,,,,,,,,,,,,,
,,,,,,,,,,,,,,,,,,
,,,,,,,,,,,,,,,,,,
,,,,,,,,,,,,,,,,,,
,,,,,,,,,,,,,,,,,,
,,,,,,,,,,,,,,,,,,
,,,,,,,,,,,,,,,,,,
,,,,,,,,,,,,,,,,,,
,,,,,,,,,,,,,,,,,,
,,,,,,,,,,,,,,,,,,
,,,,,,,,,,,,,,,,,,
,,,,,,,,,,,,,,,,,,
,,,,,,,,,,,,,,,,,,
,,,,,,,,,,,,,,,,,,
,,,,,,,,,,,,,,,,,,
,,,,,,,,,,,,,,,,,,
,,,,,,,,,,,,,,,,,,
,,,,,,,,,,,,,,,,,,
,,,,,,,,,,,,,,,,,,
,,,,,,,,,,,,,,,,,,
,,,,,,,,,,,,,,,,,,
,,,,,,,,,,,,,,,,,,
,,,,,,,,,,,,,,,,,,
,,,,,,,,,,,,,,,,,,
,,,,,,,,,,,,,,,,,,
,,,,,,,,,,,,,,,,,,
,,,,,,,,,,,,,,,,,,
,,,,,,,,,,,,,,,,,,
,,,,,,,,,,,,,,,,,,
,,,,,,,,,,,,,,,,,,
,,,,,,,,,,,,,,,,,,
,,,,,,,,,,,,,,,,,,
,,,,,,,,,,,,,,,,,,
,,,,,,,,,,,,,,,,,,
,,,,,,,,,,,,,,,,,,
,,,,,,,,,,,,,,,,,,
,,,,,,,,,,,,,,,,,,
,,,,,,,,,,,,,,,,,,
,,,,,,,,,,,,,,,,,,
,,,,,,,,,,,,,,,,,,
,,,,,,,,,,,,,,,,,,
,,,,,,,,,,,,,,,,,,
,,,,,,,,,,,,,,,,,,
,,,,,,,,,,,,,,,,,,
,,,,,,,,,,,,,,,,,,
,,,,,,,,,,,,,,,,,,
,,,,,,,,,,,,,,,,,,
,,,,,,,,,,,,,,,,,,
,,,,,,,,,,,,,,,,,,
,,,,,,,,,,,,,,,,,,
,,,,,,,,,,,,,,,,,,
,,,,,,,,,,,,,,,,,,
,,,,,,,,,,,,,,,,,,
,,,,,,,,,,,,,,,,,,
,,,,,,,,,,,,,,,,,,
,,,,,,,,,,,,,,,,,,
,,,,,,,,,,,,,,,,,,
,,,,,,,,,,,,,,,,,,
,,,,,,,,,,,,,,,,,,
,,,,,,,,,,,,,,,,,,
,,,,,,,,,,,,,,,,,,
,,,,,,,,,,,,,,,,,,
,,,,,,,,,,,,,,,,,,
,,,,,,,,,,,,,,,,,,
,,,,,,,,,,,,,,,,,,
,,,,,,,,,,,,,,,,,,
,,,,,,,,,,,,,,,,,,
,,,,,,,,,,,,,,,,,,
,,,,,,,,,,,,,,,,,,
,,,,,,,,,,,,,,,,,,
,,,,,,,,,,,,,,,,,,
,,,,,,,,,,,,,,,,,,
,,,,,,,,,,,,,,,,,,
,,,,,,,,,,,,,,,,,,
,,,,,,,,,,,,,,,,,,
,,,,,,,,,,,,,,,,,,
,,,,,,,,,,,,,,,,,,
,,,,,,,,,,,,,,,,,,
,,,,,,,,,,,,,,,,,,
,,,,,,,,,,,,,,,,,,
,,,,,,,,,,,,,,,,,,
,,,,,,,,,,,,,,,,,,
,,,,,,,,,,,,,,,,,,
,,,,,,,,,,,,,,,,,,
,,,,,,,,,,,,,,,,,,
,,,,,,,,,,,,,,,,,,
,,,,,,,,,,,,,,,,,,
,,,,,,,,,,,,,,,,,,
,,,,,,,,,,,,,,,,,,
,,,,,,,,,,,,,,,,,,
,,,,,,,,,,,,,,,,,,
,,,,,,,,,,,,,,,,,,
,,,,,,,,,,,,,,,,,,
,,,,,,,,,,,,,,,,,,
,,,,,,,,,,,,,,,,,,
,,,,,,,,,,,,,,,,,,
,,,,,,,,,,,,,,,,,,
,,,,,,,,,,,,,,,,,,
,,,,,,,,,,,,,,,,,,
,,,,,,,,,,,,,,,,,,
,,,,,,,,,,,,,,,,,,
,,,,,,,,,,,,,,,,,,
,,,,,,,,,,,,,,,,,,
,,,,,,,,,,,,,,,,,,
,,,,,,,,,,,,,,,,,,
,,,,,,,,,,,,,,,,,,
,,,,,,,,,,,,,,,,,,
,,,,,,,,,,,,,,,,,,
,,,,,,,,,,,,,,,,,,
,,,,,,,,,,,,,,,,,,
,,,,,,,,,,,,,,,,,,
,,,,,,,,,,,,,,,,,,
,,,,,,,,,,,,,,,,,,
,,,,,,,,,,,,,,,,,,
,,,,,,,,,,,,,,,,,,
,,,,,,,,,,,,,,,,,,
,,,,,,,,,,,,,,,,,,
,,,,,,,,,,,,,,,,,,
,,,,,,,,,,,,,,,,,,
,,,,,,,,,,,,,,,,,,
,,,,,,,,,,,,,,,,,,
,,,,,,,,,,,,,,,,,,
,,,,,,,,,,,,,,,,,,
,,,,,,,,,,,,,,,,,,
,,,,,,,,,,,,,,,,,,
,,,,,,,,,,,,,,,,,,
,,,,,,,,,,,,,,,,,,
,,,,,,,,,,,,,,,,,,
,,,,,,,,,,,,,,,,,,
,,,,,,,,,,,,,,,,,,
,,,,,,,,,,,,,,,,,,
,,,,,,,,,,,,,,,,,,
,,,,,,,,,,,,,,,,,,
,,,,,,,,,,,,,,,,,,
,,,,,,,,,,,,,,,,,,
,,,,,,,,,,,,,,,,,,
,,,,,,,,,,,,,,,,,,
,,,,,,,,,,,,,,,,,,
,,,,,,,,,,,,,,,,,,
,,,,,,,,,,,,,,,,,,
,,,,,,,,,,,,,,,,,,
,,,,,,,,,,,,,,,,,,
,,,,,,,,,,,,,,,,,,
,,,,,,,,,,,,,,,,,,
,,,,,,,,,,,,,,,,,,
,,,,,,,,,,,,,,,,,,
,,,,,,,,,,,,,,,,,,
,,,,,,,,,,,,,,,,,,
,,,,,,,,,,,,,,,,,,
,,,,,,,,,,,,,,,,,,
,,,,,,,,,,,,,,,,,,
,,,,,,,,,,,,,,,,,,
,,,,,,,,,,,,,,,,,,
,,,,,,,,,,,,,,,,,,
,,,,,,,,,,,,,,,,,,
,,,,,,,,,,,,,,,,,,
,,,,,,,,,,,,,,,,,,
,,,,,,,,,,,,,,,,,,
,,,,,,,,,,,,,,,,,,
,,,,,,,,,,,,,,,,,,
,,,,,,,,,,,,,,,,,,
,,,,,,,,,,,,,,,,,,
,,,,,,,,,,,,,,,,,,
,,,,,,,,,,,,,,,,,,
,,,,,,,,,,,,,,,,,,
,,,,,,,,,,,,,,,,,,
,,,,,,,,,,,,,,,,,,
,,,,,,,,,,,,,,,,,,
,,,,,,,,,,,,,,,,,,
,,,,,,,,,,,,,,,,,,
,,,,,,,,,,,,,,,,,,
,,,,,,,,,,,,,,,,,,
,,,,,,,,,,,,,,,,,,
,,,,,,,,,,,,,,,,,,
,,,,,,,,,,,,,,,,,,
,,,,,,,,,,,,,,,,,,
,,,,,,,,,,,,,,,,,,
,,,,,,,,,,,,,,,,,,
,,,,,,,,,,,,,,,,,,
,,,,,,,,,,,,,,,,,,
,,,,,,,,,,,,,,,,,,
,,,,,,,,,,,,,,,,,,
,,,,,,,,,,,,,,,,,,
,,,,,,,,,,,,,,,,,,
,,,,,,,,,,,,,,,,,,
,,,,,,,,,,,,,,,,,,
,,,,,,,,,,,,,,,,,,
,,,,,,,,,,,,,,,,,,
,,,,,,,,,,,,,,,,,,
,,,,,,,,,,,,,,,,,,
,,,,,,,,,,,,,,,,,,
,,,,,,,,,,,,,,,,,,
,,,,,,,,,,,,,,,,,,
,,,,,,,,,,,,,,,,,,
,,,,,,,,,,,,,,,,,,
,,,,,,,,,,,,,,,,,,
,,,,,,,,,,,,,,,,,,
,,,,,,,,,,,,,,,,,,
,,,,,,,,,,,,,,,,,,
,,,,,,,,,,,,,,,,,,
,,,,,,,,,,,,,,,,,,
,,,,,,,,,,,,,,,,,,
,,,,,,,,,,,,,,,,,,
,,,,,,,,,,,,,,,,,,
,,,,,,,,,,,,,,,,,,
,,,,,,,,,,,,,,,,,,
,,,,,,,,,,,,,,,,,,
,,,,,,,,,,,,,,,,,,
,,,,,,,,,,,,,,,,,,
,,,,,,,,,,,,,,,,,,
,,,,,,,,,,,,,,,,,,
,,,,,,,,,,,,,,,,,,
,,,,,,,,,,,,,,,,,,
,,,,,,,,,,,,,,,,,,
,,,,,,,,,,,,,,,,,,
,,,,,,,,,,,,,,,,,,
,,,,,,,,,,,,,,,,,,
,,,,,,,,,,,,,,,,,,
,,,,,,,,,,,,,,,,,,
,,,,,,,,,,,,,,,,,,
,,,,,,,,,,,,,,,,,,
,,,,,,,,,,,,,,,,,,
,,,,,,,,,,,,,,,,,,
,,,,,,,,,,,,,,,,,,
,,,,,,,,,,,,,,,,,,
,,,,,,,,,,,,,,,,,,
,,,,,,,,,,,,,,,,,,
,,,,,,,,,,,,,,,,,,
,,,,,,,,,,,,,,,,,,
,,,,,,,,,,,,,,,,,,
,,,,,,,,,,,,,,,,,,
,,,,,,,,,,,,,,,,,,
,,,,,,,,,,,,,,,,,,
,,,,,,,,,,,,,,,,,,
,,,,,,,,,,,,,,,,,,
,,,,,,,,,,,,,,,,,,
,,,,,,,,,,,,,,,,,,
,,,,,,,,,,,,,,,,,,
,,,,,,,,,,,,,,,,,,
,,,,,,,,,,,,,,,,,,
,,,,,,,,,,,,,,,,,,
,,,,,,,,,,,,,,,,,,
,,,,,,,,,,,,,,,,,,
,,,,,,,,,,,,,,,,,,
,,,,,,,,,,,,,,,,,,
,,,,,,,,,,,,,,,,,,
,,,,,,,,,,,,,,,,,,
,,,,,,,,,,,,,,,,,,
,,,,,,,,,,,,,,,,,,
,,,,,,,,,,,,,,,,,,
,,,,,,,,,,,,,,,,,,
,,,,,,,,,,,,,,,,,,
,,,,,,,,,,,,,,,,,,
,,,,,,,,,,,,,,,,,,
,,,,,,,,,,,,,,,,,,
,,,,,,,,,,,,,,,,,,
,,,,,,,,,,,,,,,,,,
,,,,,,,,,,,,,,,,,,
,,,,,,,,,,,,,,,,,,
,,,,,,,,,,,,,,,,,,
,,,,,,,,,,,,,,,,,,
,,,,,,,,,,,,,,,,,,
,,,,,,,,,,,,,,,,,,
,,,,,,,,,,,,,,,,,,
,,,,,,,,,,,,,,,,,,
,,,,,,,,,,,,,,,,,,
,,,,,,,,,,,,,,,,,,
,,,,,,,,,,,,,,,,,,
,,,,,,,,,,,,,,,,,,
,,,,,,,,,,,,,,,,,,
,,,,,,,,,,,,,,,,,,
,,,,,,,,,,,,,,,,,,
,,,,,,,,,,,,,,,,,,
,,,,,,,,,,,,,,,,,,
,,,,,,,,,,,,,,,,,,
,,,,,,,,,,,,,,,,,,
,,,,,,,,,,,,,,,,,,
,,,,,,,,,,,,,,,,,,
,,,,,,,,,,,,,,,,,,
,,,,,,,,,,,,,,,,,,
,,,,,,,,,,,,,,,,,,
,,,,,,,,,,,,,,,,,,
,,,,,,,,,,,,,,,,,,
,,,,,,,,,,,,,,,,,,
,,,,,,,,,,,,,,,,,,
,,,,,,,,,,,,,,,,,,
,,,,,,,,,,,,,,,,,,
,,,,,,,,,,,,,,,,,,
,,,,,,,,,,,,,,,,,,
,,,,,,,,,,,,,,,,,,
,,,,,,,,,,,,,,,,,,
,,,,,,,,,,,,,,,,,,
,,,,,,,,,,,,,,,,,,
,,,,,,,,,,,,,,,,,,
,,,,,,,,,,,,,,,,,,
,,,,,,,,,,,,,,,,,,
,,,,,,,,,,,,,,,,,,
,,,,,,,,,,,,,,,,,,
,,,,,,,,,,,,,,,,,,
,,,,,,,,,,,,,,,,,,
,,,,,,,,,,,,,,,,,,
,,,,,,,,,,,,,,,,,,
,,,,,,,,,,,,,,,,,,
,,,,,,,,,,,,,,,,,,
,,,,,,,,,,,,,,,,,,
,,,,,,,,,,,,,,,,,,
,,,,,,,,,,,,,,,,,,
,,,,,,,,,,,,,,,,,,
,,,,,,,,,,,,,,,,,,
,,,,,,,,,,,,,,,,,,
,,,,,,,,,,,,,,,,,,
,,,,,,,,,,,,,,,,,,
,,,,,,,,,,,,,,,,,,
,,,,,,,,,,,,,,,,,,
,,,,,,,,,,,,,,,,,,
,,,,,,,,,,,,,,,,,,
,,,,,,,,,,,,,,,,,,
,,,,,,,,,,,,,,,,,,
,,,,,,,,,,,,,,,,,,
,,,,,,,,,,,,,,,,,,
,,,,,,,,,,,,,,,,,,
,,,,,,,,,,,,,,,,,,
,,,,,,,,,,,,,,,,,,
,,,,,,,,,,,,,,,,,,
,,,,,,,,,,,,,,,,,,
,,,,,,,,,,,,,,,,,,
,,,,,,,,,,,,,,,,,,
,,,,,,,,,,,,,,,,,,
,,,,,,,,,,,,,,,,,,
,,,,,,,,,,,,,,,,,,
,,,,,,,,,,,,,,,,,,
,,,,,,,,,,,,,,,,,,
,,,,,,,,,,,,,,,,,,
,,,,,,,,,,,,,,,,,,
,,,,,,,,,,,,,,,,,,
,,,,,,,,,,,,,,,,,,
,,,,,,,,,,,,,,,,,,
,,,,,,,,,,,,,,,,,,
,,,,,,,,,,,,,,,,,,
,,,,,,,,,,,,,,,,,,
,,,,,,,,,,,,,,,,,,
,,,,,,,,,,,,,,,,,,
,,,,,,,,,,,,,,,,,,
,,,,,,,,,,,,,,,,,,
,,,,,,,,,,,,,,,,,,
,,,,,,,,,,,,,,,,,,
,,,,,,,,,,,,,,,,,,
,,,,,,,,,,,,,,,,,,
,,,,,,,,,,,,,,,,,,
,,,,,,,,,,,,,,,,,,
,,,,,,,,,,,,,,,,,,
,,,,,,,,,,,,,,,,,,
,,,,,,,,,,,,,,,,,,
,,,,,,,,,,,,,,,,,,
,,,,,,,,,,,,,,,,,,
,,,,,,,,,,,,,,,,,,
,,,,,,,,,,,,,,,,,,
,,,,,,,,,,,,,,,,,,
,,,,,,,,,,,,,,,,,,
,,,,,,,,,,,,,,,,,,
,,,,,,,,,,,,,,,,,,
,,,,,,,,,,,,,,,,,,
,,,,,,,,,,,,,,,,,,
,,,,,,,,,,,,,,,,,,
,,,,,,,,,,,,,,,,,,
,,,,,,,,,,,,,,,,,,
,,,,,,,,,,,,,,,,,,
,,,,,,,,,,,,,,,,,,
,,,,,,,,,,,,,,,,,,
,,,,,,,,,,,,,,,,,,
,,,,,,,,,,,,,,,,,,
,,,,,,,,,,,,,,,,,,