key,title,authors,journal,issn,volume,issue,pages,day,month,year,publisher,pmc_id,pubmed_id,url,abstract,doi,duplicate_of,covidence_id,covidence_study_name,covidence_status,covidence_notes,covidence_tags,discarded,latest_version,latest_date
LSR8553,"AI-Driven CT-based quantification, staging and short-term outcome prediction of COVID-19 pneumonia","Chassagnon, G.; Vakalopoulou, M.; Battistella, E.; Christodoulidis, S.; Hoang-Thi, T.-N.; Dangeard, S.; Deutsch, E.; Andre, F.; Guillo, E.; Halm, N.; El Hajj, S.; Bompard, F.; Neveu, S.; Hani, C.; Saab, I.; Campredon, A.; Koulakian, H.; Bennani, S.; Freche, G.; Lombard, A.; Fournier, L.; Monnier, H.; Grand, T.; Gregory, J.; Khalil, A.; Mahdjoub, E.; Brillet, P.-Y.; Tran Ba, S.; Bousson, V.; Revel, M.-P.; Paragios, N.",MedRxiv,,,,,,04,2020,,,,https://www.medrxiv.org/content/10.1101/2020.04.17.20069187v1,"Chest computed tomography (CT) is widely used for the management of Coronavirus disease 2019 (COVID-19) 49 pneumonia because of its availability and rapidity. The standard of reference for confirming COVID-19 relies on microbiological tests but these tests might not be available in an emergency setting and their results are not immediately available, contrary to CT. In addition to its role for early diagnosis, CT has a prognostic role by allowing visually evaluating the extent of COVID-19 lung abnormalities. The objective of this study is to address prediction of short-term outcomes, especially need for mechanical ventilation. In this multi-centric study, we propose an end-to-end artificial intelligence solution for automatic quantification and prognosis assessment by combining automatic CT delineation of lung disease meeting the performance of experts and data-driven identification of biomarkers for its prognosis. AI-driven combination of variables with CT-based biomarkers offers perspectives for optimal patient management given the shortage of intensive care beds and ventilators.",10.1101/2020.04.17.20069187,,#277,Chassagnon 2020,Included,,BATCH1; QualityPass,,https://www.medrxiv.org/content/10.1101/2020.04.17.20069187v2,2020-07-10
LSR8860,From Community Acquired Pneumonia to COVID-19: A Deep Learning Based Method for Quantitative Analysis of COVID-19 on thick-section CT Scans,"Li, Z.; Zhong, Z.; Li, Y.; Zhang, T.; Gao, L.; Jin, D.; Sun, Y.; Ye, X.; Yu, L.; Hu, Z.; Xiao, J.; Huang, L.; Tang, Y.",MedRxiv,,,,,,04,2020,,,,https://www.medrxiv.org/content/10.1101/2020.04.17.20070219v1,"Background: Thick-section CT scanners are more affordable for the developing countries. Considering the widely spread COVID-19, it is of great benefit to develop an automated and accurate system for quantification of COVID-19 associated lung abnormalities using thick-section chest CT images. Purpose: To develop a fully automated AI system to quantitatively assess the disease severity and disease progression using thick-section chest CT images. Materials and Methods: In this retrospective study, a deep learning based system was developed to automatically segment and quantify the COVID-19 infected lung regions on thick-section chest CT images. 531 thick-section CT scans from 204 patients diagnosed with COVID-19 were collected from one appointed COVID-19 hospital from 23 January 2020 to 12 February 2020. The lung abnormalities were first segmented by a deep learning model. To assess the disease severity (non-severe or severe) and the progression, two imaging bio-markers were automatically computed, i.e., the portion of infection (POI) and the average infection HU (iHU). The performance of lung abnormality segmentation was examined using Dice coefficient, while the assessment of disease severity and the disease progression were evaluated using the area under the receiver operating characteristic curve (AUC) and the Cohen's kappa statistic, respectively. Results: Dice coefficient between the segmentation of the AI system and the manual delineations of two experienced radiologists for the COVID-19 infected lung abnormalities were 0.74 {+/-} 0.28 and 0.76 {+/-} 0.29, respectively, which were close to the inter-observer agreement, i.e., 0.79 {+/-} 0.25. The computed two imaging bio-markers can distinguish between the severe and non-severe stages with an AUC of 0.9680 (p-value < 0.001). Very good agreement ({kappa} = 0.8220) between the AI system and the radiologists were achieved on evaluating the changes of infection volumes. Conclusions: A deep learning based AI system built on the thick-section CT imaging can accurately quantify the COVID-19 associated lung abnormalities, assess the disease severity and its progressions.",10.1101/2020.04.17.20070219,,#390,Li 2020,Included,,BATCH1; QualityFail,,Updated by published LSR44712,2020-08-13
LSR19598,"AI-based multi-modal integration of clinical characteristics, lab tests and chest CTs improves COVID-19 outcome prediction of hospitalized patients","Lassau, N.; Ammari, S.; Chouzenoux, E.; Gortais, H.; Herent, P.; Devilder, M.; Soliman, S.; Meyrignac, O.; Talabard, M.-P.; Lamarque, J.-P.; Dubois, R.; Loiseau, N.; Trichelair, P.; Bendjebbar, E.; Garcia, G.; Balleyguier, C.; Merad, M.; Stoclin, A.; Jegou, S.; Griscelli, F.; Tetelboum, N.; Li, Y.; Verma, S.; Terris, M.; Dardouri, T.; Gupta, K.; Neacsu, A.; Chemouni, F.; Sefta, M.; Jehanno, P.; Bousaid, I.; Boursin, Y.; Planchet, E.; Azoulay, M.; Dachary, J.; Brulport, F.; Gonzalez, A.; Dehaene, O.; Schiratti, J.-B.; Schutte, K.; Pesquet, J.-C.; Talbot, H.; Pronier, E.; Wainrib, G.; Clozel, T.",MedRxiv,,,,,,05,2020,,,,https://www.medrxiv.org/content/10.1101/2020.05.14.20101972v1,"With 15% of severe cases among hospitalized patients1, the SARS-COV-2 pandemic has put tremendous pressure on Intensive Care Units, and made the identification of early predictors of severity a public health priority. We collected clinical and biological data, as well as CT scan images and radiology reports from 1,003 coronavirus-infected patients from two French hospitals. Radiologists' manual CT annotations were also available. We first identified 11 clinical variables and 3 types of radiologist-reported features significantly associated with prognosis. Next, focusing on the CT images, we trained deep learning models to automatically segment the scans and reproduce radiologists' annotations. We also built CT image-based deep learning models that predicted severity better than models based on the radiologists' scan reports. Finally, we showed that including CT scan features alongside the clinical and biological data yielded more accurate predictions than using clinical and biological data only. These findings show that CT scans provide insightful early predictors of severity.",10.1101/2020.05.14.20101972,,#366,Lassau 2020,Included,,BATCH1; QualityPass,,https://www.medrxiv.org/content/10.1101/2020.05.14.20101972v2,2020-07-02
LSR22167,AIDCOV: An Interpretable Artificial Intelligence Model for Detection of COVID-19 from Chest Radiography Images,"Zokaeinikoo, M.; Mitra, P.; Kumara, S.; Kazemian, P.",MedRxiv,,,,,,05,2020,,,,https://www.medrxiv.org/content/10.1101/2020.05.24.20111922v1,"As the Coronavirus Disease 2019 (COVID-19) pandemic continues to grow globally, testing to detect COVID-19 and isolating individuals who test positive remains to be the primary strategy for preventing community spread of the disease. The current gold standard method of testing for COVID-19 is the reverse transcription polymerase chain reaction (RT-PCR) test. The RT-PCR test, however, has an imperfect sensitivity (around 70%), is time-consuming and labor-intensive, and is in short supply, particularly in resource-limited countries. Therefore, automatic and accurate detection of COVID-19 using medical imaging modalities such as chest X-ray and Computed Tomography, which are more widely available and accessible, can be beneficial. We develop a novel hierarchical attention neural network model to classify chest radiography images as belonging to a person with either COVID-19, other infections, or no pneumonia (i.e., normal). We refer to this model as Artificial Intelligence for Detection of COVID-19 (AIDCOV). The hierarchical structure in AIDCOV captures the dependency of features and improves model performance while the attention mechanism makes the model interpretable and transparent. Using a publicly available dataset of 5801 chest images, we demonstrate that our model achieves a mean cross-validation accuracy of 97.8%. AIDCOV has a sensitivity of 99.3%, a specificity of 99.98%, and a positive predictive value of 99.6% in detecting COVID-19 from chest radiography images. AIDCOV can be used in conjunction with or instead of RT-PCR testing (where RT-PCR testing is unavailable) to detect and isolate individuals with COVID-19 and prevent onward transmission to the general population and healthcare workers.",10.1101/2020.05.24.20111922,,#317,Zokaeinikoo 2020,Included,,BATCH1; QualityPass,,https://www.medrxiv.org/content/10.1101/2020.05.24.20111922v3,2020-06-29
A2005.11856,Predicting COVID-19 Pneumonia Severity on Chest X-ray with Deep Learning,Joseph Paul Cohen; Lan Dao; Paul Morrison; Karsten Roth; Yoshua Bengio; Beiyi Shen; Almas Abbasi; Mahsa Hoshmand-Kochi; Marzyeh Ghassemi; Haifang Li; Tim Q Duong,arXiv,,,,,24,5,2020,,,,http://arxiv.org/abs/2005.11856v1,"The need to streamline patient management for COVID-19 has become more pressing than ever. Chest X-rays provide a non-invasive (potentially bedside) tool to monitor the progression of the disease. In this study, we present a severity score prediction model for COVID-19 pneumonia for frontal chest X-ray images. Such a tool can gauge severity of COVID-19 lung infections (and pneumonia in general) that can be used for escalation or de-escalation of care as well as monitoring treatment efficacy, especially in the ICU. Images from a public COVID-19 database were scored retrospectively by three blinded experts in terms of the extent of lung involvement as well as the degree of opacity. A neural network model that was pre-trained on large (non-COVID-19) chest X-ray datasets is used to construct features for COVID-19 images which are predictive for our task. This study finds that training a regression model on a subset of the outputs from an this pre-trained chest X-ray model predicts our geographic extent score (range 0-8) with 1.14 mean absolute error (MAE) and our lung opacity score (range 0-6) with 0.78 MAE. All code, labels, and data are made available at https://github.com/mlmed/torchxrayvision and https://github.com/ieee8023/covid-chestxray-dataset",,,#314,JosephPaulCohen 2020,Included,,BATCH1; QualityPass,,http://arxiv.org/abs/2005.11856v3,2020-06-30
A2005.11003,SODA: Detecting Covid-19 in Chest X-rays with Semi-supervised Open Set Domain Adaptation,Jieli Zhou; Baoyu Jing; Zeya Wang,arXiv,,,,,22,5,2020,,,,http://arxiv.org/abs/2005.11003v1,"The global pandemic of COVID-19 has infected millions of people since its first outbreak in last December. A key challenge for preventing and controlling COVID-19 is how to quickly, widely, and effectively implement the test for the disease, because testing is the first step to break the chains of transmission. To assist the diagnosis of the disease, radiology imaging is used to complement the screening process and triage patients into different risk levels. Deep learning methods have taken a more active role in automatically detecting COVID-19 disease in chest x-ray images, as witnessed in many recent works. Most of these works first train a CNN on an existing large-scale chest x-ray image dataset and then fine-tune it with a COVID-19 dataset at a much smaller scale. However, direct transfer across datasets from different domains may lead to poor performance due to visual domain shift. Also, the small scale of the COVID-19 dataset on the target domain can make the training fall into the overfitting trap. To solve all these crucial problems and fully exploit the available large-scale chest x-ray image dataset, we formulate the problem of COVID-19 chest x-ray image classification in a semi-supervised open set domain adaptation setting, through which we are motivated to reduce the domain shift and avoid overfitting when training on a very small dataset of COVID-19. In addressing this formulated problem, we propose a novel Semi-supervised Open set Domain Adversarial network (SODA), which is able to align the data distributions across different domains in a general domain space and also in a common subspace of source and target data. In our experiments, SODA achieves a leading classification performance compared with recent state-of-the-art models, as well as effectively separating COVID-19 with common pneumonia.",,,#311,JieliZhou 2020,Included,,BATCH1; QualityFail,,http://arxiv.org/abs/2005.11003v2,2020-08-05
A2005.02690,Dual-Sampling Attention Network for Diagnosis of COVID-19 from Community Acquired Pneumonia,Xi Ouyang; Jiayu Huo; Liming Xia; Fei Shan; Jun Liu; Zhanhao Mo; Fuhua Yan; Zhongxiang Ding; Qi Yang; Bin Song; Feng Shi; Huan Yuan; Ying Wei; Xiaohuan Cao; Yaozong Gao; Dijia Wu; Qian Wang; Dinggang Shen,arXiv,,,,,20,5,2020,,,,http://arxiv.org/abs/2005.02690v2,"The coronavirus disease (COVID-19) is rapidly spreading all over the world, and has infected more than 1,436,000 people in more than 200 countries and territories as of April 9, 2020. Detecting COVID-19 at early stage is essential to deliver proper healthcare to the patients and also to protect the uninfected population. To this end, we develop a dual-sampling attention network to automatically diagnose COVID- 19 from the community acquired pneumonia (CAP) in chest computed tomography (CT). In particular, we propose a novel online attention module with a 3D convolutional network (CNN) to focus on the infection regions in lungs when making decisions of diagnoses. Note that there exists imbalanced distribution of the sizes of the infection regions between COVID-19 and CAP, partially due to fast progress of COVID-19 after symptom onset. Therefore, we develop a dual-sampling strategy to mitigate the imbalanced learning. Our method is evaluated (to our best knowledge) upon the largest multi-center CT data for COVID-19 from 8 hospitals. In the training-validation stage, we collect 2186 CT scans from 1588 patients for a 5-fold cross-validation. In the testing stage, we employ another independent large-scale testing dataset including 2796 CT scans from 2057 patients. Results show that our algorithm can identify the COVID-19 images with the area under the receiver operating characteristic curve (AUC) value of 0.944, accuracy of 87.5%, sensitivity of 86.9%, specificity of 90.1%, and F1-score of 82.0%. With this performance, the proposed algorithm could potentially aid radiologists with COVID-19 diagnosis from CAP, especially in the early stage of the COVID-19 outbreak.",,,#300,XiOuyang 2020,Included,,BATCH1; QualityFail,,Updated by published LSR49411,2020-08-13
A2004.11676,Automated diagnosis of COVID-19 with limited posteroanterior chest X-ray images using fine-tuned deep neural networks,Narinder Singh Punn; Sonali Agarwal,arXiv,,,,,23,4,2020,,,,http://arxiv.org/abs/2004.11676v1,"The novel coronavirus 2019 (COVID-19) is a respiratory syndrome that resembles pneumonia. The current diagnostic procedure of COVID-19 follows reverse-transcriptase polymerase chain reaction (RT-PCR) based approach which however is less sensitive to identify the virus at the initial stage. Hence, a more robust and alternate diagnosis technique is desirable. Recently, with the release of publicly available datasets of corona positive patients comprising of computed tomography (CT) and chest X-ray (CXR) imaging; scientists, researchers and healthcare experts are contributing for faster and automated diagnosis of COVID-19 by identifying pulmonary infections using deep learning approaches to achieve better cure and treatment. These datasets have limited samples concerned with the positive COVID-19 cases, which raise the challenge for unbiased learning. Following from this context, this article presents the random oversampling and weighted class loss function approach for unbiased fine-tuned learning (transfer learning) in various state-of-the-art deep learning approaches such as baseline ResNet, Inception-v3, Inception ResNet-v2, DenseNet169, and NASNetLarge to perform binary classification (as normal and COVID-19 cases) and also multi-class classification (as COVID-19, pneumonia, and normal case) of posteroanterior CXR images. Accuracy, precision, recall, loss, and area under the curve (AUC) are utilized to evaluate the performance of the models. Considering the experimental results, the performance of each model is scenario dependent; however, NASNetLarge displayed better scores in contrast to other architectures. This article also added the visual explanation to illustrate the basis of model classification and perception of COVID-19 in CXR images.",,,#285,NarinderSinghPunn 2020,Included,,BATCH1; QualityFail,,http://arxiv.org/abs/2004.11676v5,2020-07-21
A2004.09363,Deep-COVID: Predicting COVID-19 From Chest X-Ray Images Using Deep Transfer Learning,Shervin Minaee; Rahele Kafieh; Milan Sonka; Shakib Yazdani; Ghazaleh Jamalipour Soufi,arXiv,,,,,20,4,2020,,,,http://arxiv.org/abs/2004.09363v1,"The COVID-19 pandemic is causing a major outbreak in more than 150 countries around the world, having a severe impact on the health and life of many people globally. One of the crucial step in fighting COVID-19 is the ability to detect the infected patients early enough, and put them under special care. Detecting this disease from radiography and radiology images is perhaps one of the fastest way to diagnose the patients. Some of the early studies showed specific abnormalities in the chest radiograms of patients infected with COVID-19. Inspired by earlier works, we study the application of deep learning models to detect COVID-19 patients from their chest radiography images. We first prepare a dataset of 5,000 Chest X-rays from the publicly available datasets. Images exhibiting COVID-19 disease presence were identified by board-certified radiologist. Transfer learning on a subset of 2,000 radiograms was used to train four popular convolutional neural networks, including ResNet18, ResNet50, SqueezeNet, and DenseNet-121, to identify COVID-19 disease in the analyzed chest X-ray images. We evaluated these models on the remaining 3,000 images, and most of these networks achieved a sensitivity rate of 97\%($\pm$ 5\%), while having a specificity rate of around 90\%. While the achieved performance is very encouraging, further analysis is required on a larger set of COVID-19 images, to have a more reliable estimation of accuracy rates. Besides sensitivity and specificity rates, we also present the receiver operating characteristic (ROC), area under the curve (AUC), and confusion matrix of each model. The dataset, model implementations (in PyTorch), and evaluations, are all made publicly available for research community, here: https://github.com/shervinmin/DeepCovid.git",,,#279,ShervinMinaee 2020,Included,,BATCH1; QualityFail,,http://arxiv.org/abs/2004.09363v3,2020-07-21
A2004.09363,Deep-COVID: Predicting COVID-19 From Chest X-Ray Images Using Deep Transfer Learning,Shervin Minaee; Rahele Kafieh; Milan Sonka; Shakib Yazdani; Ghazaleh Jamalipour Soufi,arXiv,,,,,20,4,2020,,,,http://arxiv.org/abs/2004.09363v1,"The COVID-19 pandemic is causing a major outbreak in more than 150 countries around the world, having a severe impact on the health and life of many people globally. One of the crucial step in fighting COVID-19 is the ability to detect the infected patients early enough, and put them under special care. Detecting this disease from radiography and radiology images is perhaps one of the fastest way to diagnose the patients. Some of the early studies showed specific abnormalities in the chest radiograms of patients infected with COVID-19. Inspired by earlier works, we study the application of deep learning models to detect COVID-19 patients from their chest radiography images. We first prepare a dataset of 5,000 Chest X-rays from the publicly available datasets. Images exhibiting COVID-19 disease presence were identified by board-certified radiologist. Transfer learning on a subset of 2,000 radiograms was used to train four popular convolutional neural networks, including ResNet18, ResNet50, SqueezeNet, and DenseNet-121, to identify COVID-19 disease in the analyzed chest X-ray images. We evaluated these models on the remaining 3,000 images, and most of these networks achieved a sensitivity rate of 97\%($\pm$ 5\%), while having a specificity rate of around 90\%. While the achieved performance is very encouraging, further analysis is required on a larger set of COVID-19 images, to have a more reliable estimation of accuracy rates. Besides sensitivity and specificity rates, we also present the receiver operating characteristic (ROC), area under the curve (AUC), and confusion matrix of each model. The dataset, model implementations (in PyTorch), and evaluations, are all made publicly available for research community, here: https://github.com/shervinmin/DeepCovid.git",,,#279,ShervinMinaee 2020,Included,,BATCH1; QualityFail,,Updated by published LSR53678,2020-08-13
A2004.05717,Towards an Effective and Efficient Deep Learning Model for COVID-19 Patterns Detection in X-ray Images,Eduardo Luz; Pedro Lopes Silva; Rodrigo Silva; Ludmila Silva; Gladston Moreira; David Menotti,arXiv,,,,,28,4,2020,,,,http://arxiv.org/abs/2004.05717v2,"Confronting the pandemic of COVID-19 caused by the new coronavirus, the SARS-CoV-2, is nowadays one of the most prominent challenges of the human species. A key factor in slowing down the virus propagation is the rapid diagnosis and isolation of infected patients. Nevertheless, the standard method for COVID-19 identification, the Reverse transcription polymerase chain reaction (RT-PCR) method, is time-consuming and in short supply due to the pandemic. Researchers around the world have been looking for alternative screening methods. In this context, deep learning applied to chest X-rays of patients has been showing promising results in the identification of COVID-19. Despite their success, the computational cost of these methods remains high, which imposes difficulties in their accessibility and availability. Thus, in this work, we propose to explore and extend the EfficientNet family of models using chest X-rays images to perform COVID-19 detection. As a result, we can produce a high-quality model with an overall accuracy of 93.9%, COVID-19, sensitivity of 96.8% and positive prediction of 100% while having about 30 times fewer parameters than the baseline literature model, 28 and 5 times fewer parameters than the popular VGG16 and ResNet50 architectures, respectively. We believe the reported figures represent state-of-the-art results, both in terms of efficiency and effectiveness, for the COVIDx database, a database comprised of 13,800 X-ray images, 183 of which are from patients affected by COVID-19.",,,#265,EduardoLuz 2020,Included,,BATCH1; QualityPass,,http://arxiv.org/abs/2004.05717v4,2020-07-09
A2003.12338,COVID-19 Screening on Chest X-ray Images Using Deep Learning based Anomaly Detection,Jianpeng Zhang; Yutong Xie; Yi Li; Chunhua Shen; Yong Xia,arXiv,,,,,27,3,2020,,,,http://arxiv.org/abs/2003.12338v1,"Coronaviruses are important human and animal pathogens. To date the novel COVID-19 coronavirus is rapidly spreading worldwide and subsequently threatening health of billions of humans. Clinical studies have shown that most COVID-19 patients suffer from the lung infection. Although chest CT has been shown to be an effective imaging technique for lung-related disease diagnosis, chest Xray is more widely available due to its faster imaging time and considerably lower cost than CT. Deep learning, one of the most successful AI techniques, is an effective means to assist radiologists to analyze the vast amount of chest X-ray images, which can be critical for efficient and reliable COVID-19 screening. In this work, we aim to develop a new deep anomaly detection model for fast, reliable screening. To evaluate the model performance, we have collected 100 chest X-ray images of 70 patients confirmed with COVID-19 from the Github repository. To facilitate deep learning, more data are needed. Thus, we have also collected 1431 additional chest X-ray images confirmed as other pneumonia of 1008 patients from the public ChestX-ray14 dataset. Our initial experimental results show that the model developed here can reliably detect 96.00% COVID-19 cases (sensitivity being 96.00%) and 70.65% non-COVID-19 cases (specificity being 70.65%) when evaluated on 1531 Xray images with two splits of the dataset.",,,#244,JianpengZhang 2020,Included,,BATCH1; QualityFail,,http://arxiv.org/abs/2003.12338v2,2020-06-28
A2003.10849,Automatic Detection of Coronavirus Disease (COVID-19) Using X-ray Images and Deep Convolutional Neural Networks,Ali Narin; Ceren Kaya; Ziynet Pamuk,arXiv,,,,,24,3,2020,,,,http://arxiv.org/abs/2003.10849v1,"The 2019 novel coronavirus (COVID-19), with a starting point in China, has spread rapidly among people living in other countries, and is approaching approximately 305,275 cases worldwide according to the statistics of European Centre for Disease Prevention and Control. There are a limited number of COVID-19 test kits available in hospitals due to the increasing cases daily. Therefore, it is necessary to implement an automatic detection system as a quick alternative diagnosis option to prevent COVID-19 spreading among people. In this study, three different convolutional neural network based models (ResNet50, InceptionV3 and Inception-ResNetV2) have been proposed for the detection of coronavirus pneumonia infected patient using chest X-ray radiographs. ROC analyses and confusion matrices by these three models are given and analyzed using 5-fold cross validation. Considering the performance results obtained, it is seen that the pre-trained ResNet50 model provides the highest classification performance with 98% accuracy among other two proposed models (97% accuracy for InceptionV3 and 87% accuracy for Inception-ResNetV2).",,,#239,AliNarin 2020,Included,,BATCH1; QualityFail,,http://arxiv.org/abs/2003.10849v2,2020-07-12
LSR30105,A Fully Automated Deep Learning-based Network ForDetecting COVID-19 from a New And Large Lung CT ScanDataset,"Rahimzadeh, M.; Attar, A.; Sakhaei, S. M.",MedRxiv,,,,,,06,2020,,,,https://www.medrxiv.org/content/10.1101/2020.06.08.20121541v1,"COVID-19 is a severe global problem that has crippled many industries and killed many people around the world. One of the primary ways to decrease the casualties is the infected person's identification at the proper time. AI can play a significant role in these cases by monitoring and detecting infected persons in early-stage so that it can help many organizations. In this paper, we aim to propose a fully-automated method to detect COVID-19 from the patient's CT scan without needing a clinical technician. We introduce a new dataset that contains 48260 CT scan images from 282 normal persons and 15589 images from 95 patients with COVID-19 infection. Our proposed network takes all the CT scan image sequences of a patient as the input and determines if the patient is infected with COVID-19. At the first stage, this network runs an image processing algorithm to discard those CT images that inside the lung is not properly visible in them. This helps to reduce the number of images that shall be identified as normal or COVID-19, so it reduces the processing time. Also, running this algorithm makes the deep network at the next stage to analyze only the proper images and thus reduces false detections. At the next stage, we propose a modified version of ResNet50V2 that is enhanced by a feature pyramid network for classifying the selected CT images into COVID-19 or normal. If enough number of chosen CT scan images of a patient be identified as COVID-19, the network considers that patient, infected to this disease. The ResNet50V2 with feature pyramid network achieved 98.49% accuracy on more than 7996 validation images and correctly identified almost 237 patients from 245 patients.",10.1101/2020.06.08.20121541,,#756,Rahimzadeh 2020,Included,,BATCH2; QualityFail,,https://www.medrxiv.org/content/10.1101/2020.06.08.20121541v2,2020-07-04
A2006.13807,COVID-CXNet: Detecting COVID-19 in Frontal Chest X-ray Images using Deep Learning,Arman Haghanifar; Mahdiyar Molahasani Majdabadi; Seokbum Ko,arXiv,,,,,16,6,2020,,,,http://arxiv.org/abs/2006.13807v1,"One of the primary clinical observations for screening the infectious by the novel coronavirus is capturing a chest x-ray image. In most of the patients, a chest x-ray contains abnormalities, such as consolidation, which are the results of COVID-19 viral pneumonia. In this study, research is conducted on efficiently detecting imaging features of this type of pneumonia using deep convolutional neural networks in a large dataset. It is demonstrated that simple models, alongside the majority of pretrained networks in the literature, focus on irrelevant features for decision-making. In this paper, numerous chest x-ray images from various sources are collected, and the largest publicly accessible dataset is prepared. Finally, using the transfer learning paradigm, the well-known CheXNet model is utilized for developing COVID-CXNet. This powerful model is capable of detecting the novel coronavirus pneumonia based on relevant and meaningful features with precise localization. COVID-CXNet is a step towards a fully automated and robust COVID-19 detection system.",,,#926,ArmanHaghanifar 2020,Included,,BATCH2; QualityFail,,http://arxiv.org/abs/2006.13807v2,2020-07-29
A2006.05332,A Comparative Study on Early Detection of COVID-19 from Chest X-Ray Images,Mete Ahishali; Aysen Degerli; Mehmet Yamac; Serkan Kiranyaz; Muhammad E. H. Chowdhury; Khalid Hameed; Tahir Hamid; Rashid Mazhar; Moncef Gabbouj,arXiv,,,,,7,6,2020,,,,http://arxiv.org/abs/2006.05332v1,"In this study, our first aim is to evaluate the ability of recent state-of-the-art Machine Learning techniques to early detect COVID-19 from plain chest X-ray images. Both compact classifiers and deep learning approaches are considered in this study. Furthermore, we propose a recent compact classifier, Convolutional Support Estimator Network (CSEN) approach for this purpose since it is well-suited for a scarce-data classification task. Finally, this study introduces a new benchmark dataset called Early-QaTa-COV19, which consists of 175 early-stage COVID-19 Pneumonia samples (very limited or no infection signs) labelled by the medical doctors and 1579 samples for control (normal) class. A detailed set of experiments show that the CSEN achieves the top (over 98.5%) sensitivity with over 96% specificity. Moreover, transfer learning over the deep CheXNet fine-tuned with the augmented data produces the leading performance among other deep networks with 97.14% sensitivity and 99.49% specificity.",,,#919,MeteAhishali 2020,Included,,BATCH2; QualityFail,,http://arxiv.org/abs/2006.05332v3,2020-07-19
