key,title,authors,journal,issn,volume,issue,pages,day,month,year,publisher,pmc_id,pubmed_id,url,abstract,doi,date,duplicate_of,covidence_id,covidence_study_name,covidence_status,covidence_notes,covidence_tags,discarded,latest_version,latest_date
LSR19598,"AI-based multi-modal integration of clinical characteristics, lab tests and chest CTs improves COVID-19 outcome prediction of hospitalized patients","Lassau, N.; Ammari, S.; Chouzenoux, E.; Gortais, H.; Herent, P.; Devilder, M.; Soliman, S.; Meyrignac, O.; Talabard, M.-P.; Lamarque, J.-P.; Dubois, R.; Loiseau, N.; Trichelair, P.; Bendjebbar, E.; Garcia, G.; Balleyguier, C.; Merad, M.; Stoclin, A.; Jegou, S.; Griscelli, F.; Tetelboum, N.; Li, Y.; Verma, S.; Terris, M.; Dardouri, T.; Gupta, K.; Neacsu, A.; Chemouni, F.; Sefta, M.; Jehanno, P.; Bousaid, I.; Boursin, Y.; Planchet, E.; Azoulay, M.; Dachary, J.; Brulport, F.; Gonzalez, A.; Dehaene, O.; Schiratti, J.-B.; Schutte, K.; Pesquet, J.-C.; Talbot, H.; Pronier, E.; Wainrib, G.; Clozel, T.",MedRxiv,,,,,,05,2020,,,,https://www.medrxiv.org/content/10.1101/2020.05.14.20101972v1,"With 15% of severe cases among hospitalized patients1, the SARS-COV-2 pandemic has put tremendous pressure on Intensive Care Units, and made the identification of early predictors of severity a public health priority. We collected clinical and biological data, as well as CT scan images and radiology reports from 1,003 coronavirus-infected patients from two French hospitals. Radiologists' manual CT annotations were also available. We first identified 11 clinical variables and 3 types of radiologist-reported features significantly associated with prognosis. Next, focusing on the CT images, we trained deep learning models to automatically segment the scans and reproduce radiologists' annotations. We also built CT image-based deep learning models that predicted severity better than models based on the radiologists' scan reports. Finally, we showed that including CT scan features alongside the clinical and biological data yielded more accurate predictions than using clinical and biological data only. These findings show that CT scans provide insightful early predictors of severity.",10.1101/2020.05.14.20101972,,,#366,Lassau 2020,Included,,BATCH1; QualityPass,,https://www.medrxiv.org/content/10.1101/2020.05.14.20101972v3,2020-10-06
A2004.03042,COVID-MobileXpert: On-Device COVID-19 Screening using Snapshots of Chest X-Ray,Xin Li; Chengyin Li; Dongxiao Zhu,arXiv,,,,,13,4,2020,,,,http://arxiv.org/abs/2004.03042v2,"With the increasing demand for millions of COVID-19 screenings, Computed Tomography (CT) based test has emerged as a promising alternative to the gold standard RT-PCR test. However, it is primarily provided in hospital setting due to the need for expensive equipment and experienced radiologists. An accurate, rapid yet inexpensive test that is suitable for COVID-19 population screenings at mobile, urgent and primary care clinics is urgently needed. We present COVID-MobileXpert: a lightweight deep neural network (DNN) based mobile app that can use noisy snapshots of chest X-ray (CXR) for point-of-care COVID-19 screening. We design and implement a novel three-player knowledge transfer and distillation (KTD) framework including a pre-trained attending physician (AP) network that extracts CXR imaging features from large scale of lung disease CXR images, a fine-tuned resident fellow (RF) network that learns the essential CXR imaging features to discriminate COVID-19 from pneumonia and/or normal cases using a small amount of COVID-19 cases, and a trained lightweight medical student (MS) network that performs on-device COVID-19 screening. To accommodate the need for screening using noisy snapshots of CXR images, we employ novel loss functions and training schemes for the MS network to learn the robust imaging features for accurate on-device COVID-19 screening. We demonstrate the strong potential of COVID-MobileXpert for rapid deployment via extensive experiments with diverse MS network architecture, CXR imaging quality, and tuning parameter settings. The source code of cloud and mobile based models are available from https://github.com/xinli0928/COVID-Xray.",,,,#256,XinLi 2020,Included,,BATCH1; QualityPass,,http://arxiv.org/abs/2004.03042v3,2020-09-07
A2003.12338,COVID-19 Screening on Chest X-ray Images Using Deep Learning based Anomaly Detection,Jianpeng Zhang; Yutong Xie; Yi Li; Chunhua Shen; Yong Xia,arXiv,,,,,27,3,2020,,,,http://arxiv.org/abs/2003.12338v1,"Coronaviruses are important human and animal pathogens. To date the novel COVID-19 coronavirus is rapidly spreading worldwide and subsequently threatening health of billions of humans. Clinical studies have shown that most COVID-19 patients suffer from the lung infection. Although chest CT has been shown to be an effective imaging technique for lung-related disease diagnosis, chest Xray is more widely available due to its faster imaging time and considerably lower cost than CT. Deep learning, one of the most successful AI techniques, is an effective means to assist radiologists to analyze the vast amount of chest X-ray images, which can be critical for efficient and reliable COVID-19 screening. In this work, we aim to develop a new deep anomaly detection model for fast, reliable screening. To evaluate the model performance, we have collected 100 chest X-ray images of 70 patients confirmed with COVID-19 from the Github repository. To facilitate deep learning, more data are needed. Thus, we have also collected 1431 additional chest X-ray images confirmed as other pneumonia of 1008 patients from the public ChestX-ray14 dataset. Our initial experimental results show that the model developed here can reliably detect 96.00% COVID-19 cases (sensitivity being 96.00%) and 70.65% non-COVID-19 cases (specificity being 70.65%) when evaluated on 1531 Xray images with two splits of the dataset.",,,,#244,JianpengZhang 2020,Included,,BATCH1; QualityFail,,http://arxiv.org/abs/2003.12338v3,2020-09-27
LSR30105,A Fully Automated Deep Learning-based Network ForDetecting COVID-19 from a New And Large Lung CT ScanDataset,"Rahimzadeh, M.; Attar, A.; Sakhaei, S. M.",MedRxiv,,,,,,06,2020,,,,https://www.medrxiv.org/content/10.1101/2020.06.08.20121541v1,"COVID-19 is a severe global problem that has crippled many industries and killed many people around the world. One of the primary ways to decrease the casualties is the infected person's identification at the proper time. AI can play a significant role in these cases by monitoring and detecting infected persons in early-stage so that it can help many organizations. In this paper, we aim to propose a fully-automated method to detect COVID-19 from the patient's CT scan without needing a clinical technician. We introduce a new dataset that contains 48260 CT scan images from 282 normal persons and 15589 images from 95 patients with COVID-19 infection. Our proposed network takes all the CT scan image sequences of a patient as the input and determines if the patient is infected with COVID-19. At the first stage, this network runs an image processing algorithm to discard those CT images that inside the lung is not properly visible in them. This helps to reduce the number of images that shall be identified as normal or COVID-19, so it reduces the processing time. Also, running this algorithm makes the deep network at the next stage to analyze only the proper images and thus reduces false detections. At the next stage, we propose a modified version of ResNet50V2 that is enhanced by a feature pyramid network for classifying the selected CT images into COVID-19 or normal. If enough number of chosen CT scan images of a patient be identified as COVID-19, the network considers that patient, infected to this disease. The ResNet50V2 with feature pyramid network achieved 98.49% accuracy on more than 7996 validation images and correctly identified almost 237 patients from 245 patients.",10.1101/2020.06.08.20121541,,,#756,Rahimzadeh 2020,Included,,BATCH2; QualityFail,,https://www.medrxiv.org/content/10.1101/2020.06.08.20121541v3,2020-09-01
A2006.05332,A Comparative Study on Early Detection of COVID-19 from Chest X-Ray Images,Mete Ahishali; Aysen Degerli; Mehmet Yamac; Serkan Kiranyaz; Muhammad E. H. Chowdhury; Khalid Hameed; Tahir Hamid; Rashid Mazhar; Moncef Gabbouj,arXiv,,,,,7,6,2020,,,,http://arxiv.org/abs/2006.05332v1,"In this study, our first aim is to evaluate the ability of recent state-of-the-art Machine Learning techniques to early detect COVID-19 from plain chest X-ray images. Both compact classifiers and deep learning approaches are considered in this study. Furthermore, we propose a recent compact classifier, Convolutional Support Estimator Network (CSEN) approach for this purpose since it is well-suited for a scarce-data classification task. Finally, this study introduces a new benchmark dataset called Early-QaTa-COV19, which consists of 175 early-stage COVID-19 Pneumonia samples (very limited or no infection signs) labelled by the medical doctors and 1579 samples for control (normal) class. A detailed set of experiments show that the CSEN achieves the top (over 98.5%) sensitivity with over 96% specificity. Moreover, transfer learning over the deep CheXNet fine-tuned with the augmented data produces the leading performance among other deep networks with 97.14% sensitivity and 99.49% specificity.",,,,#919,MeteAhishali 2020,Included,,BATCH2; QualityFail,,http://arxiv.org/abs/2006.05332v4,2020-09-04
LSR34990,4S-DT: Self Supervised Super Sample Decomposition for Transfer learning with application to COVID-19 detection,"Abbas, A.; Abdelsamea, M.; Gaber, M.",MedRxiv,,,,,,06,2020,,,,https://www.medrxiv.org/content/10.1101/2020.06.22.20137547v1,"Due to the high availability of large-scale annotated image datasets, knowledge transfer from pre-trained models showed outstanding performance in medical image classification. However, building a robust image classification model for datasets with data irregularity or imbalanced classes can be a very challenging task, especially in the medical imaging domain. In this paper, we propose a novel deep convolutional neural network, we called Self Supervised Super Sample Decomposition for transfer learning (4S-DT) model.4S-DTencourages a coarse-to-fine transfer learning from large-scale image recognition tasks to a specific chest X-ray image classification task using a generic self-supervised sample decomposition approach. Our main contribution is a novel self-supervised learning mechanism guided by a super sample decomposition of unlabelled chest X-ray images. 4S-DT helps in improving the robustness of knowledge transformation via a downstream learning strategy with a class-decomposition layer to simplify the local structure of the data.4S-DT can deal with any irregularities in the image dataset by investigating its class boundaries using a downstream class-decomposition mechanism. We used 50,000 unlabelled chest X-ray images to achieve our coarse-to-fine transfer learning with an application to COVID-19 detection, as an exemplar.4S-DThas achieved an accuracy of97.54%in the detection of COVID-19 cases on an extended test set enriched by augmented images, out of which all real COVID-19 cases were detected, which was the highest accuracy obtained when compared to other methods.",10.1101/2020.06.22.20137547,,,#953,Abbas 2020,Included,,BATCH3,,https://www.medrxiv.org/content/10.1101/2020.06.22.20137547v2,2020-09-15
LSR42966,A Quantitative Lung Computed Tomography Image Feature for Multi-Center Severity Assessment of COVID-19,"Ghosh, B.; Kumar, N.; Sadhu, A. K.; Ghosh, N.; Mitra, P.; Chatterjee, J.",MedRxiv,,,,,,07,2020,,,,https://www.medrxiv.org/content/10.1101/2020.07.13.20152231v1,"The COVID-19 pandemic has affected millions and congested healthcare systems globally. Hence an objective severity assessment is crucial in making therapeutic decisions judiciously. Computed Tomography (CT)-scans can provide demarcating features to identify the severity of pneumonia, commonly associated with COVID-19, in the affected lungs. Here, a semi-quantitative severity assessing lung CT image feature is demonstrated for COVID-19 patients. An open-source multi-center Italian database was used, among which 61 cases were incorporated in the study (age 27-86, 71% males) from 27 CT imaging centers. Lesions in the form of opacifications, crazy-paving patterns, and consolidations were heuristically marked and the severity determining feature L_norm was quantified and established to be statistically distinct for the three classes i.e., mild, moderate, and severe (p-value < 0.0001). The thresholds of L_norm for a 3-class classification were determined based on the optimum sensitivity/specificity combination from ROC analyses. The feature L_norm classified the cases in the three severity categories with 89.34% accuracy when L_norm was calculated based on experts' heuristic annotations. Substantial to almost-perfect intra-rater and inter-rater agreements were achieved involving expert and non-expert based evaluations ({kappa}-score 0.79-0.97). We trained machine learning based classification models and showed L_norm alone has a superior diagnostic accuracy over standard image intensity and texture features. Classification accuracy was further increased when L_norm was used to delineate the severe cases from non-severe ones (98.9%) with high sensitivity (97.7%), and specificity (97.49%). Therefore, key highlights of this severity assessment feature are accuracy, lower dependency on expert availability, and wide utility across multiple imaging centers.",10.1101/2020.07.13.20152231,,,#1452,Ghosh 2020,Included,"Stephan Ursprung (2020-08-22 03:43:58)(Select): I'm sorry, I wanted to vote to include. I voted on the wrong paper.;",BATCH3; QualityPass,,https://www.medrxiv.org/content/10.1101/2020.07.13.20152231v2,2020-10-16
LSR43934,Computer-aided covid-19 patient screening using chest images (X-Ray and CT scans),"Burgos-Artizzu, X. P.",MedRxiv,,,,,,07,2020,,,,https://www.medrxiv.org/content/10.1101/2020.07.16.20155093v1,"OBJECTIVES To evaluate the performance of Artificial Intelligence (AI) methods to detect covid -19 from chest images (X-Ray and CT scans). METHODS Chest CT scans and X-Ray images collected from different centers and institutions were downloaded and combined together. Images were separated by patient and 66% of the patients were used to develop and train AI image-based classifiers. Then, the AI automated classifiers were evaluated on a separate set of patients (the remaining 33% patients). RESULTS (Chest X-Ray) Five different data sources were combined for a total of N=9,841 patients (1,733 with covid-19, 810 with bacterial tuberculosis and 7,298 healthy patients). The test sample size was N=3,528 patients. The best AI method reached an Area Under the Curve (AUC) for covid-19 detection of 99%, with a detection rate of 96.4% at 1.0% false positive rate. RESULTS (Chest CT scans) Two different data sources were combined for a total of N=363 patients (191 having covid-19 and 172 healthy patients). The test sample size was N=121 patients. The best AI method reached an AUC for covid-19 detection of 90.9%, with a detection rate of 90.6% at 24.6% false positive rate. CONCLUSIONS Computer aided automatic covid-19 detection from chest X-ray images showed promising results to be used as screening tool during the covid-19 outbreak. The developed method may help to manage patients better in case access to PCR testing is not possible or to detect patients with symptoms missed in a first round of PCR testing. The method will be made available online (www.quantuscovid19.org). These results merit further evaluation collecting more images. We hope this study will allow us to start such collaborations.",10.1101/2020.07.16.20155093,,,#1429,Burgos-Artizzu 2020,Included,,BATCH3,,https://www.medrxiv.org/content/10.1101/2020.07.16.20155093v2,2020-11-06
A2008.00597,Detection of COVID-19 from Chest X-rays using Deep Learning: Comparing COGNEX VisionPro Deep Learning 1.0 Software with Open Source Convolutional Neural Networks,Arjun Sarkar; Joerg Vandenhirtz; Jozsef Nagy; David Bacsa; Mitchell Riley,arXiv,,,,,3,8,2020,,,,http://arxiv.org/abs/2008.00597v1,"The COVID-19 pandemic has been having a severe and catastrophic effect on humankind and is being considered the most crucial health calamity of the century. One of the best methods of detecting COVID-19 is from radiological images, namely X-rays and Computed Tomography or CT scan images. Many companies and educational organizations have come together during this crisis and created various Deep Learning models for the effective diagnosis of COVID-19 from chest radiography images. For example, the University of Waterloo, along with Darwin AI, has designed its Deep Learning model COVID-Net and created a dataset called COVIDx, consisting of 13,975 images. In this study, COGNEXs Deep Learning Software-VisionPro Deep Learning is used to classify these Chest X-rays from the COVIDx dataset. The results are compared with the results of COVID-Net and various other state of the art Deep Learning models from the open-source community. Deep Learning tools are often referred to as black boxes because humans cannot interpret how or why a model is classifying an image into a particular class. This problem is addressed by testing VisionPro Deep Learning with two settings, firstly by selecting the entire image, that is, selecting the entire image as the Region of Interest-ROI, and secondly by segmenting the lungs in the first step, and then doing the classification step on the segmented lungs only, instead of using the entire image. VisionPro Deep Learning results-on the entire image as the ROI it achieves an overall F-score of 94.0 percent, and on the segmented lungs, it gets an F-score of 95.3 percent, which is at par or better than COVID-Net and other state of the art open-source Deep Learning models.",,,,#987,ArjunSarkar 2020,Included,,BATCH3,,http://arxiv.org/abs/2008.00597v2,2020-08-18
A2007.14318,CovMUNET: A Multiple Loss Approach towards Detection of COVID-19 from Chest X-ray,A. Q. M. Sazzad Sayyed; Dipayan Saha; Abdul Rakib Hossain,arXiv,,,,,28,7,2020,,,,http://arxiv.org/abs/2007.14318v1,"The recent outbreak of COVID-19 has halted the whole world, bringing a devastating effect on public health, global economy, and educational systems. As the vaccine of the virus is still not available, the most effective way to combat the virus is testing and social distancing. Among all other detection techniques, the Chest X-ray (CXR) based method can be a good solution for its simplicity, rapidity, cost, efficiency, and accessibility. In this paper, we propose CovMUNET, which is a multiple loss deep neural network approach to detect COVID-19 cases from CXR images. Extensive experiments are performed to ensure the robustness of the proposed algorithm and the performance is evaluated in terms of precision, recall, accuracy, and F1-score. The proposed method outperforms the state-of-the-art approaches with an accuracy of 96.97% for 3-class classification (COVID-19 vs normal vs pneumonia) and 99.41% for 2-class classification (COVID vs non-COVID). The proposed neural architecture also successfully detects the abnormality in CXR images.",,,,#982,A 2020,Included,,BATCH3; QualityPass,,http://arxiv.org/abs/2007.14318v2,2020-08-29
A2007.10416,Integrative Analysis for COVID-19 Patient Outcome Prediction,Hanqing Chao; Xi Fang; Jiajin Zhang; Fatemeh Homayounieh; Chiara D. Arru; Subba R. Digumarthy; Rosa Babaei; Hadi K. Mobin; Iman Mohseni; Luca Saba; Alessandro Carriero; Zeno Falaschi; Alessio Pasche; Ge Wang; Mannudeep K. Kalra; Pingkun Yan,arXiv,,,,,20,7,2020,,,,http://arxiv.org/abs/2007.10416v1,"While image analysis of chest computed tomography (CT) for COVID-19 diagnosis has been intensively studied, little work has been performed for image-based patient outcome prediction. Management of high-risk patients with early intervention is a key to lower the fatality rate of COVID-19 pneumonia, as a majority of patients recover naturally. Therefore, an accurate prediction of disease progression with baseline imaging at the time of the initial presentation can help in patient management. In lieu of only size and volume information of pulmonary abnormalities and features through deep learning based image segmentation, here we combine radiomics of lung opacities and non-imaging features from demographic data, vital signs, and laboratory findings to predict need for intensive care unit (ICU) admission. To our knowledge, this is the first study that uses holistic information of a patient including both imaging and non-imaging data for outcome prediction. The proposed methods were thoroughly evaluated on datasets separately collected from three hospitals, one in the United States, one in Iran, and another in Italy, with a total 295 patients with reverse transcription polymerase chain reaction (RT-PCR) assay positive COVID-19 pneumonia. Our experimental results demonstrate that adding non-imaging features can significantly improve the performance of prediction to achieve AUC up to 0.884 and sensitivity as high as 96.1%, which can be valuable to provide clinical decision support in managing COVID-19 patients. Our methods may also be applied to other lung diseases including but not limited to community acquired pneumonia.",,,,#975,HanqingChao 2020,Included,,BATCH3; QualityPass,,http://arxiv.org/abs/2007.10416v2,2020-09-16
A2007.08637,COV-ELM classifier: An Extreme Learning Machine based identification of COVID-19 using Chest X-Ray Images,Sheetal Rajpal; Naveen Kumar; Ankit Rajpal,arXiv,,,,,1,8,2020,,,,http://arxiv.org/abs/2007.08637v2,"Coronaviruses constitute a family of virus that particularly gives rise to respiratory diseases. Coronavirus disease (COVID-19) is an infectious disease caused by a newly discovered coronavirus also termed as Severe acute respiratory syndrome coronavirus 2 (SARS-CoV-2). Due to the rapid spread, COVID-19 outbreak has been declared a pandemic on 11th March 2020. The reverse transcription-polymerase chain reaction (RT-PCR) test is most commonly used for the qualitative assessment of the presence of SARS-CoV-2. Due to the high false-negative rate of RT-PCR test, chest X-ray (CXR) imaging has emerged to be a feasible alternative for the detection of COVID-19. In this work, we propose a multi-classification model based on extreme learning machine, COV-ELM, that aims to classify the CXR images belonging to three classes, namely COVID-19, normal, and pneumonia. The choice of ELM in this work is based on the fact that ELM significantly shortens the training time with the least interventions required to tune the networks as compared to conventional gradient-based learning algorithms. The proposed work is experimented on the COVID-19 chest X-ray (CXR) image data collected from three publicly available sources. The image data is preprocessed and local features are extracted by exploiting the frequency and texture regions to generate a feature pool. This pool of features is provided as an input to the ELM and a 10-fold cross-validation method is employed to evaluate the proposed model. The COV-ELM achieved a macro average of f1-score is 0.95 and the overall sensitivity of the COV-ELM is ${0.94 \pm 0.03}$ at 95% confidence interval. The COV-ELM outperforms other competitive machine learning algorithms in a three-class classification scenario. The results of COV-ELM are quite promising which increases its suitability to be applied to bigger and more diverse datasets.",,,,#971,SheetalRajpal 2020,Included,,BATCH3; QualityFail,,http://arxiv.org/abs/2007.08637v3,2020-08-15
A2005.12855,Towards computer-aided severity assessment: training and validation of deep neural networks for geographic extent and opacity extent scoring of chest X-rays for SARS-CoV-2 lung disease severity,Alexander Wong; Zhong Qiu Lin; Linda Wang; Audrey G. Chung; Beiyi Shen; Almas Abbasi; Mahsa Hoshmand-Kochi; Timothy Q. Duong,arXiv,,,,,27,5,2020,,,,http://arxiv.org/abs/2005.12855v2,"Background: A critical step in effective care and treatment planning for severe acute respiratory syndrome coronavirus 2 (SARS-CoV-2) is the assessment of the severity of disease progression. Chest x-rays (CXRs) are often used to assess SARS-CoV-2 severity, with two important assessment metrics being extent of lung involvement and degree of opacity. In this proof-of-concept study, we assess the feasibility of computer-aided scoring of CXRs of SARS-CoV-2 lung disease severity using a deep learning system. Materials and Methods: Data consisted of 130 CXRs from SARS-CoV-2 positive patient cases from the Cohen study. Geographic extent and opacity extent were scored by two board-certified expert chest radiologists (with 20+ years of experience) and a 2nd-year radiology resident. The deep neural networks used in this study are based on a COVID-Net network architecture. 100 versions of the network were independently learned (50 to perform geographic extent scoring and 50 to perform opacity extent scoring) using random subsets of CXRs from the Cohen study, and evaluated the networks using stratified Monte Carlo cross-validation experiments. Findings: The deep neural networks yielded R$^2$ of 0.673 $\pm$ 0.004 and 0.636 $\pm$ 0.002 between predicted scores and radiologist scores for geographic extent and opacity extent, respectively, in stratified Monte Carlo cross-validation experiments. The best performing networks achieved R$^2$ of 0.865 and 0.746 between predicted scores and radiologist scores for geographic extent and opacity extent, respectively. Interpretation: The results are promising and suggest that the use of deep neural networks on CXRs could be an effective tool for computer-aided assessment of SARS-CoV-2 lung disease severity, although additional studies are needed before adoption for routine clinical use.",,,,#944,AlexanderWong 2020,Included,,BATCH3,,http://arxiv.org/abs/2005.12855v3,2020-08-22
