Fraction Genome Altered,Invasive Carcinoma Diagnosis Age,Metastatic Recurrence Time,Mutation Count,Oncotree Code_ACBC,Oncotree Code_BRCA,Oncotree Code_BRCANOS,Oncotree Code_BREAST,Oncotree Code_IDC,Oncotree Code_ILC,Oncotree Code_IMMC,Oncotree Code_MBC,Oncotree Code_MDLC,Overall Patient Receptor Status_HR+/HER2+,Overall Patient Receptor Status_HR+/HER2-,Overall Patient Receptor Status_HR-/HER2+,Overall Patient Receptor Status_Triple Negative,ER Status of the Primary,Metastatic Disease at Last Follow-up,M Stage,N Stage,Overall Patient HER2 Status,Overall Patient HR Status,Overall Primary Tumor Grade,PR Status of the Primary,Stage At Diagnosis,T Stage,Overall Survival Status
,37,519,7,0,0,0,0,1,0,0,0,0,0,1,0,0,1,1,0,1,0,1,3,1,2,1,1
0.5093,38,459,5,0,0,0,0,0,0,0,0,1,0,1,0,0,1,1,1,0,0,1,2,1,8,0,1
0.4139,49,773,12,0,0,0,0,1,0,0,0,0,0,1,0,0,0,1,0,0,0,1,3,1,1,1,1
0.2815,60,858,2,0,0,0,0,1,0,0,0,0,1,0,0,0,1,1,0,2,1,1,2,0,5,2,0
0.4533,41,546,6,0,0,0,0,1,0,0,0,0,0,1,0,0,1,1,0,1,0,1,1,1,5,3,0
0.2236,53,739,4,0,0,0,0,1,0,0,0,0,0,1,0,0,1,1,0,0,0,1,3,1,1,1,1
0.1612,50,691,5,0,0,0,0,0,1,0,0,0,0,1,0,0,1,1,0,0,0,1,,1,1,1,0
0.4178,52,633,4,0,0,0,0,1,0,0,0,0,0,1,0,0,1,1,0,3,0,1,3,1,7,1,1
0.0264,46,575,4,0,0,0,0,1,0,0,0,0,0,1,0,0,1,1,0,0,0,1,2,1,3,2,0
0.4822,42,632,6,0,0,0,0,1,0,0,0,0,0,1,0,0,1,1,0,0,0,1,2,1,1,1,0
0.5082,41,511,5,0,0,0,0,1,0,0,0,0,0,1,0,0,1,1,0,0,0,1,2,1,3,2,1
0.1651,62,798,2,0,0,0,0,0,0,1,0,0,0,1,0,0,1,1,0,1,0,1,3,0,3,1,1
0.15,60,836,4,0,0,0,0,0,1,0,0,0,0,1,0,0,1,1,0,3,0,1,2,1,7,2,1
0.2526,37,540,2,0,0,0,0,1,0,0,0,0,0,1,0,0,1,1,0,1,0,1,3,1,3,1,0
0.1537,48,577,4,0,0,0,0,1,0,0,0,0,0,1,0,0,1,1,1,0,0,1,3,1,8,0,1
0.4742,63,757,4,0,0,0,0,1,0,0,0,0,0,1,0,0,1,1,0,0,0,1,3,1,3,2,1
0.3394,49,616,3,0,0,0,0,0,1,0,0,0,0,1,0,0,1,1,0,2,0,1,3,1,5,2,1
0.5655,66,879,8,0,0,0,0,1,0,0,0,0,0,1,0,0,1,1,0,0,0,1,3,1,3,2,0
0.055,47,726,7,0,0,0,0,0,1,0,0,0,0,1,0,0,1,1,0,0,0,1,,1,3,2,0
0.1954,46,603,3,0,0,0,0,1,0,0,0,0,0,1,0,0,1,1,0,1,0,1,2,0,3,1,1
0.2365,54,718,4,0,0,0,0,1,0,0,0,0,0,1,0,0,1,1,0,1,0,1,2,1,2,1,1
0.192,51,612,4,0,0,0,0,1,0,0,0,0,0,1,0,0,1,1,1,0,0,1,2,1,8,0,1
0.0719,67,800,3,0,0,0,0,0,0,0,0,1,0,1,0,0,1,1,1,0,0,1,,1,8,4,0
0.5508,38,488,,0,0,0,0,1,0,0,0,0,0,1,0,0,1,1,0,2,0,1,3,1,5,1,0
0.4862,52,649,4,0,0,0,0,1,0,0,0,0,0,1,0,0,1,1,0,1,0,1,3,1,4,2,1
0.184,55,663,5,0,0,0,0,0,1,0,0,0,0,1,0,0,1,1,1,0,0,1,,1,8,0,0
0.1454,53,637,1,0,0,0,0,0,1,0,0,0,0,1,0,0,,1,1,0,0,1,,,8,0,0
0.5799,58,700,1,0,0,0,0,1,0,0,0,0,0,1,0,0,1,1,1,0,0,1,3,0,8,4,1
0.2247,36,452,8,0,0,0,0,1,0,0,0,0,0,1,0,0,1,1,0,1,0,1,3,1,3,1,1
0.2471,40,496,2,0,0,0,0,1,0,0,0,0,1,0,0,0,1,1,0,3,1,1,3,1,7,4,0
0.4257,61,745,3,0,0,0,0,1,0,0,0,0,0,1,0,0,1,1,0,1,0,1,3,1,3,1,1
0.331,44,537,2,0,0,0,0,1,0,0,0,0,0,0,0,1,0,1,0,2,0,0,3,0,5,2,1
0.6384,60,723,6,0,0,0,0,1,0,0,0,0,0,0,0,1,0,1,0,2,0,0,3,0,6,4,0
0.5381,52,628,4,0,0,0,0,1,0,0,0,0,0,1,0,0,1,1,0,3,0,1,3,1,7,3,1
0.5273,55,722,2,0,0,0,0,0,1,0,0,0,1,0,0,0,1,1,0,2,1,1,3,1,5,2,0
0.4073,53,704,11,0,0,0,0,0,0,0,0,1,0,1,0,0,1,1,0,1,0,1,3,0,4,2,0
0.0186,34,438,3,0,0,0,0,1,0,0,0,0,0,1,0,0,1,1,0,2,0,1,3,1,5,2,1
0.6402,69,875,6,0,0,0,0,1,0,0,0,0,0,1,0,0,1,1,0,2,0,1,3,0,5,2,1
0.4617,47,598,6,0,0,0,0,0,1,0,0,0,0,1,0,0,1,1,0,1,0,1,2,1,4,2,1
0.3414,53,632,1,0,0,0,0,0,0,0,0,1,0,1,0,0,1,1,1,0,0,1,3,1,8,0,1
0.2706,54,716,3,0,0,0,0,1,0,0,0,0,0,1,0,0,1,1,0,1,0,1,3,,3,1,0
,47,563,3,0,0,0,0,0,0,0,0,1,0,1,0,0,1,1,1,0,0,1,,1,8,0,0
0.187,67,803,2,0,0,0,0,1,0,0,0,0,0,1,0,0,1,1,1,0,0,1,2,1,8,0,1
0.5728,34,424,3,0,0,0,0,1,0,0,0,0,0,0,0,1,0,1,0,1,0,0,3,0,4,2,1
0.1545,47,572,4,0,0,0,0,1,0,0,0,0,0,1,0,0,1,1,1,3,0,1,3,1,8,2,0
0.0564,40,480,4,0,0,0,0,1,0,0,0,0,0,1,0,0,1,1,1,1,0,1,2,1,8,0,0
0.4235,54,652,5,0,0,0,0,1,0,0,0,0,0,1,0,0,1,1,1,0,0,1,3,1,8,0,1
0.4822,38,462,1,0,0,0,0,1,0,0,0,0,0,1,0,0,1,1,1,0,0,1,3,1,8,0,1
0.1625,56,677,4,0,0,0,0,1,0,0,0,0,0,1,0,0,1,1,1,0,0,1,3,1,8,4,1
0.9194,50,680,3,0,0,0,0,1,0,0,0,0,1,0,0,0,1,1,0,1,1,1,1,1,4,2,0
0.3903,43,543,10,0,0,0,0,1,0,0,0,0,0,1,0,0,1,1,0,1,0,1,3,1,5,3,1
0.4999,48,583,3,0,0,0,0,0,1,0,0,0,0,1,0,0,1,1,1,3,0,1,,1,8,3,0
0.2889,33,412,4,0,0,0,0,1,0,0,0,0,0,1,0,0,1,1,0,1,0,1,3,1,4,2,1
0.3867,50,680,4,0,0,0,0,1,0,0,0,0,0,1,0,0,1,1,0,0,0,1,3,1,3,2,1
0.3841,47,725,,0,0,0,0,1,0,0,0,0,0,1,0,0,1,1,0,3,0,1,3,1,7,4,0
0.1819,56,669,5,0,0,0,0,0,0,0,0,1,0,1,0,0,1,1,1,0,0,1,2,1,8,0,1
0.3721,33,397,7,0,0,0,0,1,0,0,0,0,1,0,0,0,1,1,1,0,1,1,3,1,8,0,0
0.4169,31,396,3,0,0,0,0,1,0,0,0,0,0,1,0,0,1,1,0,3,0,1,3,1,7,2,1
0.2375,50,604,3,0,0,1,0,0,0,0,0,0,1,0,0,0,,1,1,0,1,1,,,8,0,1
0.4899,42,573,3,0,0,0,0,1,0,0,0,0,0,1,0,0,1,1,0,1,0,1,3,1,3,1,0
0.5783,59,717,2,0,0,0,0,0,0,0,1,0,0,0,0,1,0,1,0,0,0,0,3,0,4,3,1
0.2522,36,453,1,0,0,0,0,1,0,0,0,0,0,1,0,0,1,1,0,3,0,1,3,1,7,2,0
0.2052,40,487,4,0,0,0,0,1,0,0,0,0,0,1,0,0,1,1,1,3,0,1,3,1,8,3,0
0.1491,54,679,1,0,0,0,0,1,0,0,0,0,0,0,0,1,0,1,0,1,0,0,3,0,6,4,1
0.3223,55,720,1,0,0,0,0,1,0,0,0,0,0,1,0,0,1,1,0,3,0,1,3,1,7,2,1
0.5314,56,672,3,0,0,1,0,0,0,0,0,0,1,0,0,0,,1,1,0,1,1,,,8,0,0
0.19,71,876,2,0,0,0,0,0,1,0,0,0,0,1,0,0,1,1,0,2,0,1,3,0,5,3,1
0.2573,57,820,2,0,0,0,0,1,0,0,0,0,0,1,0,0,1,1,0,1,0,1,3,1,4,2,0
0.3067,50,635,5,0,0,0,0,1,0,0,0,0,0,1,0,0,1,1,0,0,0,1,3,1,3,2,0
0.5807,46,804,5,0,0,0,0,0,1,0,0,0,0,1,0,0,1,1,0,1,0,1,,1,4,2,0
0.3569,36,451,1,0,0,0,0,1,0,0,0,0,0,1,0,0,1,1,0,0,0,1,3,1,3,2,0
0.2726,74,890,6,0,0,0,0,1,0,0,0,0,0,1,0,0,1,1,1,0,0,1,2,1,8,1,0
0.3409,47,682,5,0,0,1,0,0,0,0,0,0,0,1,0,0,1,1,0,1,0,1,,1,3,1,1
0.432,47,698,5,0,0,0,0,1,0,0,0,0,0,1,0,0,1,1,0,0,0,1,2,1,1,1,1
0.4688,54,659,4,0,0,0,0,1,0,0,0,0,0,1,0,0,1,1,0,0,0,1,3,1,6,4,1
0.5476,46,555,2,0,0,0,0,1,0,0,0,0,0,1,0,0,1,1,0,0,0,1,3,1,,,1
0.1486,43,520,4,0,0,0,0,1,0,0,0,0,0,1,0,0,1,1,1,0,0,1,2,1,8,0,0
0.3738,48,615,2,0,0,0,0,0,1,0,0,0,0,0,1,0,0,1,0,0,1,0,,0,6,4,0
0.5372,48,575,3,0,0,0,0,1,0,0,0,0,0,1,0,0,1,1,1,1,0,1,3,1,8,4,0
0.2592,44,548,2,0,0,0,0,1,0,0,0,0,0,1,0,0,1,1,0,3,0,1,3,0,7,3,0
0.0067,45,565,1,0,0,0,0,1,0,0,0,0,1,0,0,0,1,1,0,0,1,1,,1,1,1,1
0.3445,72,908,,0,0,0,0,1,0,0,0,0,0,1,0,0,1,1,0,1,0,1,3,1,4,2,0
0.4593,57,687,2,0,0,0,0,1,0,0,0,0,0,0,0,1,0,1,0,3,0,0,3,0,7,2,1
0.4466,54,659,5,0,0,0,0,1,0,0,0,0,0,0,0,1,0,1,0,3,0,0,3,0,7,4,1
0.1932,40,486,3,0,0,0,0,1,0,0,0,0,1,0,0,0,1,1,0,3,1,1,3,1,7,2,0
0.4767,63,757,3,0,0,0,0,1,0,0,0,0,0,1,0,0,1,1,1,0,0,1,2,1,8,4,1
0.2292,56,679,3,0,0,0,0,0,1,0,0,0,0,1,0,0,1,1,1,1,0,1,3,1,8,2,1
0.2939,39,474,4,0,0,0,0,0,0,0,1,0,0,0,0,1,0,1,0,1,0,0,3,0,4,2,1
0.1852,53,639,,0,0,0,0,1,0,0,0,0,0,1,0,0,1,1,1,2,0,1,3,1,8,2,0
0.31,44,534,11,0,0,0,0,1,0,0,0,0,1,0,0,0,1,1,1,0,1,1,3,0,8,0,0
0.3148,67,808,3,0,0,0,0,1,0,0,0,0,0,1,0,0,1,1,0,3,0,1,3,1,7,2,0
0.4736,59,740,4,0,0,0,0,1,0,0,0,0,0,1,0,0,1,1,0,1,0,1,3,1,6,4,0
0.4412,53,779,3,0,0,0,0,1,0,0,0,0,1,0,0,0,1,1,0,1,1,1,3,0,3,1,0
0.2904,57,688,2,0,0,0,0,1,0,0,0,0,0,1,0,0,1,1,1,3,0,1,3,1,8,2,1
,79,950,15,0,0,0,0,0,1,0,0,0,0,1,0,0,,1,1,0,0,1,,,8,0,1
0.4304,40,511,3,0,0,0,0,1,0,0,0,0,0,1,0,0,1,1,0,1,0,1,3,1,3,1,1
0.2484,55,663,3,0,0,0,0,1,0,0,0,0,0,1,0,0,1,1,1,0,0,1,2,1,8,0,0
0.3331,70,,3,0,0,0,0,1,0,0,0,0,0,1,0,0,1,0,0,0,0,1,2,1,3,2,1
0.3379,51,645,2,0,0,0,0,1,0,0,0,0,1,0,0,0,1,1,0,3,1,1,3,0,7,4,0
0.0652,39,550,3,0,0,0,0,1,0,0,0,0,0,1,0,0,1,1,0,1,0,1,3,1,3,1,0
0.655,50,769,2,0,0,0,0,1,0,0,0,0,1,0,0,0,1,1,0,0,1,1,,1,1,1,0
0.0466,58,706,1,0,0,0,0,1,0,0,0,0,0,0,0,1,0,1,0,2,0,0,3,0,5,2,0
0.1858,42,607,1,0,0,0,0,1,0,0,0,0,0,1,0,0,1,1,0,0,0,1,3,1,3,2,0
0.513,37,443,2,0,0,0,0,1,0,0,0,0,1,0,0,0,1,1,1,0,1,1,3,1,8,0,0
0.0,55,708,1,0,0,0,0,0,1,0,0,0,0,1,0,0,1,1,0,3,0,1,1,1,7,2,1
0.257,49,621,2,0,0,0,0,1,0,0,0,0,0,1,0,0,1,1,0,0,0,1,3,1,1,1,1
0.559,61,784,2,0,0,0,0,1,0,0,0,0,0,1,0,0,0,1,0,1,0,1,3,0,5,3,0
0.3835,66,800,3,0,0,0,0,1,0,0,0,0,0,1,0,0,1,1,1,0,0,1,3,1,8,0,0
0.3327,52,655,1,0,0,0,0,1,0,0,0,0,0,1,0,0,1,1,0,1,0,1,2,1,4,2,0
0.3965,43,589,6,0,0,0,0,1,0,0,0,0,0,0,0,1,0,1,0,0,0,0,3,0,1,1,1
0.1674,46,593,3,0,0,0,0,1,0,0,0,0,1,0,0,0,1,1,0,2,1,1,3,1,5,2,0
0.4794,58,785,4,0,0,0,0,0,1,0,0,0,0,1,0,0,1,1,0,1,0,1,1,1,4,2,0
0.4185,44,630,3,0,0,0,0,0,1,0,0,0,0,1,0,0,1,1,0,2,0,1,,1,5,2,0
0.4252,38,549,3,0,0,0,0,1,0,0,0,0,0,1,0,0,1,1,0,1,0,1,3,1,3,1,0
0.3433,67,806,1,0,0,0,0,1,0,0,0,0,0,1,0,0,1,1,1,0,0,1,2,1,8,0,0
0.5462,57,720,5,0,0,0,0,1,0,0,0,0,0,0,0,1,0,1,0,2,0,0,3,0,5,2,0
0.3528,42,509,4,0,0,0,0,0,1,0,0,0,1,0,0,0,1,1,1,0,1,1,,1,8,0,0
0.5138,65,811,3,0,0,0,0,0,1,0,0,0,0,1,0,0,1,1,0,3,0,1,3,1,7,4,0
0.5658,43,545,4,0,0,0,0,0,0,0,1,0,0,0,0,1,0,1,0,1,0,0,3,0,4,2,0
0.1287,57,741,,0,0,0,0,1,0,0,0,0,0,1,0,0,1,1,0,0,0,1,2,0,1,1,0
0.3665,54,720,4,0,0,0,0,1,0,0,0,0,1,0,0,0,1,1,0,0,1,1,3,1,1,1,1
0.2714,68,817,,0,0,0,0,1,0,0,0,0,1,0,0,0,1,1,1,0,1,1,2,0,8,0,0
0.1894,37,467,,0,0,0,0,1,0,0,0,0,0,1,0,0,1,1,0,3,0,1,2,1,7,4,0
0.53,34,432,1,0,0,0,0,1,0,0,0,0,1,0,0,0,1,1,0,2,1,1,2,1,5,2,0
0.3635,39,617,7,0,0,0,0,1,0,0,0,0,0,1,0,0,1,1,0,3,0,1,2,1,7,2,0
0.3162,38,513,6,0,0,0,0,1,0,0,0,0,0,1,0,0,1,1,0,1,0,1,3,1,5,3,0
0.6611,68,849,3,0,0,0,0,1,0,0,0,0,0,1,0,0,1,1,0,2,0,1,3,1,5,3,1
0.3313,58,695,1,0,0,0,0,1,0,0,0,0,0,1,0,0,1,1,1,1,0,1,3,1,8,3,1
0.6503,54,647,4,0,0,0,0,1,0,0,0,0,0,1,0,0,1,1,1,0,0,1,3,1,8,0,0
0.3886,44,658,4,0,0,0,0,0,1,0,0,0,0,1,0,0,1,1,0,0,0,1,1,1,1,1,0
0.2121,41,651,,0,0,0,0,1,0,0,0,0,1,0,0,0,1,1,0,3,1,1,3,0,7,3,0
0.1511,50,612,4,0,0,0,0,0,1,0,0,0,0,1,0,0,1,1,0,2,0,1,3,1,6,4,1
0.3898,29,362,2,0,0,0,0,1,0,0,0,0,1,0,0,0,1,1,0,1,1,1,3,0,4,2,0
0.2279,47,587,4,0,0,0,0,0,0,0,1,0,0,0,1,0,0,1,0,0,1,0,3,0,3,2,1
0.1373,58,731,,0,0,0,0,1,0,0,0,0,0,0,0,1,0,1,0,1,0,0,3,0,2,1,1
0.3124,32,399,4,0,0,0,0,1,0,0,0,0,0,1,0,0,1,1,0,3,0,1,3,0,7,2,0
0.5631,56,677,3,0,0,0,0,1,0,0,0,0,0,1,0,0,1,1,1,0,0,1,2,1,8,0,0
0.3546,56,832,4,0,0,0,0,1,0,0,0,0,0,1,0,0,0,1,0,0,0,1,2,0,1,1,0
0.128,55,696,2,0,0,0,0,0,0,0,0,1,0,1,0,0,,1,0,0,0,1,2,,3,2,0
0.5241,54,,3,0,1,0,0,0,0,0,0,0,0,0,0,1,0,0,0,0,0,0,3,0,3,2,1
0.2272,53,710,39,0,0,0,0,0,1,0,0,0,0,1,0,0,1,1,0,1,0,1,,1,5,3,1
0.0507,40,726,5,0,0,0,0,1,0,0,0,0,0,1,0,0,1,1,0,1,0,1,2,1,3,1,0
0.9131,46,619,1,0,0,0,0,1,0,0,0,0,0,1,0,0,1,1,0,0,0,1,2,1,3,2,0
0.411,63,782,3,0,0,0,0,0,1,0,0,0,0,1,0,0,1,1,0,3,0,1,1,1,7,1,0
0.3148,48,576,7,0,0,0,0,1,0,0,0,0,0,1,0,0,1,1,1,0,0,1,3,1,8,0,0
0.3411,60,769,5,0,0,0,0,1,0,0,0,0,1,0,0,0,0,1,0,2,1,1,3,0,5,1,0
0.7518,59,714,4,0,0,0,0,1,0,0,0,0,0,0,0,1,0,1,1,2,0,0,3,0,8,2,1
0.4335,62,807,3,0,0,0,0,1,0,0,0,0,1,0,0,0,1,1,0,0,1,1,2,1,3,2,0
0.3734,66,882,6,0,0,0,0,0,1,0,0,0,0,1,0,0,1,1,0,0,0,1,,0,1,1,1
,70,927,2,0,0,0,0,1,0,0,0,0,0,1,0,0,1,1,0,0,0,1,2,1,1,1,1
0.7802,44,644,4,0,0,0,0,1,0,0,0,0,0,1,0,0,1,1,0,2,0,1,3,1,5,3,0
,58,720,5,0,0,0,0,1,0,0,0,0,0,1,0,0,1,1,0,2,0,1,3,1,5,3,0
,42,567,3,0,0,0,0,1,0,0,0,0,0,1,0,0,1,1,0,1,0,1,2,1,4,2,1
0.1287,76,935,4,0,0,0,0,0,1,0,0,0,0,1,0,0,1,1,0,1,0,1,3,1,4,2,0
0.3049,60,861,3,0,0,0,0,1,0,0,0,0,0,1,0,0,1,1,0,1,0,1,,,,,0
0.7231,56,678,7,0,0,0,0,1,0,0,0,0,0,0,0,1,0,1,0,1,0,0,3,0,6,4,1
0.1947,52,655,10,0,0,0,0,0,1,0,0,0,0,1,0,0,1,1,0,1,0,1,3,1,5,3,0
0.4381,44,537,3,0,0,0,0,0,0,0,0,1,0,1,0,0,1,1,1,3,0,1,3,1,8,3,1
0.8165,61,801,10,0,0,0,0,1,0,0,0,0,0,0,1,0,0,1,0,0,1,0,3,0,1,1,1
0.692,43,543,3,0,0,0,0,1,0,0,0,0,1,0,0,0,1,1,0,0,1,1,,1,3,2,0
0.5036,52,625,7,0,0,0,0,0,1,0,0,0,1,0,0,0,1,1,1,1,1,1,1,1,8,4,0
0.2917,46,595,3,0,0,0,0,1,0,0,0,0,1,0,0,0,1,1,0,0,1,1,3,0,1,1,0
0.5691,33,418,3,0,0,0,0,0,0,0,0,1,1,0,0,0,1,1,0,0,1,1,3,1,3,2,1
0.3727,46,685,5,0,0,0,0,1,0,0,0,0,0,1,0,0,1,1,0,0,0,1,,1,1,1,0
0.455,48,714,12,0,0,0,0,1,0,0,0,0,0,1,0,0,1,1,0,1,0,1,3,1,3,1,1
0.1818,59,770,3,0,0,0,0,1,0,0,0,0,1,0,0,0,1,1,0,1,1,1,2,0,4,2,0
0.0634,71,854,7,0,0,0,0,0,0,0,0,1,0,1,0,0,1,1,0,0,0,1,1,1,1,1,1
0.3876,46,664,4,0,0,0,0,0,1,0,0,0,0,1,0,0,1,1,0,0,0,1,,1,1,1,1
0.8423,56,717,7,0,0,0,0,1,0,0,0,0,0,0,0,1,0,1,0,0,0,0,3,0,1,1,1
0.1495,52,674,4,0,0,0,0,1,0,0,0,0,0,1,0,0,1,1,0,0,0,1,3,1,1,1,0
0.2381,56,677,,0,0,0,0,1,0,0,0,0,1,0,0,0,1,1,1,3,1,1,3,1,8,2,0
0.3845,41,524,5,0,0,0,0,0,1,0,0,0,0,1,0,0,1,1,0,2,0,1,,1,5,3,1
0.2926,56,707,1,0,0,0,0,1,0,0,0,0,0,1,0,0,1,1,0,2,0,1,3,1,5,3,1
0.8288,48,604,5,0,0,0,1,0,0,0,0,0,0,0,0,1,0,1,0,0,0,0,3,0,3,2,0
0.0,32,438,,0,0,0,0,1,0,0,0,0,0,1,0,0,1,1,0,1,0,1,3,1,4,2,1
0.233,72,1003,21,0,0,0,0,0,1,0,0,0,0,1,0,0,1,1,0,0,0,1,,0,1,1,0
0.0501,51,804,5,0,0,0,0,0,1,0,0,0,0,1,0,0,1,1,0,2,0,1,3,1,5,1,0
0.3226,42,501,6,0,0,0,0,0,1,0,0,0,0,1,0,0,1,1,1,1,0,1,2,1,8,2,1
0.3661,33,397,2,0,0,0,0,1,0,0,0,0,0,1,0,0,1,1,1,1,0,1,3,1,8,0,0
0.4352,25,346,3,0,0,0,0,1,0,0,0,0,0,1,0,0,1,1,0,1,0,1,3,1,3,1,0
0.3583,40,479,1,0,0,0,0,1,0,0,0,0,1,0,0,0,,1,1,0,1,1,3,,8,0,1
0.3304,53,778,2,0,0,0,0,1,0,0,0,0,0,1,0,0,1,1,0,0,0,1,,0,1,1,1
0.313,73,923,2,0,0,0,0,0,1,0,0,0,0,1,0,0,1,1,0,3,0,1,1,0,7,2,0
0.172,51,750,1,0,0,0,0,1,0,0,0,0,0,1,0,0,1,1,0,2,0,1,3,0,5,2,0
0.5272,48,609,6,0,0,0,0,1,0,0,0,0,0,1,0,0,1,1,0,0,0,1,3,1,1,1,1
0.6394,57,698,7,0,0,0,0,1,0,0,0,0,0,0,1,0,0,1,0,3,1,0,2,0,7,4,0
0.472,55,900,32,0,0,0,0,1,0,0,0,0,1,0,0,0,1,1,0,1,1,1,2,1,4,2,0
0.2691,49,688,9,0,0,0,0,1,0,0,0,0,0,1,0,0,1,1,0,1,0,1,3,0,4,2,1
0.1096,59,712,,0,0,0,0,1,0,0,0,0,0,1,0,0,1,1,1,0,0,1,3,1,8,0,0
0.1058,45,543,2,0,0,0,0,1,0,0,0,0,0,1,0,0,1,1,1,0,0,1,3,1,8,1,0
0.4009,49,630,2,0,0,0,0,1,0,0,0,0,0,1,0,0,1,1,0,1,0,1,3,1,4,2,1
0.2031,38,533,2,0,0,0,0,1,0,0,0,0,0,1,0,0,1,1,0,1,0,1,2,1,2,1,0
0.7186,46,608,3,0,0,0,0,0,0,0,0,1,1,0,0,0,1,1,0,1,1,1,3,1,4,2,0
0.5898,43,574,2,0,0,0,0,1,0,0,0,0,0,1,0,0,1,1,0,1,0,1,3,1,2,1,0
0.3185,51,724,3,0,0,0,0,1,0,0,0,0,0,1,0,0,1,1,0,0,0,1,3,1,1,1,1
0.3971,54,666,2,0,0,0,0,1,0,0,0,0,0,1,0,0,1,1,0,3,0,1,3,1,7,2,1
0.5231,62,746,30,0,0,0,0,1,0,0,0,0,0,1,0,0,1,1,0,0,0,1,1,1,1,1,0
0.2909,31,389,,0,0,0,0,1,0,0,0,0,0,1,0,0,1,1,0,1,0,1,3,1,4,2,0
0.3826,51,618,6,0,0,1,0,0,0,0,0,0,0,0,0,1,,1,1,0,0,0,,,8,0,0
0.5196,37,504,7,0,0,0,0,0,1,0,0,0,0,1,0,0,1,1,0,0,0,1,3,1,1,1,1
0.6304,44,558,8,0,0,0,0,1,0,0,0,0,0,1,0,0,1,1,0,2,0,1,3,1,5,1,0
0.1676,57,755,3,0,0,0,0,1,0,0,0,0,0,1,0,0,1,1,0,1,0,1,3,1,3,1,1
0.1239,30,408,4,0,0,0,0,1,0,0,0,0,0,1,0,0,0,1,0,2,0,1,,1,5,1,1
0.1131,38,458,2,0,0,0,0,1,0,0,0,0,0,1,0,0,1,1,1,0,0,1,3,1,8,0,0
0.4424,41,546,4,0,0,0,0,1,0,0,0,0,0,0,0,1,0,1,0,0,0,0,3,0,1,1,1
0.3937,27,322,8,0,0,0,0,1,0,0,0,0,0,1,0,0,1,1,1,0,0,1,3,1,8,0,1
0.3175,43,539,2,0,0,0,0,0,1,0,0,0,0,1,0,0,1,1,0,3,0,1,3,0,7,1,1
0.3702,69,833,7,0,0,0,0,1,0,0,0,0,0,1,0,0,1,1,1,0,0,1,2,1,8,0,0
0.4815,37,482,2,0,0,0,0,1,0,0,0,0,0,0,1,0,0,1,0,1,1,0,,0,2,1,0
0.7996,53,658,2,0,0,0,0,1,0,0,0,0,0,1,0,0,1,1,0,1,0,1,3,1,4,2,1
0.1833,50,707,15,0,0,0,0,1,0,0,0,0,0,1,0,0,1,1,0,0,0,1,2,1,3,2,0
0.3386,46,573,10,0,0,0,0,0,1,0,0,0,0,1,0,0,1,1,0,3,0,1,2,1,7,3,0
0.478,60,726,7,0,0,0,0,1,0,0,0,0,0,0,0,1,0,1,1,2,0,0,3,0,8,3,0
0.0,60,819,3,0,0,1,0,0,0,0,0,0,0,1,0,0,0,1,0,0,0,1,3,0,1,1,0
0.3336,45,576,3,0,0,0,0,0,0,0,0,1,0,1,0,0,1,1,0,3,0,1,3,1,7,2,1
0.3265,40,629,4,0,0,0,0,1,0,0,0,0,0,1,0,0,1,1,0,1,0,1,3,1,3,1,0
0.2815,35,444,1,0,0,0,0,1,0,0,0,0,0,1,0,0,1,1,0,1,0,1,3,1,3,1,1
0.3015,53,631,4,0,0,0,0,1,0,0,0,0,0,1,0,0,1,1,1,3,0,1,,1,8,0,0
0.2563,65,798,,0,0,0,0,0,1,0,0,0,0,1,0,0,1,1,0,0,0,1,,1,6,4,0
0.2478,56,670,5,0,0,0,0,1,0,0,0,0,0,1,0,0,1,1,1,0,0,1,3,1,8,0,0
0.1073,54,694,3,0,0,0,0,0,1,0,0,0,0,1,0,0,1,1,0,3,0,1,,1,7,1,1
0.3739,52,646,17,0,0,0,0,1,0,0,0,0,0,0,1,0,0,1,0,2,1,0,3,0,5,2,0
0.4761,47,603,3,0,0,0,0,1,0,0,0,0,0,1,0,0,1,1,0,0,0,1,,1,3,2,0
0.9389,63,773,3,0,0,0,0,1,0,0,0,0,0,1,0,0,1,1,0,1,0,1,3,1,3,1,1
0.0171,50,600,1,0,0,0,0,1,0,0,0,0,1,0,0,0,1,1,1,0,1,1,3,0,8,0,0
0.2449,63,759,2,0,0,0,0,1,0,0,0,0,0,1,0,0,1,1,1,0,0,1,,1,8,0,0
0.3406,42,523,3,0,0,0,0,1,0,0,0,0,0,0,0,1,0,1,0,2,0,0,3,0,5,2,0
0.5907,45,582,3,0,0,0,0,1,0,0,0,0,0,1,0,0,1,1,0,1,0,1,3,1,3,1,0
0.5858,39,464,12,0,0,0,1,0,0,0,0,0,1,0,0,0,,1,1,0,1,1,,,8,0,0
0.5955,47,627,4,0,0,0,0,1,0,0,0,0,0,1,0,0,1,1,0,0,0,1,2,0,3,2,0
0.4188,39,475,4,0,0,0,0,0,1,0,0,0,0,1,0,0,1,1,1,3,0,1,2,1,8,2,0
0.2935,56,780,,0,0,0,0,1,0,0,0,0,0,1,0,0,1,1,0,0,0,1,2,1,1,1,0
0.0001,49,624,2,0,0,0,0,1,0,0,0,0,0,0,1,0,0,1,0,2,1,0,3,0,5,2,0
0.0759,61,825,2,0,0,0,0,1,0,0,0,0,0,1,0,0,1,1,0,1,0,1,3,1,4,2,0
0.6146,49,639,2,0,0,0,0,1,0,0,0,0,0,0,0,1,0,1,0,1,0,0,3,0,4,2,1
0.2079,43,625,2,0,0,0,0,1,0,0,0,0,0,1,0,0,1,1,0,1,0,1,3,1,3,1,0
0.5275,52,622,4,0,0,0,1,0,0,0,0,0,0,0,0,1,0,1,1,0,0,0,3,0,8,4,1
0.1911,68,864,3,0,0,0,0,1,0,0,0,0,0,1,0,0,1,1,0,3,0,1,3,1,7,2,1
0.1555,66,958,,0,0,0,0,1,0,0,0,0,0,1,0,0,1,1,0,0,0,1,2,1,1,1,0
0.0,42,499,2,0,0,0,0,1,0,0,0,0,0,1,0,0,1,1,1,0,0,1,2,1,8,0,0
0.3404,39,468,1,0,0,0,0,1,0,0,0,0,0,1,0,0,1,1,1,2,0,1,3,1,8,1,0
0.1305,49,844,26,0,0,1,0,0,0,0,0,0,0,1,0,0,1,1,0,0,0,1,3,1,,,0
0.4174,55,664,1,0,0,0,0,0,0,0,0,1,0,1,0,0,1,1,1,0,0,1,,1,8,0,0
0.6185,59,745,3,0,0,0,0,1,0,0,0,0,0,1,0,0,1,1,0,0,0,1,3,1,3,2,0
0.2316,48,580,4,0,0,0,0,0,1,0,0,0,0,1,0,0,1,1,1,3,0,1,3,1,8,1,0
0.2985,66,828,4,0,0,0,0,0,1,0,0,0,0,1,0,0,1,1,0,0,0,1,3,1,3,2,0
0.4802,51,806,6,0,0,0,0,1,0,0,0,0,0,1,0,0,1,1,0,2,0,1,3,1,5,2,0
0.4158,58,767,6,0,0,0,0,1,0,0,0,0,0,1,0,0,1,1,0,0,0,1,3,1,1,1,0
0.4823,58,795,2,0,0,0,0,1,0,0,0,0,0,1,0,0,1,1,0,1,0,1,2,1,3,1,1
0.6183,63,758,,0,0,0,0,1,0,0,0,0,0,1,0,0,1,1,1,0,0,1,2,1,8,0,1
0.2795,58,739,6,0,0,0,0,1,0,0,0,0,0,1,0,0,1,1,0,2,0,1,3,1,5,2,0
0.6619,29,350,1,0,0,0,0,0,1,0,0,0,0,1,0,0,1,1,1,0,0,1,,0,8,0,0
0.1557,40,502,4,0,0,0,0,1,0,0,0,0,0,1,0,0,1,1,0,0,0,1,3,1,3,2,1
0.3567,73,871,9,0,0,0,0,1,0,0,0,0,1,0,0,0,1,1,1,0,1,1,3,1,8,0,0
0.3693,58,694,2,0,0,0,0,1,0,0,0,0,0,1,0,0,1,1,1,0,0,1,3,1,8,0,0
0.0706,32,412,3,0,0,0,0,1,0,0,0,0,0,0,0,1,0,1,0,0,0,0,3,0,1,1,0
0.2114,48,574,2,0,0,0,0,1,0,0,0,0,0,0,1,0,0,1,1,0,1,0,3,0,8,4,0
0.025,42,645,,0,0,0,0,1,0,0,0,0,0,1,0,0,1,1,0,2,0,1,3,1,5,1,0
0.4407,42,584,3,0,0,0,0,1,0,0,0,0,0,1,0,0,1,1,0,0,0,1,3,1,1,1,1
0.3872,46,631,2,0,0,0,0,1,0,0,0,0,0,0,1,0,0,1,0,0,1,0,3,0,1,1,0
0.5499,57,737,6,0,0,0,0,1,0,0,0,0,1,0,0,0,1,1,0,0,1,1,3,1,1,1,1
0.4544,62,739,2,0,0,0,0,0,1,0,0,0,0,1,0,0,,1,1,1,0,1,1,,8,4,1
0.0764,64,775,7,0,0,0,0,1,0,0,0,0,0,0,0,1,0,1,1,1,0,0,2,0,8,0,0
0.5149,35,478,6,0,0,0,0,1,0,0,0,0,0,1,0,0,1,1,0,0,0,1,3,1,1,1,1
0.4244,45,580,1,0,0,0,0,1,0,0,0,0,0,0,1,0,0,1,0,1,1,0,3,0,3,1,1
0.2795,50,682,21,0,0,0,0,0,1,0,0,0,0,1,0,0,1,1,0,3,0,1,2,1,7,2,1
0.083,35,457,17,0,0,0,0,1,0,0,0,0,0,1,0,0,1,1,0,2,0,1,3,1,5,3,0
0.4681,52,668,3,0,0,0,0,0,0,0,0,1,1,0,0,0,1,1,0,3,1,1,2,1,7,1,1
0.1198,48,619,7,0,0,0,0,1,0,0,0,0,0,1,0,0,1,1,0,3,0,1,3,1,7,2,1
0.3304,42,509,5,0,0,0,0,1,0,0,0,0,0,1,0,0,1,1,1,0,0,1,3,1,8,0,0
0.1254,50,712,6,0,0,0,0,0,1,0,0,0,0,1,0,0,1,1,0,1,0,1,,1,5,3,0
0.2513,57,816,3,0,0,0,0,1,0,0,0,0,0,1,0,0,1,1,0,0,0,1,2,1,1,1,0
0.5393,55,660,2,0,0,0,0,0,1,0,0,0,1,0,0,0,1,1,1,1,1,1,,0,8,2,0
0.5552,36,440,4,0,0,0,0,1,0,0,0,0,0,0,0,1,0,1,0,0,0,0,3,0,6,4,1
0.0511,64,848,2,0,0,0,0,0,0,0,0,1,0,1,0,0,1,1,0,2,0,1,3,1,5,2,1
0.7026,28,359,1,0,0,0,1,0,0,0,0,0,0,0,0,1,0,1,0,0,0,0,3,0,3,2,0
0.1017,45,642,3,0,0,0,0,1,0,0,0,0,0,1,0,0,1,1,0,1,0,1,,1,3,0,0
0.3752,41,625,3,0,0,0,0,1,0,0,0,0,1,0,0,0,1,1,0,0,1,1,3,1,1,1,0
0.7528,39,483,2,0,0,0,0,1,0,0,0,0,0,1,0,0,1,1,0,0,0,1,3,1,3,2,0
0.7364,77,928,4,0,0,0,0,1,0,0,0,0,0,1,0,0,1,1,1,0,0,1,3,0,8,0,1
0.2469,36,455,25,0,0,0,0,1,0,0,0,0,0,1,0,0,1,1,0,3,0,1,3,1,7,4,1
0.2066,56,689,3,0,0,0,0,1,0,0,0,0,0,1,0,0,1,1,0,2,0,1,3,1,5,1,1
0.2971,39,503,6,0,0,0,0,0,1,0,0,0,0,1,0,0,1,1,0,0,0,1,3,1,3,2,0
0.0668,64,768,20,0,0,0,0,1,0,0,0,0,0,1,0,0,1,1,1,0,0,1,3,1,8,0,1
0.6355,47,571,5,0,0,0,0,1,0,0,0,0,0,1,0,0,1,1,1,0,0,1,3,0,8,0,1
0.096,61,747,2,0,0,0,0,1,0,0,0,0,0,1,0,0,1,1,0,1,0,1,2,1,5,3,0
0.1471,58,800,3,0,0,0,0,0,1,0,0,0,0,1,0,0,1,1,0,1,0,1,,1,3,1,0
0.2401,53,707,4,0,0,0,0,1,0,0,0,0,0,1,0,0,1,1,0,1,0,1,2,1,3,1,1
0.4919,47,581,6,0,0,0,0,1,0,0,0,0,0,0,0,1,0,1,0,0,0,0,3,0,1,1,0
0.6495,38,462,,0,0,0,0,1,0,0,0,0,1,0,0,0,1,1,1,0,1,1,3,1,8,0,0
0.2149,56,758,10,0,0,0,0,1,0,0,0,0,1,0,0,0,1,1,0,0,1,1,3,1,1,1,0
0.2599,38,552,1,0,0,0,0,0,1,0,0,0,0,1,0,0,1,1,0,2,0,1,,1,5,2,0
0.1871,71,848,2,0,0,0,0,1,0,0,0,0,0,1,0,0,1,1,1,0,0,1,2,1,8,0,0
0.2468,54,654,11,0,0,0,0,1,0,0,0,0,0,1,0,0,1,1,1,0,0,1,,1,8,0,0
0.5026,28,394,1,0,0,0,0,1,0,0,0,0,0,1,0,0,1,1,0,1,0,1,3,1,3,1,0
0.1984,42,569,1,0,0,0,0,0,0,0,0,1,0,1,0,0,1,1,0,0,0,1,3,1,1,1,0
0.4458,55,656,5,0,0,0,0,1,0,0,0,0,0,1,0,0,1,1,1,0,0,1,3,1,8,0,0
,35,444,11,0,0,0,0,1,0,0,0,0,0,1,0,0,1,1,0,1,0,1,3,1,5,3,1
0.5144,37,445,3,0,0,0,0,1,0,0,0,0,1,0,0,0,1,1,1,0,1,1,3,1,8,0,0
0.2753,43,558,3,0,0,0,0,1,0,0,0,0,0,1,0,0,1,1,0,1,0,1,3,1,2,1,0
0.5013,54,659,5,0,0,0,0,1,0,0,0,0,0,0,0,1,0,1,0,2,0,0,3,0,5,2,1
0.3974,32,417,2,0,0,0,0,1,0,0,0,0,0,1,0,0,1,1,0,0,0,1,3,1,3,2,0
0.0642,31,388,4,0,0,0,0,1,0,0,0,0,0,1,0,0,1,1,0,1,0,1,3,1,4,2,1
0.3461,42,518,3,0,0,0,0,1,0,0,0,0,1,0,0,0,1,1,0,2,1,1,3,1,6,4,0
0.1551,35,496,5,0,0,0,0,1,0,0,0,0,1,0,0,0,1,1,0,0,1,1,3,1,3,2,0
0.1084,57,687,5,0,0,0,0,0,1,0,0,0,0,1,0,0,1,1,1,0,0,1,,,8,0,0
0.0003,51,647,1,0,0,0,0,1,0,0,0,0,0,0,1,0,0,1,0,2,1,0,3,0,6,4,1
0.3588,34,439,2,0,0,0,0,1,0,0,0,0,0,1,0,0,1,1,0,1,0,1,3,1,4,2,0
0.3801,55,812,44,0,0,0,0,0,1,0,0,0,0,1,0,0,1,1,0,0,0,1,,1,1,1,0
0.0625,53,691,2,0,0,0,0,1,0,0,0,0,1,0,0,0,1,1,0,2,1,1,3,1,5,3,0
0.2092,33,392,3,0,0,0,0,1,0,0,0,0,0,0,1,0,0,1,1,2,1,0,3,0,8,0,1
0.0579,50,655,3,0,0,0,0,0,1,0,0,0,0,1,0,0,1,1,0,1,0,1,3,1,4,2,1
0.107,64,799,10,0,0,0,0,1,0,0,0,0,0,1,0,0,1,1,0,1,0,1,3,0,3,1,0
0.3241,52,803,5,0,0,0,0,1,0,0,0,0,1,0,0,0,1,1,0,2,1,1,3,1,5,2,0
0.2371,41,492,5,0,0,0,0,1,0,0,0,0,0,1,0,0,1,1,1,0,0,1,2,1,8,0,0
0.3062,40,523,3,0,0,0,0,1,0,0,0,0,0,1,0,0,1,1,0,0,0,1,2,1,1,1,1
0.0526,41,533,1,0,0,0,0,1,0,0,0,0,0,0,1,0,0,1,0,1,1,0,3,0,3,1,0
0.3378,58,700,5,0,0,0,0,0,1,0,0,0,0,1,0,0,1,1,1,0,0,1,3,1,8,4,1
0.1082,63,797,2,0,0,0,0,1,0,0,0,0,0,1,0,0,1,1,0,1,0,1,2,1,3,1,1
0.2547,42,750,7,0,0,0,0,1,0,0,0,0,0,1,0,0,1,1,0,0,0,1,1,1,1,1,0
0.7568,30,370,2,0,0,0,0,1,0,0,0,0,0,0,0,1,0,1,0,0,0,0,3,0,1,1,1
0.1131,35,419,2,0,0,0,0,1,0,0,0,0,0,0,1,0,0,1,1,2,1,0,2,0,8,0,0
0.5418,71,885,8,0,0,0,0,1,0,0,0,0,0,1,0,0,1,1,0,0,0,1,3,1,1,1,1
0.5105,35,419,3,0,0,0,0,1,0,0,0,0,0,0,1,0,0,1,1,0,1,0,3,0,8,0,1
0.3328,60,835,10,0,0,0,0,0,1,0,0,0,0,1,0,0,1,1,0,3,0,1,3,0,7,3,0
0.5567,58,713,14,0,0,0,0,1,0,0,0,0,0,0,0,1,0,1,0,1,0,0,3,0,4,2,1
0.0587,64,771,1,0,0,1,0,0,0,0,0,0,0,1,0,0,,1,1,0,0,1,,,8,0,0
0.3508,46,814,2,0,0,1,0,0,0,0,0,0,1,0,0,0,,1,0,,1,1,,,,,1
0.2932,53,645,1,0,0,0,0,1,0,0,0,0,0,0,1,0,0,1,1,1,1,0,3,0,8,2,0
0.0,27,321,1,0,0,1,0,0,0,0,0,0,0,0,0,1,0,1,1,0,0,0,2,0,8,0,0
0.3202,45,573,1,0,0,0,0,1,0,0,0,0,1,0,0,0,1,1,0,1,1,1,3,1,4,2,0
0.4841,53,634,4,0,0,0,0,0,0,0,0,1,0,1,0,0,1,1,1,2,0,1,2,0,8,0,0
0.3999,53,,5,0,0,0,0,1,0,0,0,0,0,1,0,0,1,0,0,0,0,1,3,0,6,4,0
0.2676,42,646,4,0,0,0,0,1,0,0,0,0,0,1,0,0,1,1,0,0,0,1,3,1,1,1,1
0.2245,67,,3,0,0,0,0,1,0,0,0,0,0,1,0,0,1,0,0,1,0,1,1,1,3,1,0
0.0197,26,348,1,0,0,0,0,1,0,0,0,0,0,1,0,0,1,1,0,1,0,1,3,1,4,2,0
0.0467,87,,1,0,0,0,0,1,0,0,0,0,0,0,0,1,0,0,0,0,0,0,3,0,1,1,1
0.5789,64,764,4,0,0,0,0,1,0,0,0,0,0,1,0,0,1,1,1,0,0,1,3,1,8,0,0
0.3838,45,535,7,0,0,0,0,0,1,0,0,0,0,1,0,0,1,1,1,0,0,1,,1,8,0,1
0.6945,66,884,1,0,0,0,0,1,0,0,0,0,0,1,0,0,1,1,0,3,0,1,3,0,7,2,1
0.3168,44,543,9,0,0,0,0,1,0,0,0,0,0,0,1,0,0,1,0,2,1,0,3,0,6,4,0
0.3924,42,522,4,0,0,0,0,1,0,0,0,0,1,0,0,0,1,1,0,1,1,1,3,0,4,2,0
0.2833,53,660,9,0,0,0,0,1,0,0,0,0,0,1,0,0,1,1,0,3,0,1,,0,7,0,1
0.2882,56,691,3,0,0,0,0,1,0,0,0,0,1,0,0,0,1,1,0,0,1,1,3,1,1,1,1
0.5076,43,512,4,0,0,0,0,1,0,0,0,0,0,0,0,1,0,1,1,0,0,0,3,0,8,0,0
0.4543,46,580,3,0,0,0,0,1,0,0,0,0,0,1,0,0,1,1,0,3,0,1,3,1,7,2,0
0.577,40,487,9,0,0,0,0,1,0,0,0,0,0,0,0,1,0,1,0,1,0,0,3,0,4,2,0
0.3644,39,585,4,0,0,0,0,1,0,0,0,0,0,1,0,0,1,1,0,0,0,1,,1,1,1,0
0.0527,62,,2,0,0,0,0,1,0,0,0,0,0,1,0,0,1,0,0,0,0,1,1,1,1,1,0
0.4339,44,675,4,0,0,0,0,1,0,0,0,0,0,1,0,0,0,1,0,1,0,1,3,0,4,2,1
0.472,52,649,10,0,0,0,0,1,0,0,0,0,0,1,0,0,1,1,0,0,0,1,3,1,1,1,0
0.3211,41,505,5,0,0,0,0,1,0,0,0,0,0,1,0,0,1,1,0,0,0,1,2,0,3,2,0
0.3666,57,688,6,0,0,0,0,1,0,0,0,0,1,0,0,0,1,1,1,0,1,1,3,0,8,4,1
0.2566,65,781,1,0,0,0,0,1,0,0,0,0,1,0,0,0,1,1,1,0,1,1,3,1,8,0,0
0.0,67,807,7,0,0,0,0,1,0,0,0,0,0,0,0,1,0,1,1,0,0,0,3,0,8,0,1
0.85,49,593,5,0,0,0,0,1,0,0,0,0,0,0,0,1,0,1,1,0,0,0,3,0,8,0,1
0.5116,73,884,3,0,0,0,0,1,0,0,0,0,0,1,0,0,1,1,1,2,0,1,3,1,8,1,0
0.1671,33,397,4,0,0,0,0,1,0,0,0,0,1,0,0,0,1,1,1,0,1,1,3,1,8,0,0
0.6099,41,653,18,0,0,0,0,0,1,0,0,0,0,1,0,0,,1,0,0,0,1,,,3,2,0
0.6534,54,654,8,0,0,0,0,0,1,0,0,0,0,1,0,0,1,1,0,3,0,1,,1,7,2,0
0.2731,61,729,5,0,0,0,0,1,0,0,0,0,0,1,0,0,1,1,1,0,0,1,3,1,8,0,0
0.1529,71,858,3,0,0,0,0,0,1,0,0,0,0,1,0,0,,1,1,0,0,1,,,8,0,0
0.0185,63,,4,0,0,0,0,1,0,0,0,0,0,1,0,0,1,0,0,0,0,1,3,1,1,1,0
0.4301,59,,4,0,0,0,0,1,0,0,0,0,1,0,0,0,1,0,0,1,1,1,3,1,4,2,0
0.1817,65,,2,0,0,0,0,1,0,0,0,0,0,1,0,0,1,0,0,1,0,1,3,1,5,3,0
0.6057,47,568,9,0,0,0,0,1,0,0,0,0,0,0,0,1,0,1,1,0,0,0,3,0,8,0,0
0.2859,49,638,4,0,0,0,0,1,0,0,0,0,1,0,0,0,1,1,0,0,1,1,2,1,1,1,0
0.568,58,816,5,0,0,0,0,1,0,0,0,0,1,0,0,0,1,1,0,0,1,1,3,1,1,1,0
0.3111,37,482,1,0,0,0,0,1,0,0,0,0,0,1,0,0,1,1,0,1,0,1,3,1,4,2,1
0.28,50,599,14,0,0,0,0,0,1,0,0,0,0,1,0,0,1,1,1,0,0,1,,0,8,0,0
0.6223,41,488,5,0,0,0,0,1,0,0,0,0,0,1,0,0,1,1,1,0,0,1,3,1,8,4,0
0.2571,73,887,,0,0,0,0,1,0,0,0,0,0,1,0,0,1,1,1,3,0,1,3,1,8,1,0
0.6414,37,530,5,0,0,0,0,1,0,0,0,0,1,0,0,0,1,1,0,1,1,1,2,1,3,1,0
0.8935,39,494,7,0,0,0,0,0,1,0,0,0,0,1,0,0,1,1,0,2,0,1,,1,5,3,0
0.1192,63,762,3,0,0,0,0,1,0,0,0,0,0,1,0,0,1,1,1,0,0,1,3,1,8,0,0
0.0196,50,761,4,0,0,0,0,1,0,0,0,0,1,0,0,0,1,1,0,1,1,1,3,1,3,1,0
0.217,55,823,5,0,0,0,0,0,1,0,0,0,0,1,0,0,1,1,0,0,0,1,,0,6,4,0
0.1667,79,,2,0,0,0,0,0,1,0,0,0,0,1,0,0,1,0,0,0,0,1,3,1,3,2,0
0.2226,67,804,11,0,0,0,0,0,1,0,0,0,0,1,0,0,1,1,1,0,0,1,,0,8,0,1
0.2019,51,667,5,0,0,0,0,1,0,0,0,0,0,1,0,0,1,1,0,0,0,1,1,1,1,1,0
0.5854,50,598,2,0,0,0,0,1,0,0,0,0,0,1,0,0,1,1,1,1,0,1,3,0,8,0,1
0.4812,61,813,6,0,0,0,0,1,0,0,0,0,0,1,0,0,1,1,0,1,0,1,3,1,4,2,0
0.358,46,571,3,0,0,0,0,1,0,0,0,0,0,1,0,0,1,1,0,1,0,1,3,0,4,2,0
0.4804,49,583,2,0,0,0,0,0,1,0,0,0,0,1,0,0,1,1,1,0,0,1,2,1,8,1,0
0.3511,46,548,3,0,0,0,0,0,0,0,0,1,0,1,0,0,1,1,1,0,0,1,3,1,8,0,0
0.7312,52,682,7,0,0,0,0,1,0,0,0,0,0,0,1,0,0,1,0,0,1,0,3,0,4,2,0
0.3405,36,527,5,0,0,0,0,0,0,0,0,1,0,1,0,0,1,1,0,1,0,1,2,1,3,1,0
0.3796,42,713,8,0,0,0,0,0,1,0,0,0,0,1,0,0,1,1,0,1,0,1,,0,3,1,0
0.5751,63,779,6,0,0,0,0,1,0,0,0,0,0,0,0,1,0,1,0,2,0,0,3,0,6,4,0
0.2823,31,374,2,0,0,0,0,1,0,0,0,0,1,0,0,0,1,1,1,0,1,1,3,1,8,0,0
0.0008,37,510,3,0,0,0,0,1,0,0,0,0,0,1,0,0,1,1,0,2,0,1,3,1,5,2,0
0.9839,39,533,3,0,0,0,0,0,0,0,0,1,0,1,0,0,1,1,0,0,0,1,3,1,3,2,0
0.3943,65,782,5,0,0,0,0,1,0,0,0,0,0,1,0,0,1,1,1,0,0,1,2,1,8,0,0
0.3757,56,677,2,0,0,0,0,1,0,0,0,0,0,1,0,0,1,1,1,0,0,1,1,1,8,0,0
0.1288,43,513,3,0,0,0,0,1,0,0,0,0,0,1,0,0,1,1,1,1,0,1,2,1,8,0,0
0.8829,67,843,2,0,0,0,0,0,1,0,0,0,0,1,0,0,1,1,0,3,0,1,2,1,7,2,0
0.0,52,672,7,0,0,0,0,0,0,0,0,1,0,1,0,0,1,1,0,0,0,1,3,1,1,1,0
0.129,70,895,4,0,0,0,0,1,0,0,0,0,0,0,1,0,0,1,0,1,1,0,3,0,4,2,0
0.3036,23,297,6,0,0,0,0,1,0,0,0,0,1,0,0,0,1,1,0,1,1,1,3,1,4,2,1
0.4385,57,708,9,0,0,0,0,1,0,0,0,0,0,0,1,0,0,1,0,1,1,0,3,0,6,4,0
0.4578,54,812,3,0,0,0,0,1,0,0,0,0,0,0,0,1,0,1,0,1,0,0,3,0,4,2,1
0.056,54,706,10,0,0,0,0,0,1,0,0,0,0,1,0,0,1,1,0,3,0,1,,1,7,2,0
0.6917,31,384,5,0,0,0,0,1,0,0,0,0,0,0,0,1,0,1,0,0,0,0,3,0,3,2,0
0.4576,56,679,21,0,0,0,0,1,0,0,0,0,0,0,0,1,0,1,1,0,0,0,3,0,8,0,1
0.2984,54,675,8,0,0,0,0,1,0,0,0,0,0,1,0,0,1,1,0,2,0,1,2,0,5,2,1
0.6773,56,807,15,0,0,0,0,0,1,0,0,0,0,1,0,0,1,1,0,2,0,1,2,1,5,2,1
0.5642,54,673,10,0,0,0,0,1,0,0,0,0,0,0,0,1,0,1,0,1,0,0,3,0,4,2,0
0.2242,32,,1,0,0,0,0,1,0,0,0,0,0,1,0,0,1,0,0,0,0,1,3,0,1,1,0
0.3092,53,702,9,0,0,0,0,1,0,0,0,0,0,0,0,1,0,1,0,0,0,0,3,0,1,1,1
0.6249,30,362,1,0,0,1,0,0,0,0,0,0,0,0,1,0,0,1,1,0,1,0,,0,8,0,0
0.7337,40,555,5,0,0,0,0,1,0,0,0,0,0,1,0,0,1,1,0,0,0,1,2,1,1,1,0
0.7263,51,682,1,0,0,0,0,1,0,0,0,0,1,0,0,0,1,1,0,0,1,1,3,0,1,1,0
0.3892,73,875,7,0,0,0,0,0,1,0,0,0,0,1,0,0,1,1,1,0,0,1,,0,8,4,0
0.6625,31,406,2,0,0,0,0,1,0,0,0,0,0,1,0,0,1,1,0,0,0,1,3,1,1,1,0
0.3353,56,736,2,0,0,0,0,0,1,0,0,0,0,1,0,0,1,1,0,3,0,1,,1,7,2,0
0.5762,42,552,7,0,0,0,0,1,0,0,0,0,1,0,0,0,1,1,0,0,1,1,3,1,3,2,0
0.0208,48,578,5,0,0,0,0,1,0,0,0,0,0,1,0,0,1,1,1,1,0,1,3,1,8,2,0
0.2104,56,754,1,0,0,0,0,1,0,0,0,0,0,1,0,0,1,1,0,2,0,1,2,1,5,1,0
0.4428,57,753,14,0,0,0,0,1,0,0,0,0,0,1,0,0,1,1,0,0,0,1,2,0,1,1,0
0.0996,47,581,19,0,0,0,0,1,0,0,0,0,0,1,0,0,1,1,0,1,0,1,2,0,3,1,0
0.622,58,720,5,0,0,0,0,1,0,0,0,0,1,0,0,0,1,1,0,1,1,1,3,0,4,2,1
0.4817,58,717,7,0,0,0,0,1,0,0,0,0,0,0,1,0,0,1,0,0,1,0,3,0,1,1,1
0.1026,50,597,5,0,0,0,0,0,1,0,0,0,0,1,0,0,1,1,1,0,0,1,2,1,8,0,0
0.7942,69,833,4,0,0,0,0,1,0,0,0,0,0,0,1,0,0,1,1,0,1,0,1,0,8,1,1
0.0992,41,546,2,0,0,0,0,0,0,0,1,0,0,1,0,0,1,1,0,0,0,1,,0,1,1,1
0.1142,28,338,2,0,0,1,0,0,0,0,0,0,1,0,0,0,1,1,1,0,1,1,3,0,8,0,0
0.0775,46,681,5,0,0,0,0,1,0,0,0,0,0,1,0,0,1,1,0,0,0,1,3,1,1,1,0
0.512,33,483,2,0,0,0,0,1,0,0,0,0,0,1,0,0,1,1,0,0,0,1,,1,3,2,0
0.6539,56,720,7,0,0,0,0,1,0,0,0,0,0,1,0,0,1,1,0,2,0,1,2,1,6,4,0
0.0,51,612,1,0,0,0,0,1,0,0,0,0,0,0,0,1,0,1,1,0,0,0,3,0,8,0,0
0.4545,63,816,4,0,0,0,0,1,0,0,0,0,0,1,0,0,1,1,0,1,0,1,3,1,4,2,0
0.2389,69,827,3,0,0,0,0,1,0,0,0,0,1,0,0,0,0,1,1,0,1,1,3,0,8,4,0
0.1322,43,540,3,0,0,0,0,1,0,0,0,0,1,0,0,0,1,1,0,2,1,1,3,1,5,3,1
0.5616,68,901,8,0,0,0,0,1,0,0,0,0,0,1,0,0,1,1,0,1,0,1,3,1,4,2,0
0.257,57,744,2,0,0,0,0,1,0,0,0,0,0,0,0,1,0,1,0,1,0,0,2,0,3,1,0
0.0428,41,522,3,0,0,0,0,1,0,0,0,0,0,1,0,0,1,1,0,0,0,1,3,1,3,2,0
0.0512,54,991,5,0,0,1,0,0,0,0,0,0,0,1,0,0,,1,0,,0,1,,,,,0
0.4922,51,611,5,0,0,0,0,1,0,0,0,0,0,1,0,0,1,1,1,0,0,1,2,1,8,4,0
0.2325,77,920,7,0,0,0,0,1,0,0,0,0,0,1,0,0,1,1,1,0,0,1,3,1,8,0,1
0.4597,55,660,8,0,0,0,0,1,0,0,0,0,0,0,1,0,0,1,1,0,1,0,3,0,8,4,1
0.2234,58,737,9,0,0,0,0,0,1,0,0,0,0,1,0,0,1,1,0,0,0,1,,1,3,2,1
0.314,42,674,4,0,0,0,0,1,0,0,0,0,0,1,0,0,1,1,0,0,0,1,1,1,1,1,0
0.1696,50,606,4,0,0,0,0,0,1,0,0,0,0,1,0,0,1,1,1,3,0,1,3,1,8,2,0
0.3122,59,,1,0,0,0,0,1,0,0,0,0,0,1,0,0,1,0,0,1,0,1,3,1,6,4,0
0.3244,44,705,29,0,0,0,0,0,1,0,0,0,0,1,0,0,1,1,0,1,0,1,3,1,3,1,0
0.1432,52,,6,0,0,0,0,0,0,0,0,1,0,1,0,0,1,0,0,2,0,1,3,1,5,3,0
0.2331,51,608,6,0,0,0,0,1,0,0,0,0,0,0,0,1,0,1,1,0,0,0,3,0,8,0,1
0.238,52,623,1,0,0,0,0,1,0,0,0,0,0,1,0,0,1,1,1,0,0,1,2,1,8,0,0
0.316,50,606,6,0,0,0,0,0,0,0,0,1,0,1,0,0,1,1,1,0,0,1,2,1,8,0,0
0.2214,47,783,6,0,0,0,0,0,0,0,0,1,0,1,0,0,1,1,0,1,0,1,3,1,4,2,0
0.5667,55,676,3,0,0,0,0,1,0,0,0,0,0,0,0,1,0,1,0,2,0,0,3,0,5,3,1
0.0114,65,,3,0,0,0,0,0,1,0,0,0,0,1,0,0,1,0,0,0,0,1,3,1,1,1,0
0.521,46,568,2,0,0,0,0,1,0,0,0,0,0,0,0,1,0,1,0,2,0,0,3,0,5,2,1
0.4991,83,1041,5,0,0,0,0,1,0,0,0,0,0,0,1,0,0,1,0,0,1,0,3,0,1,1,1
0.4264,47,609,8,0,0,0,0,1,0,0,0,0,0,1,0,0,1,1,0,1,0,1,3,1,4,2,0
0.5679,57,687,4,0,0,0,0,0,1,0,0,0,0,1,0,0,1,1,1,0,0,1,2,1,8,0,0
0.1137,52,648,3,0,0,0,0,1,0,0,0,0,0,0,0,1,0,1,0,1,0,0,3,0,3,1,0
0.6243,58,739,3,0,0,0,0,0,1,0,0,0,0,1,0,0,1,1,0,1,0,1,3,1,4,2,0
0.1057,68,869,4,0,0,0,0,0,1,0,0,0,0,1,0,0,1,1,0,0,0,1,,0,3,2,0
0.1203,46,,5,0,0,0,0,1,0,0,0,0,0,0,0,1,0,0,0,0,0,0,3,0,1,1,0
0.2515,41,491,3,0,0,0,0,1,0,0,0,0,0,1,0,0,1,1,1,0,0,1,2,1,8,0,0
0.1723,53,641,6,0,0,0,0,1,0,0,0,0,0,1,0,0,1,1,0,0,0,1,3,1,1,1,0
0.5856,59,710,17,0,0,0,0,1,0,0,0,0,0,1,0,0,,1,1,0,0,1,,,8,0,1
0.225,37,452,1,0,0,0,0,1,0,0,0,0,0,1,0,0,1,1,1,0,0,1,3,1,8,0,0
0.1852,60,,3,0,0,0,0,1,0,0,0,0,0,1,0,0,1,0,0,1,0,1,3,1,3,1,0
0.0,50,626,2,0,0,0,0,1,0,0,0,0,0,1,0,0,1,1,0,3,0,1,3,1,7,2,1
0.7723,58,694,6,0,0,0,0,1,0,0,0,0,1,0,0,0,1,1,1,2,1,1,3,1,8,0,0
0.2534,48,697,7,0,0,0,0,1,0,0,0,0,0,1,0,0,1,1,0,0,0,1,2,1,3,2,0
0.4119,56,732,3,0,0,0,0,1,0,0,0,0,0,1,0,0,1,1,0,0,0,1,,1,3,2,0
0.6255,61,729,9,0,0,0,0,1,0,0,0,0,0,1,0,0,1,1,1,0,0,1,2,1,8,4,0
0.1579,71,866,1,0,0,0,0,0,1,0,0,0,0,1,0,0,1,1,0,2,0,1,3,0,5,3,1
0.8638,66,903,3,0,0,0,0,0,1,0,0,0,0,1,0,0,1,1,0,1,0,1,2,0,6,4,0
0.0434,37,477,2,0,0,0,0,1,0,0,0,0,0,1,0,0,1,1,0,0,0,1,3,1,3,2,0
0.0339,53,,1,0,0,0,0,0,1,0,0,0,0,1,0,0,1,0,0,3,0,1,3,1,7,1,0
0.0463,65,,2,0,0,0,0,1,0,0,0,0,0,1,0,0,1,0,0,1,0,1,3,1,3,1,0
0.1332,40,531,4,0,0,0,0,1,0,0,0,0,1,0,0,0,1,1,0,2,1,1,3,1,5,2,0
0.6101,65,819,2,0,0,0,0,0,0,0,0,1,0,1,0,0,1,1,0,3,0,1,3,1,7,3,0
0.8333,39,508,2,0,0,0,0,0,1,0,0,0,0,1,0,0,1,1,0,0,0,1,3,1,1,1,0
0.0251,38,457,4,0,0,0,0,1,0,0,0,0,0,0,0,1,0,1,1,0,0,0,3,0,8,4,1
0.344,64,775,2,0,0,0,0,1,0,0,0,0,0,0,0,1,0,1,1,1,0,0,3,0,8,4,0
0.6282,47,573,6,0,0,0,0,1,0,0,0,0,0,0,0,1,0,1,0,1,0,0,3,0,6,4,0
0.3458,37,444,3,0,0,0,0,1,0,0,0,0,1,0,0,0,1,1,1,0,1,1,2,1,8,0,0
0.3206,41,498,2,0,0,0,0,1,0,0,0,0,0,1,0,0,1,1,1,0,0,1,2,0,8,0,0
0.0727,73,913,9,0,0,0,0,0,1,0,0,0,1,0,0,0,1,1,0,1,1,1,3,1,4,2,0
0.083,77,,11,0,0,0,0,0,1,0,0,0,0,1,0,0,1,0,0,0,0,1,,0,1,1,0
0.2775,56,674,1,0,0,1,0,0,0,0,0,0,1,0,0,0,1,1,1,0,1,1,,1,8,0,0
0.4099,43,578,4,0,0,0,0,1,0,0,0,0,0,1,0,0,1,1,0,0,0,1,3,1,3,2,1
0.7735,47,702,6,0,0,0,0,1,0,0,0,0,0,1,0,0,1,1,0,3,0,1,3,1,7,2,0
0.195,38,483,5,0,0,0,0,1,0,0,0,0,0,1,0,0,1,1,0,1,0,1,2,1,3,1,1
0.4593,49,613,3,0,0,0,0,0,0,0,0,1,0,1,0,0,1,1,0,0,0,1,3,1,1,1,1
0.2699,50,754,6,0,0,0,0,1,0,0,0,0,0,1,0,0,1,1,0,3,0,1,,1,7,2,1
0.41,51,678,14,0,0,0,0,1,0,0,0,0,0,1,0,0,1,1,0,1,0,1,3,1,4,2,0
0.548,45,535,3,0,0,0,0,1,0,0,0,0,0,0,0,1,0,1,1,0,0,0,3,0,8,4,0
0.1982,48,575,3,0,0,0,0,1,0,0,0,0,0,1,0,0,1,1,1,0,0,1,3,1,8,0,0
0.3605,44,534,9,0,0,0,0,1,0,0,0,0,0,1,0,0,1,1,1,1,0,1,,1,8,1,0
0.0049,56,688,1,0,0,0,0,1,0,0,0,0,0,0,1,0,0,1,0,0,1,0,3,0,6,4,0
0.0698,70,,6,0,0,0,0,1,0,0,0,0,0,1,0,0,1,0,0,0,0,1,3,1,1,1,0
0.5275,36,562,1,0,0,0,0,1,0,0,0,0,0,1,0,0,1,1,0,1,0,1,2,1,3,1,0
0.5031,45,620,4,0,0,0,0,1,0,0,0,0,0,1,0,0,1,1,0,2,0,1,,1,5,2,0
0.3305,36,623,3,0,0,0,0,1,0,0,0,0,0,1,0,0,1,1,0,0,0,1,2,1,1,1,0
0.2097,39,488,4,0,0,0,0,1,0,0,0,0,1,0,0,0,1,1,0,1,1,1,2,1,5,3,0
0.5225,48,577,4,0,0,0,0,1,0,0,0,0,0,1,0,0,1,1,1,1,0,1,3,1,8,0,0
0.3251,55,678,3,0,0,0,0,1,0,0,0,0,0,0,0,1,0,1,0,3,0,0,3,0,7,1,1
0.5802,65,854,6,0,0,0,0,0,1,0,0,0,0,1,0,0,1,1,0,2,0,1,3,1,5,3,1
0.109,73,927,9,0,0,0,0,0,1,0,0,0,0,1,0,0,0,1,0,1,0,1,2,0,3,1,0
0.6378,55,698,10,0,0,0,0,1,0,0,0,0,0,1,0,0,1,1,0,0,0,1,3,1,3,2,1
0.1255,65,784,3,0,0,0,0,1,0,0,0,0,0,1,0,0,1,1,0,3,0,1,3,0,7,4,1
0.3398,59,803,3,0,0,0,0,1,0,0,0,0,0,1,0,0,1,1,0,0,0,1,,1,1,1,0
0.5741,34,497,,0,0,0,0,1,0,0,0,0,0,1,0,0,1,1,0,2,0,1,3,1,5,3,0
0.3431,39,504,2,0,0,0,0,1,0,0,0,0,0,1,0,0,1,1,0,1,0,1,3,1,3,1,0
0.0,39,613,,0,0,0,0,1,0,0,0,0,0,1,0,0,1,1,0,3,0,1,3,1,7,2,0
0.6062,55,704,6,0,0,0,0,1,0,0,0,0,0,1,0,0,1,1,0,0,0,1,3,1,1,1,0
0.0454,64,,5,0,0,0,0,1,0,0,0,0,0,1,0,0,1,0,0,0,0,1,1,1,1,1,0
0.197,53,,3,0,0,0,0,1,0,0,0,0,0,0,0,1,0,0,0,0,0,0,3,0,1,1,0
0.6231,61,738,28,0,0,0,0,1,0,0,0,0,0,1,0,0,1,1,1,0,0,1,3,1,8,4,0
0.173,63,,6,0,0,0,0,1,0,0,0,0,0,1,0,0,1,0,0,1,0,1,3,1,5,3,0
0.2104,48,,,0,0,0,0,1,0,0,0,0,0,1,0,0,1,0,0,1,0,1,3,1,4,2,0
0.5655,53,680,5,0,0,0,0,1,0,0,0,0,0,0,0,1,1,1,0,1,0,0,3,0,3,1,0
0.3437,40,479,1,0,0,0,0,0,0,0,0,1,0,1,0,0,1,1,1,0,0,1,3,1,8,0,0
0.6016,59,,2,0,0,0,0,1,0,0,0,0,0,1,0,0,1,0,0,1,0,1,3,0,2,1,0
0.3446,48,607,5,0,0,0,0,1,0,0,0,0,0,1,0,0,1,1,0,2,0,1,2,1,5,3,0
0.585,50,599,1,0,0,0,0,1,0,0,0,0,0,1,0,0,1,1,1,0,0,1,2,1,8,1,0
0.6273,63,759,46,0,0,1,0,0,0,0,0,0,0,1,0,0,1,1,1,0,0,1,,,8,0,1
0.3106,30,363,,0,0,0,0,1,0,0,0,0,0,1,0,0,1,1,1,3,0,1,2,1,8,3,0
0.3008,35,428,1,0,0,0,0,1,0,0,0,0,0,1,0,0,1,1,0,0,0,1,3,1,3,2,1
0.0484,57,682,5,0,0,0,0,0,1,0,0,0,0,1,0,0,1,1,1,0,0,1,2,1,8,0,0
,46,549,4,0,0,0,0,1,0,0,0,0,0,1,0,0,1,1,1,0,0,1,3,1,8,4,1
0.4618,49,647,6,0,0,0,0,1,0,0,0,0,0,1,0,0,1,1,0,0,0,1,3,0,3,2,0
0.2781,62,771,5,0,0,0,0,1,0,0,0,0,0,1,0,0,1,1,0,0,0,1,3,0,3,2,0
0.4266,41,517,1,0,0,0,0,1,0,0,0,0,0,1,0,0,1,1,0,2,0,1,3,0,5,1,1
0.0,47,570,1,0,0,0,0,0,1,0,0,0,0,1,0,0,1,1,1,0,0,1,2,1,8,0,0
0.2476,54,,1,0,0,0,0,1,0,0,0,0,0,1,0,0,1,0,0,1,0,1,3,1,4,2,0
0.73,57,753,4,0,0,0,0,0,1,0,0,0,0,1,0,0,1,1,0,0,0,1,3,1,3,2,0
0.2214,35,555,4,0,0,0,0,1,0,0,0,0,0,1,0,0,1,1,0,1,0,1,2,1,3,1,1
0.1059,51,614,6,0,0,0,0,0,1,0,0,0,0,1,0,0,1,1,1,0,0,1,2,1,8,0,1
0.6246,66,791,6,0,0,0,0,0,0,0,0,1,0,1,0,0,1,1,1,0,0,1,,1,8,4,0
0.2698,53,638,5,0,0,0,0,0,1,0,0,0,0,1,0,0,1,1,1,0,0,1,3,1,8,4,0
0.0645,58,,4,0,0,0,0,1,0,0,0,0,0,1,0,0,1,0,0,0,0,1,2,1,1,1,0
0.1378,54,651,4,0,0,0,0,1,0,0,0,0,0,1,0,0,1,1,1,0,0,1,2,1,8,0,0
0.1853,36,432,3,0,0,0,0,1,0,0,0,0,0,1,0,0,1,1,1,0,0,1,2,1,8,0,0
0.0612,47,,4,0,0,0,0,1,0,0,0,0,0,1,0,0,1,0,0,0,0,1,2,1,1,1,0
0.8922,62,770,4,0,0,0,0,1,0,0,0,0,0,1,0,0,1,1,0,0,0,1,3,1,1,1,1
0.1975,57,715,6,0,0,0,0,1,0,0,0,0,1,0,0,0,1,1,0,0,1,1,3,1,1,1,0
0.3378,63,779,9,0,0,0,0,1,0,0,0,0,0,1,0,0,1,1,0,2,0,1,3,0,6,4,1
0.083,47,568,6,0,0,0,0,0,1,0,0,0,0,1,0,0,1,1,1,0,0,1,2,1,8,0,0
0.1706,60,832,5,0,0,0,0,0,1,0,0,0,0,1,0,0,1,1,0,3,0,1,,1,7,2,0
0.0501,54,653,2,0,0,0,0,1,0,0,0,0,0,1,0,0,1,1,1,0,0,1,3,1,8,0,0
0.2593,62,759,9,0,0,0,0,1,0,0,0,0,0,1,0,0,1,1,0,0,0,1,3,1,1,1,0
0.2882,51,,4,0,0,0,0,0,1,0,0,0,0,1,0,0,1,0,0,0,0,1,2,1,3,2,0
0.2683,60,760,4,0,0,0,0,1,0,0,0,0,0,1,0,0,1,1,0,3,0,1,3,1,7,3,0
0.1202,40,535,4,0,0,0,0,0,1,0,0,0,0,1,0,0,1,1,0,3,0,1,,1,7,3,0
0.3673,64,827,9,0,0,0,0,1,0,0,0,0,0,1,0,0,1,1,0,3,0,1,3,1,7,2,0
0.7006,49,,6,0,0,0,0,1,0,0,0,0,0,1,0,0,0,0,0,0,0,1,3,1,3,2,0
0.0814,32,,5,0,0,0,0,1,0,0,0,0,0,1,0,0,1,0,0,0,0,1,1,1,1,1,0
0.2873,48,641,5,0,0,0,0,1,0,0,0,0,0,1,0,0,1,1,0,3,0,1,3,1,7,1,0
0.1625,64,883,5,0,0,0,0,0,1,0,0,0,0,1,0,0,1,1,0,0,0,1,,0,3,2,0
0.704,35,497,2,0,0,0,0,1,0,0,0,0,0,1,0,0,1,1,0,1,0,1,3,1,2,1,0
0.7723,79,949,3,0,0,0,0,1,0,0,0,0,0,1,0,0,1,1,0,0,0,1,3,1,6,4,0
0.2962,46,,2,0,0,0,0,1,0,0,0,0,0,1,0,0,1,0,0,1,0,1,2,1,4,2,0
0.215,45,539,,0,0,0,0,1,0,0,0,0,0,1,0,0,1,1,1,0,0,1,2,1,8,0,0
1.0,54,770,6,0,0,0,0,1,0,0,0,0,0,1,0,0,1,1,0,0,0,1,3,1,3,2,0
1.0,56,729,4,0,0,0,0,0,1,0,0,0,0,1,0,0,1,1,0,3,0,1,,1,7,2,1
0.6919,49,619,3,0,0,0,0,0,1,0,0,0,0,1,0,0,1,1,0,0,0,1,3,1,3,2,1
0.4787,42,525,,0,0,0,0,1,0,0,0,0,0,1,0,0,1,1,0,1,0,1,3,1,4,2,0
0.0,52,,1,0,0,0,0,0,1,0,0,0,0,1,0,0,1,0,0,0,0,1,1,1,1,1,0
0.1184,41,780,10,0,0,0,0,0,1,0,0,0,0,1,0,0,0,1,0,2,0,1,,1,6,4,0
0.2791,45,692,2,0,0,0,0,1,0,0,0,0,0,1,0,0,1,1,0,2,0,1,2,1,5,1,0
0.6206,37,469,8,0,0,0,0,1,0,0,0,0,0,1,0,0,1,1,0,0,0,1,3,1,6,4,0
0.2854,55,664,3,0,0,0,0,1,0,0,0,0,0,1,0,0,1,1,1,0,0,1,3,1,8,0,0
0.2559,65,819,5,0,0,0,0,1,0,0,0,0,0,1,0,0,1,1,0,0,0,1,3,1,1,1,0
0.0,68,835,4,0,0,0,0,0,0,0,0,1,0,1,0,0,1,1,0,2,0,1,3,1,5,2,0
0.0789,46,,2,0,0,0,0,1,0,0,0,0,0,1,0,0,1,0,0,1,0,1,2,1,3,1,0
0.3387,52,721,1,0,0,0,0,1,0,0,0,0,0,1,0,0,1,1,0,1,0,1,3,1,4,2,0
0.287,62,842,4,0,0,0,0,0,0,0,0,1,0,1,0,0,1,1,0,0,0,1,3,1,1,1,0
0.9158,50,725,5,0,0,0,0,1,0,0,0,0,0,1,0,0,1,1,0,1,0,1,3,1,3,1,0
0.0564,60,718,5,0,0,0,0,1,0,0,0,0,0,1,0,0,1,1,1,0,0,1,3,1,8,0,0
0.0553,79,952,3,0,0,0,0,1,0,0,0,0,0,1,0,0,1,1,1,0,0,1,3,1,8,0,0
0.1137,43,770,18,0,0,0,0,1,0,0,0,0,0,1,0,0,1,1,0,1,0,1,,1,5,3,0
0.4181,59,,1,0,0,0,0,1,0,0,0,0,1,0,0,0,1,0,0,0,1,1,3,1,1,1,0
0.006,51,629,1,0,0,0,0,1,0,0,0,0,0,1,0,0,1,1,0,1,0,1,3,1,4,2,1
0.3546,62,745,30,0,0,0,0,1,0,0,0,0,0,1,0,0,1,1,1,0,0,1,3,1,8,0,0
0.4922,33,451,5,0,0,0,0,1,0,0,0,0,0,1,0,0,1,1,0,2,0,1,3,1,6,4,1
0.1433,42,499,2,0,0,0,0,1,0,0,0,0,0,1,0,0,1,1,1,0,0,1,3,1,8,0,0
0.3043,49,667,6,0,0,0,0,1,0,0,0,0,0,1,0,0,1,1,0,2,0,1,3,1,5,2,0
0.3361,39,541,4,0,0,0,0,0,0,0,0,1,0,1,0,0,1,1,0,1,0,1,,1,5,3,0
0.3817,50,640,5,0,0,0,0,1,0,0,0,0,0,1,0,0,1,1,0,1,0,1,3,1,3,1,0
0.2871,51,699,2,0,0,0,0,1,0,0,0,0,0,1,0,0,1,1,0,1,0,1,2,1,4,2,0
0.1904,44,,2,0,0,0,0,1,0,0,0,0,0,1,0,0,1,0,0,0,0,1,2,1,3,2,0
0.5904,60,734,7,0,0,0,0,1,0,0,0,0,0,1,0,0,0,1,0,2,0,1,3,0,5,1,1
0.0336,56,,3,0,0,0,0,1,0,0,0,0,0,1,0,0,1,0,0,2,0,1,3,1,6,4,0
0.2237,44,,5,0,0,0,0,1,0,0,0,0,1,0,0,0,1,0,0,0,1,1,3,1,1,1,0
0.7286,66,963,2,0,0,0,0,0,1,0,0,0,0,1,0,0,1,1,0,0,0,1,,0,1,1,0
0.0263,66,,5,0,0,0,0,0,1,0,0,0,0,1,0,0,1,0,0,0,0,1,2,1,3,2,0
0.04,49,,1,0,0,0,0,1,0,0,0,0,0,1,0,0,1,0,0,0,0,1,2,1,1,1,0
0.2984,68,,5,0,0,0,0,1,0,0,0,0,0,1,0,0,1,0,0,1,0,1,2,1,3,1,0
0.0069,36,,2,0,0,0,0,1,0,0,0,0,0,1,0,0,1,0,0,0,0,1,3,0,3,2,0
0.5405,45,555,23,0,0,0,0,1,0,0,0,0,0,1,0,0,1,1,0,2,0,1,3,0,5,3,0
0.327,44,542,2,0,0,0,0,1,0,0,0,0,0,1,0,0,1,1,0,1,0,1,3,1,5,3,0
0.3854,55,689,9,0,0,0,0,1,0,0,0,0,0,1,0,0,0,1,0,0,0,1,3,1,3,2,0
0.2495,40,501,3,0,0,0,0,1,0,0,0,0,0,1,0,0,1,1,0,3,0,1,3,1,7,3,0
0.0881,59,758,1,0,0,0,0,1,0,0,0,0,0,1,0,0,1,1,0,2,0,1,3,1,5,3,0
0.0486,88,,1,0,0,0,0,1,0,0,0,0,0,1,0,0,1,0,0,0,0,1,2,1,1,1,0
0.1623,62,751,2,0,0,0,0,1,0,0,0,0,0,1,0,0,1,1,1,0,0,1,2,1,8,0,0
0.9299,53,680,,0,0,0,0,1,0,0,0,0,0,1,0,0,1,1,0,0,0,1,3,0,1,1,0
0.1867,62,,4,0,0,0,0,0,1,0,0,0,0,1,0,0,1,0,0,0,0,1,2,1,1,1,0
0.0,57,,8,0,0,0,0,1,0,0,0,0,0,1,0,0,1,0,0,0,0,1,2,1,1,1,0
0.0591,61,,2,0,0,0,0,1,0,0,0,0,0,1,0,0,1,0,0,0,0,1,2,1,1,1,0
0.5147,52,752,3,0,0,0,0,1,0,0,0,0,0,1,0,0,1,1,0,0,0,1,3,0,1,1,0
0.1625,57,,13,0,0,0,0,1,0,0,0,0,0,1,0,0,1,0,0,0,0,1,3,0,3,2,0
0.2859,45,,2,0,0,0,0,1,0,0,0,0,0,1,0,0,1,0,0,0,0,1,2,1,1,1,0
0.3399,39,622,1,0,0,0,0,1,0,0,0,0,0,1,0,0,1,1,0,1,0,1,3,1,3,1,0
0.0007,27,344,,0,0,0,0,1,0,0,0,0,0,1,0,0,1,1,0,2,0,1,3,1,5,2,0
0.2634,61,,,0,0,0,0,1,0,0,0,0,0,1,0,0,1,0,0,0,0,1,3,1,1,1,0
0.5545,63,761,4,0,0,0,0,0,1,0,0,0,0,1,0,0,1,1,1,0,0,1,3,1,8,4,0
0.1237,57,,3,0,0,0,0,0,1,0,0,0,0,1,0,0,1,0,0,2,0,1,2,1,5,2,0
0.2217,60,,1,0,0,0,0,1,0,0,0,0,0,1,0,0,1,0,0,0,0,1,2,1,1,1,0
0.0,67,,3,0,0,0,0,1,0,0,0,0,0,1,0,0,1,0,0,1,0,1,1,1,2,1,0
0.6918,35,421,4,0,0,0,0,1,0,0,0,0,0,1,0,0,1,1,1,0,0,1,3,0,8,4,0
0.1701,50,658,5,0,0,0,0,1,0,0,0,0,0,1,0,0,1,1,0,3,0,1,1,1,7,2,0
0.6467,77,,5,0,0,0,0,1,0,0,0,0,0,0,0,1,0,0,0,1,0,0,3,0,3,1,0
0.2714,62,,4,0,0,0,0,1,0,0,0,0,0,1,0,0,1,0,0,0,0,1,3,1,1,1,0
0.1101,46,699,3,0,0,0,0,0,1,0,0,0,0,1,0,0,1,1,0,1,0,1,2,1,2,1,0
0.2189,48,,2,0,0,0,0,1,0,0,0,0,1,0,0,0,1,0,0,0,1,1,2,1,3,2,0
0.2949,40,503,10,0,0,0,0,1,0,0,0,0,0,0,0,1,0,1,0,0,0,0,3,0,3,2,1
0.2085,39,528,4,0,0,0,0,1,0,0,0,0,0,1,0,0,1,1,0,0,0,1,3,1,3,2,0
0.6211,48,621,11,0,0,0,0,1,0,0,0,0,1,0,0,0,1,1,0,3,1,1,3,1,7,2,0
0.0625,53,,3,0,0,0,0,1,0,0,0,0,0,1,0,0,1,0,0,0,0,1,1,1,1,1,0
0.0455,61,,5,0,0,0,0,1,0,0,0,0,0,1,0,0,1,0,0,0,0,1,3,1,1,1,0
0.0639,59,,2,0,0,0,0,1,0,0,0,0,0,1,0,0,1,0,0,0,0,1,3,1,1,1,0
0.2819,64,,8,0,0,0,0,1,0,0,0,0,0,1,0,0,1,0,0,0,0,1,3,1,1,1,0
0.1957,70,,4,0,0,0,0,1,0,0,0,0,1,0,0,0,1,0,0,0,1,1,2,1,1,1,0
0.0916,57,712,15,0,0,0,0,1,0,0,0,0,0,1,0,0,1,1,0,2,0,1,2,1,5,1,0
0.3049,79,,3,0,0,0,0,1,0,0,0,0,0,1,0,0,1,0,0,0,0,1,2,0,1,1,0
0.4821,60,,5,0,0,0,0,1,0,0,0,0,0,0,0,1,0,0,0,0,0,0,3,0,1,1,0
0.1116,84,,3,0,0,0,0,1,0,0,0,0,1,0,0,0,1,0,0,0,1,1,3,1,1,1,0
0.1858,76,,5,0,0,0,0,1,0,0,0,0,0,1,0,0,1,0,0,0,0,1,2,0,1,1,0
0.3155,39,,5,0,0,0,0,1,0,0,0,0,0,1,0,0,0,0,0,0,0,1,3,1,1,1,0
0.1785,60,826,4,0,0,0,0,0,1,0,0,0,0,1,0,0,1,1,0,2,0,1,,1,5,2,0
0.5887,61,,3,0,0,0,0,1,0,0,0,0,0,0,0,1,0,0,0,0,0,0,3,0,1,1,0
0.3883,35,482,4,0,0,0,0,1,0,0,0,0,1,0,0,0,1,1,0,2,1,1,3,1,6,4,0
0.0374,32,,,0,0,0,0,1,0,0,0,0,0,1,0,0,1,0,0,0,0,1,3,1,1,1,0
0.1685,72,,1,0,0,0,0,1,0,0,0,0,0,1,0,0,1,0,0,0,0,1,3,1,1,1,0
0.2549,54,,1,0,0,0,0,1,0,0,0,0,0,1,0,0,1,0,0,1,0,1,3,1,2,1,0
0.1685,39,,4,0,0,0,0,1,0,0,0,0,0,1,0,0,1,0,0,1,0,1,3,1,4,2,0
0.1959,56,719,3,0,0,0,0,1,0,0,0,0,0,1,0,0,1,1,0,0,0,1,3,1,3,2,0
0.3508,49,618,3,0,0,0,0,1,0,0,0,0,0,1,0,0,1,1,0,2,0,1,2,1,5,2,0
0.2583,71,850,4,0,0,0,0,1,0,0,0,0,0,1,0,0,1,1,1,0,0,1,2,1,8,1,0
0.099,58,,4,0,0,0,0,0,0,0,0,1,0,1,0,0,1,0,0,3,0,1,2,1,7,1,0
0.0515,49,,2,0,0,0,0,1,0,0,0,0,0,1,0,0,1,0,0,1,0,1,3,0,3,1,0
0.4598,70,,4,0,0,0,0,1,0,0,0,0,0,1,0,0,1,0,0,0,0,1,2,1,1,1,0
0.068,48,,3,0,0,0,0,0,1,0,0,0,0,1,0,0,1,0,0,0,0,1,3,1,4,3,0
0.0967,60,,4,0,0,0,0,1,0,0,0,0,0,1,0,0,1,0,0,0,0,1,3,0,1,1,0
0.207,55,,4,0,0,0,0,1,0,0,0,0,0,1,0,0,1,0,0,0,0,1,3,1,1,1,0
0.4116,69,886,24,0,0,0,0,1,0,0,0,0,0,1,0,0,1,1,0,1,0,1,3,1,4,2,0
0.1489,60,717,4,0,0,0,0,1,0,0,0,0,0,1,0,0,1,1,1,0,0,1,2,1,8,0,0
0.2124,53,773,4,0,0,0,0,0,1,0,0,0,0,1,0,0,1,1,0,1,0,1,,1,5,3,0
0.5934,58,798,9,0,0,0,0,0,1,0,0,0,0,1,0,0,1,1,0,2,0,1,,1,5,1,0
0.9202,35,517,1,0,0,0,0,1,0,0,0,0,0,1,0,0,1,1,0,1,0,1,3,0,3,1,0
0.3771,56,708,7,0,0,0,0,0,0,0,0,1,0,1,0,0,1,1,0,2,0,1,3,1,5,1,0
0.2855,46,775,4,0,0,0,0,0,0,0,0,1,0,1,0,0,1,1,0,0,0,1,1,,1,1,0
0.7008,35,523,4,0,0,0,0,1,0,0,0,0,0,1,0,0,1,1,0,0,0,1,3,1,3,2,0
0.5371,45,585,1,0,0,0,0,1,0,0,0,0,0,1,0,0,1,1,0,2,0,1,3,1,5,3,0
0.5281,32,394,2,0,0,0,0,1,0,0,0,0,0,1,0,0,0,1,1,1,0,1,3,1,8,3,1
0.149,52,,1,0,0,0,0,0,1,0,0,0,0,1,0,0,1,0,0,3,0,1,3,1,7,2,0
0.3994,29,368,6,0,0,0,0,1,0,0,0,0,0,1,0,0,1,1,0,1,0,1,3,0,4,2,0
0.0131,49,,4,0,0,0,0,1,0,0,0,0,0,1,0,0,1,0,0,1,0,1,2,1,2,1,0
0.5558,50,705,5,0,0,0,0,1,0,0,0,0,0,1,0,0,1,1,0,1,0,1,1,1,4,2,0
0.3605,76,916,5,0,0,0,0,0,1,0,0,0,0,1,0,0,1,1,1,0,0,1,2,1,8,4,0
0.0603,47,,5,0,0,0,0,0,1,0,0,0,0,1,0,0,1,0,0,0,0,1,3,1,1,1,0
0.2127,46,,4,0,0,0,0,1,0,0,0,0,0,1,0,0,1,0,0,0,0,1,2,1,1,1,0
0.0316,67,,3,0,0,0,0,1,0,0,0,0,0,1,0,0,1,0,0,0,0,1,3,1,1,1,0
0.1339,49,,1,0,0,0,0,1,0,0,0,0,0,1,0,0,1,0,0,2,0,1,3,1,5,2,0
0.2751,58,692,2,0,0,0,0,1,0,0,0,0,0,1,0,0,1,1,1,0,0,1,3,0,8,0,0
0.6033,45,564,9,0,0,0,0,1,0,0,0,0,0,1,0,0,1,1,0,1,0,1,3,1,4,2,0
0.4237,52,,7,0,0,0,0,1,0,0,0,0,0,1,0,0,1,0,0,0,0,1,3,0,1,1,0
0.9084,53,635,1,0,0,0,0,1,0,0,0,0,0,1,0,0,1,1,0,1,0,1,3,1,3,1,0
0.0,60,,1,0,0,0,0,1,0,0,0,0,0,1,0,0,1,0,0,0,0,1,2,1,1,1,0
0.1996,45,,5,0,0,0,0,1,0,0,0,0,0,1,0,0,1,0,0,0,0,1,3,1,3,2,0
0.3278,32,459,2,0,0,0,0,1,0,0,0,0,0,1,0,0,1,1,0,1,0,1,3,1,4,2,0
0.2651,37,445,2,0,0,0,0,1,0,0,0,0,0,1,0,0,1,1,1,1,0,1,3,1,8,0,0
0.3457,55,697,1,0,0,0,0,1,0,0,0,0,0,1,0,0,1,1,0,3,0,1,2,1,7,4,0
0.3344,41,586,5,0,0,0,0,1,0,0,0,0,0,1,0,0,1,1,0,0,0,1,,1,1,1,0
0.096,50,596,1,0,0,0,0,1,0,0,0,0,0,1,0,0,1,1,1,0,0,1,2,1,8,0,0
0.2538,43,559,2,0,0,0,0,1,0,0,0,0,0,1,0,0,1,1,0,2,0,1,2,1,5,3,0
0.0119,40,,4,0,0,0,0,1,0,0,0,0,0,1,0,0,1,0,0,0,0,1,3,1,1,1,0
0.1616,55,,5,0,0,0,0,1,0,0,0,0,0,1,0,0,1,0,0,1,0,1,2,1,4,2,0
0.3391,36,430,3,0,0,0,0,1,0,0,0,0,1,0,0,0,1,1,1,0,1,1,3,1,8,0,0
0.1255,73,,,0,0,0,0,1,0,0,0,0,0,1,0,0,1,0,0,0,0,1,3,1,1,1,0
0.5206,43,556,4,0,0,0,0,1,0,0,0,0,0,1,0,0,1,1,0,1,0,1,3,0,3,1,0
0.5025,52,628,3,0,0,0,0,1,0,0,0,0,0,1,0,0,1,1,0,1,0,1,2,1,3,1,0
0.6006,38,492,3,0,0,0,0,1,0,0,0,0,0,0,0,1,0,1,0,2,0,0,3,0,5,2,0
0.1233,54,,4,0,0,0,0,1,0,0,0,0,0,1,0,0,1,0,0,0,0,1,2,1,1,1,0
0.3871,42,536,1,0,0,0,0,1,0,0,0,0,0,1,0,0,1,1,0,0,0,1,3,0,3,2,0
0.328,48,,3,0,0,0,0,1,0,0,0,0,0,1,0,0,1,0,0,0,0,1,3,1,1,1,0
0.2424,58,704,4,0,0,0,0,0,0,0,0,1,0,1,0,0,1,1,1,1,0,1,2,0,8,0,0
0.0201,70,,4,0,0,0,0,0,1,0,0,0,0,1,0,0,1,0,0,0,0,1,3,0,1,1,0
0.0556,66,,3,0,0,0,0,1,0,0,0,0,0,0,0,1,0,0,0,0,0,0,2,0,1,1,0
0.3108,41,530,5,0,0,0,0,0,1,0,0,0,0,1,0,0,1,1,0,2,0,1,3,1,5,3,0
0.0,66,788,2,0,0,0,0,1,0,0,0,0,0,1,0,0,1,1,1,0,0,1,2,1,8,0,0
0.0,57,740,2,0,0,0,0,1,0,0,0,0,0,1,0,0,1,1,0,0,0,1,3,1,1,1,0
0.0011,61,,5,0,0,0,0,1,0,0,0,0,0,1,0,0,1,0,0,0,0,1,3,1,1,1,0
0.3329,25,303,1,0,0,0,0,1,0,0,0,0,1,0,0,0,1,1,1,0,1,1,3,1,8,0,0
0.2473,43,,3,0,0,0,0,1,0,0,0,0,0,1,0,0,1,0,0,3,0,1,2,1,7,3,0
0.0708,44,,2,0,0,0,0,1,0,0,0,0,1,0,0,0,1,0,0,2,1,1,2,1,5,2,0
0.1338,78,,9,0,0,0,0,0,1,0,0,0,0,0,0,1,0,0,0,0,0,0,3,0,3,2,0
0.1719,58,,2,0,0,0,0,1,0,0,0,0,0,1,0,0,1,0,0,0,0,1,2,1,1,1,0
0.1038,35,,2,0,0,0,0,1,0,0,0,0,0,1,0,0,1,0,0,1,0,1,2,1,3,1,0
0.0524,69,,21,0,0,0,0,1,0,0,0,0,0,1,0,0,1,0,0,0,0,1,2,1,1,1,0
0.274,58,699,8,0,0,0,0,1,0,0,0,0,0,1,0,0,1,1,0,3,0,1,3,1,7,3,0
0.1065,74,,2,0,0,0,0,0,1,0,0,0,0,1,0,0,1,0,0,0,0,1,3,1,1,1,0
0.4319,44,,2,0,0,0,0,1,0,0,0,0,0,1,0,0,1,0,0,0,0,1,1,1,1,1,0
0.4291,63,,2,0,0,0,0,1,0,0,0,0,0,1,0,0,1,0,0,0,0,1,3,0,1,1,0
0.0,62,,1,0,0,0,0,0,1,0,0,0,0,1,0,0,1,0,0,0,0,1,3,1,1,1,0
0.3262,66,,5,0,0,0,0,1,0,0,0,0,0,0,0,1,0,0,0,0,0,0,3,0,1,1,0
0.053,42,,,0,0,0,0,1,0,0,0,0,0,1,0,0,1,0,0,0,0,1,2,1,1,1,0
0.0547,63,,4,0,0,0,0,1,0,0,0,0,0,1,0,0,1,0,0,0,0,1,2,1,1,1,0
0.2076,55,,2,0,0,0,0,0,0,0,0,1,0,1,0,0,1,0,0,0,0,1,2,1,1,1,0
0.0198,57,,3,0,0,0,0,1,0,0,0,0,0,1,0,0,1,0,0,0,0,1,1,1,1,1,0
0.6102,55,,2,0,0,0,0,1,0,0,0,0,0,1,0,0,1,0,0,0,0,1,3,1,1,1,0
0.3147,62,,1,0,0,0,0,1,0,0,0,0,0,1,0,0,1,0,0,0,0,1,2,1,1,1,0
0.3763,40,677,6,0,0,0,0,1,0,0,0,0,0,1,0,0,1,1,0,1,0,1,3,1,3,1,0
0.2358,66,,4,0,0,0,0,0,1,0,0,0,0,1,0,0,1,0,0,0,0,1,2,1,1,1,0
0.2703,70,,10,0,0,0,0,1,0,0,0,0,0,1,0,0,1,0,0,0,0,1,3,0,1,1,0
0.0969,37,,2,0,0,0,0,1,0,0,0,0,0,1,0,0,1,0,0,0,0,1,3,1,1,1,0
0.4236,68,,6,0,0,0,0,1,0,0,0,0,0,0,0,1,0,0,0,0,0,0,2,0,1,1,0
0.0583,63,817,6,0,0,0,0,1,0,0,0,0,0,1,0,0,1,1,0,0,0,1,3,1,1,1,0
0.7776,39,485,3,0,0,0,0,1,0,0,0,0,0,0,0,1,1,1,0,1,0,0,3,0,4,2,0
0.0939,57,,14,0,0,0,0,1,0,0,0,0,0,1,0,0,1,0,0,0,0,1,2,0,1,1,0
0.3532,55,,3,0,0,0,0,1,0,0,0,0,0,1,0,0,1,0,0,0,0,1,2,1,1,1,0
0.2794,73,,3,0,0,0,0,1,0,0,0,0,0,1,0,0,1,0,0,0,0,1,3,1,1,1,0
0.2198,47,,2,0,0,0,0,1,0,0,0,0,0,1,0,0,1,0,0,1,0,1,3,0,4,2,0
0.3372,60,750,15,0,0,0,0,1,0,0,0,0,0,1,0,0,1,1,0,0,0,1,3,1,3,2,1
0.2062,78,937,5,0,0,0,0,1,0,0,0,0,0,1,0,0,1,1,1,0,0,1,3,1,8,1,0
0.3703,30,385,9,0,0,0,0,1,0,0,0,0,0,1,0,0,1,1,0,1,0,1,3,1,4,2,0
0.2068,79,996,8,0,0,0,0,0,1,0,0,0,0,1,0,0,1,1,0,0,0,1,2,1,1,1,0
0.1275,67,,5,0,0,0,0,1,0,0,0,0,0,1,0,0,1,0,0,1,0,1,2,1,2,1,0
0.3218,43,671,1,0,0,0,0,1,0,0,0,0,0,1,0,0,1,1,0,2,0,1,2,1,5,2,0
0.1556,48,,4,0,0,0,0,0,1,0,0,0,0,1,0,0,1,0,0,0,0,1,3,1,3,2,0
0.1758,34,,3,0,0,0,0,1,0,0,0,0,0,1,0,0,1,0,0,2,0,1,2,1,5,1,0
0.5918,68,,1,0,0,0,0,1,0,0,0,0,0,1,0,0,1,0,0,1,0,1,3,1,3,1,0
0.2523,61,,2,0,0,0,0,1,0,0,0,0,0,1,0,0,1,0,0,0,0,1,2,1,1,1,0
0.4299,51,,3,0,0,0,0,1,0,0,0,0,1,0,0,0,1,0,0,1,1,1,2,1,3,1,0
0.1849,51,,1,0,0,0,0,1,0,0,0,0,0,1,0,0,1,0,0,0,0,1,2,1,1,1,0
0.0981,57,,5,0,0,0,0,0,1,0,0,0,0,1,0,0,1,0,0,0,0,1,2,1,1,1,0
0.4401,64,,5,0,0,0,0,0,1,0,0,0,0,1,0,0,1,0,0,0,0,1,2,1,1,1,0
0.164,39,,2,0,0,0,0,0,1,0,0,0,0,1,0,0,1,0,0,0,0,1,,1,3,2,0
0.0,64,781,6,0,0,0,0,0,1,0,0,0,1,0,0,0,1,1,0,0,1,1,3,1,3,2,0
0.1288,48,598,4,0,0,0,0,1,0,0,0,0,0,0,0,1,1,1,0,1,0,0,3,0,4,2,0
0.019,45,,3,0,0,0,0,1,0,0,0,0,0,1,0,0,1,0,0,0,0,1,1,1,1,1,0
0.0948,37,,2,0,0,0,0,1,0,0,0,0,0,1,0,0,1,0,0,0,0,1,2,1,1,1,0
0.0546,50,,8,0,0,0,0,0,1,0,0,0,0,1,0,0,1,0,0,1,0,1,2,1,5,3,0
0.303,49,,3,0,0,0,0,1,0,0,0,0,0,0,0,1,0,0,0,0,0,0,3,0,3,2,0
0.4117,41,,6,0,0,0,0,1,0,0,0,0,0,0,0,1,0,0,0,0,0,0,3,0,1,1,0
0.7439,36,483,6,0,0,0,0,1,0,0,0,0,0,1,0,0,1,1,0,0,0,1,3,0,3,2,0
0.2422,76,,4,0,0,0,0,0,1,0,0,0,0,1,0,0,1,0,0,1,0,1,2,1,3,1,0
0.0742,64,,2,0,0,0,0,0,1,0,0,0,0,1,0,0,1,0,0,0,0,1,2,1,1,1,0
0.1207,72,,4,0,0,0,0,0,1,0,0,0,0,1,0,0,1,0,0,0,0,1,3,1,1,1,0
0.0,58,,2,0,0,0,0,1,0,0,0,0,0,1,0,0,1,0,0,0,0,1,2,1,1,1,0
0.29,77,,8,0,0,0,0,1,0,0,0,0,0,1,0,0,1,0,0,1,0,1,2,1,4,2,0
0.3747,45,,9,0,0,0,0,1,0,0,0,0,0,1,0,0,1,0,0,0,0,1,3,1,1,1,0
0.0776,65,,2,0,0,0,0,1,0,0,0,0,0,1,0,0,1,0,0,0,0,1,2,1,1,1,0
0.2363,31,390,2,0,0,0,0,1,0,0,0,0,0,1,0,0,1,1,0,1,0,1,3,1,5,3,0
0.0,76,,7,0,0,0,0,0,0,0,0,1,0,1,0,0,1,0,0,0,0,1,2,1,1,1,0
0.0629,54,,2,0,0,0,0,1,0,0,0,0,0,1,0,0,1,0,0,0,0,1,3,1,1,1,0
0.3847,61,,4,0,0,0,0,1,0,0,0,0,0,1,0,0,1,0,0,0,0,1,3,1,1,1,0
0.2539,74,,7,0,0,0,0,0,1,0,0,0,0,1,0,0,1,0,0,0,0,1,2,1,1,1,0
0.737,64,,3,0,0,0,0,1,0,0,0,0,0,1,0,0,1,0,0,1,0,1,3,1,2,1,0
0.0724,42,,3,0,0,0,0,1,0,0,0,0,0,1,0,0,1,0,0,1,0,1,2,1,4,2,0
0.1535,75,,10,0,0,0,0,1,0,0,0,0,0,1,0,0,1,0,0,0,0,1,3,1,1,1,0
0.4184,33,,6,0,0,0,0,1,0,0,0,0,0,0,0,1,0,0,0,0,0,0,3,0,1,1,0
0.5008,81,,,0,0,0,0,1,0,0,0,0,0,1,0,0,1,0,0,0,0,1,3,0,1,1,0
0.2427,78,,,0,0,0,0,1,0,0,0,0,0,1,0,0,1,0,0,0,0,1,1,1,1,1,0
0.0508,49,,,0,0,0,0,1,0,0,0,0,0,1,0,0,1,0,0,0,0,1,1,1,1,1,0
0.2292,52,,3,0,0,0,0,1,0,0,0,0,0,1,0,0,1,0,0,0,0,1,2,1,1,1,0
0.5441,54,,4,0,0,0,0,1,0,0,0,0,0,0,1,0,0,0,0,0,1,0,3,0,1,1,0
0.3915,56,,8,0,0,0,0,1,0,0,0,0,0,1,0,0,1,0,0,0,0,1,1,1,1,1,0
0.2422,54,,4,0,0,0,0,1,0,0,0,0,0,1,0,0,1,0,0,0,0,1,3,0,1,1,0
0.3384,75,,6,0,0,0,0,1,0,0,0,0,0,0,1,0,0,0,0,1,1,0,3,0,4,2,0
0.1316,62,750,5,0,0,0,0,1,0,0,0,0,0,1,0,0,1,1,1,0,0,1,2,1,8,0,0
0.3619,63,,1,0,0,0,0,1,0,0,0,0,0,0,1,0,0,0,0,0,1,0,3,0,1,1,0
0.0737,65,780,9,0,0,0,0,1,0,0,0,0,0,1,0,0,1,1,1,0,0,1,3,1,8,4,0
0.2433,59,,2,0,0,0,0,1,0,0,0,0,0,1,0,0,1,0,0,0,0,1,3,0,4,3,0
0.6756,46,,4,0,0,0,0,1,0,0,0,0,0,0,0,1,0,0,0,0,0,0,3,0,3,2,0
0.4195,49,609,3,0,0,0,0,0,0,0,0,1,1,0,0,0,1,1,0,1,1,1,3,1,5,3,0
0.5666,45,542,2,0,0,0,0,1,0,0,0,0,0,1,0,0,1,1,1,1,0,1,3,1,8,4,0
0.3057,51,,1,0,0,0,0,1,0,0,0,0,0,1,0,0,1,0,0,1,0,1,2,0,3,1,0
0.3242,45,,7,0,0,0,0,1,0,0,0,0,0,1,0,0,1,0,0,0,0,1,3,1,3,2,0
0.1702,71,860,4,0,0,0,0,0,1,0,0,0,0,1,0,0,1,1,1,0,0,1,2,1,8,0,0
0.1266,38,,1,0,0,0,0,1,0,0,0,0,0,1,0,0,1,0,0,1,0,1,3,1,3,1,0
0.4986,38,,,0,0,0,0,1,0,0,0,0,0,1,0,0,1,0,0,0,0,1,3,1,1,1,0
0.1905,63,763,2,0,0,0,0,0,1,0,0,0,0,1,0,0,1,1,1,0,0,1,1,1,8,0,0
0.7705,51,690,4,1,0,0,0,0,0,0,0,0,0,1,0,0,1,1,0,0,0,1,3,0,3,2,0
0.7263,54,690,5,0,0,0,0,1,0,0,0,0,0,1,0,0,1,1,0,2,0,1,3,1,5,2,0
0.0525,43,711,9,0,0,0,0,0,1,0,0,0,0,1,0,0,1,1,0,0,0,1,,0,1,1,0
0.0759,57,680,1,0,0,0,0,1,0,0,0,0,0,1,0,0,1,1,1,0,0,1,2,1,8,0,0
0.5221,60,775,6,0,0,0,0,1,0,0,0,0,0,1,0,0,1,1,0,1,0,1,3,1,2,1,0
0.6169,48,635,3,0,0,0,0,1,0,0,0,0,0,1,0,0,1,1,0,1,0,1,2,1,3,1,0
0.1874,53,,8,0,0,0,0,0,1,0,0,0,0,1,0,0,1,0,0,1,0,1,,0,4,2,0
0.1958,45,,2,0,0,0,0,0,1,0,0,0,0,1,0,0,1,0,0,1,0,1,3,1,4,2,0
0.0,33,402,3,0,0,0,0,1,0,0,0,0,0,1,0,0,1,1,0,1,0,1,3,0,3,1,0
0.1805,59,912,6,0,0,0,0,1,0,0,0,0,0,1,0,0,1,1,0,1,0,1,3,1,3,1,0
0.1326,76,,2,0,0,0,0,1,0,0,0,0,0,1,0,0,1,0,0,0,0,1,3,1,3,2,0
0.5662,66,847,3,0,0,0,0,1,0,0,0,0,0,0,0,1,0,1,0,0,0,0,3,0,1,1,0
0.2018,48,594,2,0,0,0,0,1,0,0,0,0,0,1,0,0,1,1,0,0,0,1,3,1,3,2,0
0.0834,65,,2,0,0,0,0,1,0,0,0,0,0,1,0,0,1,0,0,0,0,1,2,0,1,1,0
0.075,31,,2,0,0,0,0,1,0,0,0,0,0,1,0,0,1,0,0,0,0,1,3,1,1,1,0
0.3462,42,,5,0,0,0,0,1,0,0,0,0,0,1,0,0,1,0,0,0,0,1,3,1,3,2,0
0.1818,56,777,4,0,0,1,0,0,0,0,0,0,0,1,0,0,0,1,0,0,0,1,3,1,1,1,0
0.62,31,474,11,0,0,0,0,1,0,0,0,0,0,1,0,0,1,1,0,0,0,1,3,1,1,1,0
0.0547,49,,3,0,0,0,0,0,1,0,0,0,0,1,0,0,1,0,0,0,0,1,3,1,3,2,0
0.6593,63,776,5,0,0,0,0,1,0,0,0,0,0,1,0,0,1,1,0,0,0,1,3,1,3,2,0
0.3977,62,,2,0,0,0,0,1,0,0,0,0,0,1,0,0,1,0,0,0,0,1,3,1,1,1,0
0.0,48,,1,0,0,0,0,1,0,0,0,0,0,1,0,0,1,0,0,0,0,1,2,1,1,1,0
0.0,46,,2,0,0,0,0,1,0,0,0,0,0,1,0,0,1,0,0,0,0,1,3,1,1,1,0
0.4601,72,,3,0,0,0,0,1,0,0,0,0,0,1,0,0,1,0,0,3,0,1,3,1,7,2,0
0.3495,48,,2,0,0,0,0,1,0,0,0,0,0,1,0,0,0,0,0,0,0,1,3,1,3,2,0
0.4572,45,580,2,0,0,0,0,0,1,0,0,0,0,1,0,0,1,1,0,0,0,1,,1,1,1,0
0.6665,56,697,3,0,0,0,0,1,0,0,0,0,0,1,0,0,1,1,0,0,0,1,3,1,1,1,0
0.2806,38,456,2,0,0,0,0,1,0,0,0,0,0,1,0,0,1,1,1,0,0,1,3,1,8,0,0
0.0195,80,,4,0,0,0,0,1,0,0,0,0,0,1,0,0,1,0,0,1,0,1,3,1,4,2,0
0.6519,42,581,7,0,0,0,0,1,0,0,0,0,0,1,0,0,1,1,0,1,0,1,1,1,4,2,0
0.0823,42,631,5,0,0,0,0,1,0,0,0,0,0,1,0,0,1,1,0,2,0,1,2,0,5,2,0
0.4351,67,,4,0,0,0,0,0,1,0,0,0,1,0,0,0,1,0,0,1,1,1,3,1,4,2,0
0.1131,37,,3,0,0,0,0,1,0,0,0,0,0,1,0,0,1,0,0,0,0,1,3,1,1,1,0
0.0,47,,,0,0,0,0,1,0,0,0,0,0,1,0,0,1,0,0,0,0,1,3,1,1,1,0
0.3398,49,708,6,0,0,0,0,0,1,0,0,0,0,1,0,0,1,1,0,2,0,1,1,1,5,2,0
0.115,67,,4,0,0,0,0,1,0,0,0,0,0,1,0,0,1,0,0,0,0,1,3,1,1,1,0
0.6318,61,,1,0,0,0,0,1,0,0,0,0,0,1,0,0,1,0,0,0,0,1,3,1,1,1,0
0.6743,56,691,21,0,0,0,0,1,0,0,0,0,0,1,0,0,1,1,0,1,0,1,3,1,4,2,0
0.0338,59,,5,0,0,0,0,0,1,0,0,0,0,1,0,0,1,0,0,0,0,1,2,1,3,2,0
0.1276,69,,,0,0,0,0,1,0,0,0,0,0,1,0,0,1,0,0,0,0,1,3,1,1,1,0
0.696,51,684,3,0,0,0,0,1,0,0,0,0,0,1,0,0,1,1,0,1,0,1,3,1,2,1,0
0.3792,45,544,8,0,0,0,0,0,1,0,0,0,0,1,0,0,1,1,1,0,0,1,3,1,8,0,0
0.0265,58,,4,0,0,0,0,1,0,0,0,0,0,1,0,0,1,0,0,0,0,1,3,1,1,1,0
0.0548,53,,4,0,0,0,0,0,1,0,0,0,0,1,0,0,1,0,0,0,0,1,3,1,1,1,0
0.1753,48,645,6,0,0,0,0,1,0,0,0,0,0,1,0,0,1,1,0,1,0,1,2,1,5,3,0
0.7376,42,566,1,0,0,0,0,1,0,0,0,0,0,1,0,0,1,1,0,1,0,1,3,1,3,1,0
0.8528,40,544,6,0,0,0,0,1,0,0,0,0,0,1,0,0,1,1,0,0,0,1,1,1,3,2,0
0.0,55,,1,0,0,0,0,1,0,0,0,0,0,1,0,0,1,0,0,0,0,1,1,1,1,1,0
0.0753,59,709,3,0,0,0,0,0,1,0,0,0,0,1,0,0,1,1,1,3,0,1,3,1,8,3,0
0.4144,51,,2,0,0,0,0,1,0,0,0,0,0,1,0,0,1,0,0,0,0,1,3,1,1,1,0
0.2565,49,701,4,0,0,0,0,1,0,0,0,0,1,0,0,0,1,1,0,0,1,1,3,1,1,1,0
0.0875,72,872,6,0,0,0,0,0,1,0,0,0,0,1,0,0,1,1,1,3,0,1,3,1,8,3,0
0.164,49,,3,0,0,0,0,0,0,0,0,1,0,1,0,0,1,0,0,0,0,1,3,1,1,1,0
0.5789,64,771,1,0,0,0,0,1,0,0,0,0,0,1,0,0,1,1,1,0,0,1,3,0,8,0,1
0.0343,61,734,2,0,0,0,0,1,0,0,0,0,0,1,0,0,1,1,1,0,0,1,3,1,8,0,0
0.3781,29,,2,0,0,0,0,1,0,0,0,0,0,1,0,0,1,0,0,1,0,1,3,0,4,2,0
0.1656,74,,3,0,0,0,0,0,1,0,0,0,0,1,0,0,1,0,0,0,0,1,2,1,1,1,0
0.1408,48,,6,0,0,0,0,0,1,0,0,0,0,1,0,0,1,0,0,0,0,1,3,1,3,2,0
0.1649,49,722,8,0,0,0,0,0,1,0,0,0,0,1,0,0,1,1,0,0,0,1,,,1,1,0
0.2803,51,612,4,0,0,0,0,1,0,0,0,0,0,1,0,0,1,1,1,0,0,1,2,1,8,0,0
0.1061,46,,1,0,0,0,0,1,0,0,0,0,0,1,0,0,1,0,0,2,0,1,3,1,5,2,0
0.3744,74,,2,0,0,0,0,1,0,0,0,0,0,1,0,0,1,0,0,0,0,1,3,1,3,2,0
0.0,66,,2,0,0,0,0,1,0,0,0,0,0,1,0,0,1,0,0,0,0,1,2,1,1,1,0
0.0,70,,2,0,0,0,0,1,0,0,0,0,0,1,0,0,1,0,0,0,0,1,1,1,1,1,0
0.0998,30,,2,0,0,0,0,1,0,0,0,0,0,1,0,0,1,0,0,1,0,1,2,1,4,2,0
0.1614,62,,1,0,0,0,0,0,0,1,0,0,0,1,0,0,1,0,0,0,0,1,2,1,1,1,0
0.0723,57,,3,0,0,0,0,1,0,0,0,0,0,1,0,0,1,0,0,0,0,1,2,1,1,1,0
0.4034,58,,3,0,0,0,0,1,0,0,0,0,0,1,0,0,1,0,0,0,0,1,3,1,3,2,0
0.0882,42,,3,0,0,0,0,1,0,0,0,0,0,1,0,0,1,0,0,0,0,1,3,1,1,1,0
0.146,71,,2,0,0,0,0,1,0,0,0,0,0,1,0,0,1,0,0,0,0,1,2,1,1,1,0
0.0,51,,1,0,0,0,0,1,0,0,0,0,0,1,0,0,1,0,0,1,0,1,2,1,4,2,0
0.096,49,,5,0,0,0,0,1,0,0,0,0,0,1,0,0,1,0,0,0,0,1,2,1,1,1,0
0.0205,83,,3,0,0,0,0,1,0,0,0,0,0,0,0,1,0,0,0,0,0,0,3,0,1,1,0
0.4608,63,,2,0,0,0,0,1,0,0,0,0,1,0,0,0,1,0,0,2,1,1,3,1,5,1,0
0.0429,55,,2,0,0,0,0,0,1,0,0,0,0,1,0,0,1,0,0,0,0,1,3,0,1,1,0
0.2677,45,,3,0,0,0,0,1,0,0,0,0,0,1,0,0,1,0,0,1,0,1,3,1,4,2,0
0.1446,69,,5,0,0,0,0,0,1,0,0,0,0,1,0,0,1,0,0,0,0,1,2,1,3,2,0
0.0137,76,,,0,0,0,0,1,0,0,0,0,0,1,0,0,1,0,0,0,0,1,2,1,1,1,0
0.3379,60,,4,0,0,0,0,1,0,0,0,0,0,0,0,1,0,0,0,0,0,0,3,0,1,1,0
0.1568,52,,4,0,0,0,0,1,0,0,0,0,0,1,0,0,1,0,0,1,0,1,1,1,4,2,0
0.0829,60,,9,0,0,0,0,0,1,0,0,0,0,1,0,0,1,0,0,1,0,1,2,0,4,2,0
0.7142,58,,2,0,0,0,0,0,0,0,0,1,0,1,0,0,1,0,0,0,0,1,3,1,3,2,0
0.3034,78,,4,0,0,0,0,1,0,0,0,0,0,1,0,0,1,0,0,1,0,1,2,1,3,1,0
0.5792,84,,4,0,0,0,0,1,0,0,0,0,0,0,0,1,0,0,0,0,0,0,3,0,1,1,0
0.4015,54,,6,0,0,0,0,0,0,0,0,1,0,1,0,0,1,0,0,0,0,1,2,1,1,1,0
0.0864,51,,4,0,0,0,0,1,0,0,0,0,0,1,0,0,1,0,0,0,0,1,2,1,1,1,0
0.0,68,,2,0,0,0,0,1,0,0,0,0,0,1,0,0,1,0,0,0,0,1,2,1,1,1,0
0.2829,68,,3,0,0,0,0,1,0,0,0,0,0,1,0,0,1,0,0,0,0,1,2,0,1,1,0
0.1956,74,,1,0,0,0,0,1,0,0,0,0,0,1,0,0,1,0,0,0,0,1,2,1,1,1,0
0.0195,57,,6,0,0,0,0,0,1,0,0,0,0,1,0,0,1,0,0,0,0,1,2,1,1,1,0
0.2393,48,,2,0,0,0,0,1,0,0,0,0,0,1,0,0,1,0,0,1,0,1,2,1,2,1,0
0.0626,38,,3,0,0,0,0,1,0,0,0,0,0,1,0,0,1,0,0,0,0,1,1,1,1,1,0
0.0,52,,2,0,0,0,0,0,1,0,0,0,0,1,0,0,1,0,0,1,0,1,2,1,3,1,0
0.077,56,,1,0,0,0,0,1,0,0,0,0,0,1,0,0,1,0,0,0,0,1,2,1,1,1,0
0.0001,38,,3,0,0,0,0,1,0,0,0,0,0,0,1,0,0,0,0,0,1,0,3,0,1,1,0
0.0181,72,,2,0,0,0,0,1,0,0,0,0,0,0,0,1,0,0,0,0,0,0,2,0,1,1,0
0.3167,26,,1,0,0,0,0,1,0,0,0,0,0,1,0,0,1,0,0,2,0,1,2,1,5,1,0
0.0195,50,,5,0,0,0,0,1,0,0,0,0,0,1,0,0,1,0,0,0,0,1,1,1,1,1,0
0.0816,53,,4,0,0,0,0,0,1,0,0,0,0,1,0,0,1,0,0,0,0,1,2,0,3,2,0
0.0434,49,,4,0,0,0,0,0,1,0,0,0,0,1,0,0,1,0,0,1,0,1,2,1,4,2,0
0.0661,44,,1,0,0,0,0,1,0,0,0,0,0,1,0,0,1,0,0,0,0,1,2,1,1,1,0
0.1249,72,,5,0,0,0,0,0,1,0,0,0,0,1,0,0,1,0,0,0,0,1,2,1,1,1,0
0.234,58,,,0,0,0,0,1,0,0,0,0,0,1,0,0,1,0,0,2,0,1,2,1,5,2,0
0.1172,47,,2,0,0,0,0,1,0,0,0,0,0,1,0,0,1,0,0,1,0,1,2,1,4,2,0
0.1636,49,,1,0,0,0,0,0,1,0,0,0,0,1,0,0,1,0,0,0,0,1,1,1,1,1,0
0.0,54,,1,0,0,0,0,1,0,0,0,0,0,1,0,0,1,0,0,0,0,1,1,0,1,1,0
0.0,68,,3,0,0,0,0,1,0,0,0,0,0,1,0,0,1,0,0,0,0,1,2,1,1,1,0
0.1108,66,,2,0,0,0,0,1,0,0,0,0,0,0,0,1,0,0,0,0,0,0,3,0,1,1,0
,54,,3,0,0,0,0,0,1,0,0,0,0,1,0,0,1,0,0,0,0,1,2,1,1,1,0
0.3062,57,,2,0,0,0,0,1,0,0,0,0,0,1,0,0,1,0,0,0,0,1,2,1,1,1,0
0.0745,29,,3,0,0,0,0,1,0,0,0,0,0,1,0,0,1,0,0,0,0,1,2,1,3,2,0
0.018,70,,3,0,0,0,0,1,0,0,0,0,0,1,0,0,1,0,0,0,0,1,2,1,1,1,0
0.3552,51,,4,0,0,0,0,1,0,0,0,0,0,1,0,0,1,0,0,0,0,1,1,1,1,1,0
0.1978,38,,7,0,0,0,0,1,0,0,0,0,0,1,0,0,1,0,0,1,0,1,2,1,4,2,0
0.074,47,,2,0,0,0,0,1,0,0,0,0,0,1,0,0,1,0,0,1,0,1,1,1,4,2,0
0.3803,58,,2,0,0,0,0,1,0,0,0,0,0,1,0,0,1,0,0,0,0,1,3,0,1,1,0
0.1525,66,,3,0,0,0,0,0,1,0,0,0,0,1,0,0,1,0,0,1,0,1,2,1,3,1,0
0.0438,35,,1,0,0,0,0,1,0,0,0,0,0,1,0,0,1,0,0,0,0,1,2,1,1,1,0
0.1101,65,,4,0,0,0,0,1,0,0,0,0,0,1,0,0,1,0,0,0,0,1,1,1,1,1,0
0.0832,61,,3,0,0,0,0,1,0,0,0,0,0,1,0,0,1,0,0,0,0,1,2,1,1,1,0
0.0468,66,,3,0,0,0,0,1,0,0,0,0,0,1,0,0,1,0,0,0,0,1,,1,1,1,0
0.0468,44,,5,0,0,0,0,1,0,0,0,0,0,1,0,0,1,0,0,0,0,1,1,1,1,1,0
0.0727,75,,15,0,0,0,0,0,1,0,0,0,0,1,0,0,1,0,0,0,0,1,2,1,3,2,0
0.1719,42,,3,0,0,0,0,1,0,0,0,0,0,1,0,0,1,0,0,2,0,1,3,1,5,3,0
0.2312,51,,1,0,0,0,0,1,0,0,0,0,0,1,0,0,1,0,0,0,0,1,2,1,1,1,0
0.0249,49,,4,0,0,0,0,1,0,0,0,0,0,1,0,0,1,0,0,0,0,1,2,1,3,2,0
0.0114,47,,3,0,0,0,0,0,0,0,0,1,0,1,0,0,1,0,0,0,0,1,2,1,1,1,0
0.0,62,,5,0,0,0,0,1,0,0,0,0,0,1,0,0,1,0,0,0,0,1,2,1,1,1,0
0.252,25,,2,0,0,0,0,1,0,0,0,0,0,0,0,1,0,0,0,1,0,0,3,0,5,3,0
0.0934,31,,1,0,0,0,0,1,0,0,0,0,0,1,0,0,1,0,0,2,0,1,2,1,5,2,0
0.1198,63,,3,0,0,0,0,1,0,0,0,0,0,1,0,0,1,0,0,0,0,1,2,1,1,1,0
0.2202,69,,3,0,0,0,0,1,0,0,0,0,0,1,0,0,1,0,0,0,0,1,2,1,1,1,0
0.0686,48,,4,0,0,0,0,1,0,0,0,0,0,1,0,0,1,0,0,0,0,1,1,1,3,2,0
0.35,44,,6,0,0,0,0,1,0,0,0,0,0,0,1,0,0,0,0,0,1,0,3,0,1,1,0
0.0736,73,,17,0,0,0,0,1,0,0,0,0,0,1,0,0,1,0,0,0,0,1,,1,3,2,0
0.1869,75,,3,0,0,0,0,1,0,0,0,0,0,1,0,0,1,0,0,0,0,1,2,1,3,2,0
0.0627,55,,5,0,0,0,0,1,0,0,0,0,0,1,0,0,1,0,0,0,0,1,1,1,1,1,0
0.0577,67,,3,0,0,0,0,0,0,0,0,1,0,1,0,0,1,0,0,0,0,1,2,1,1,1,0
0.1222,61,,3,0,0,0,0,0,0,0,0,1,0,1,0,0,1,0,0,1,0,1,2,1,4,2,0
0.0,65,,1,1,0,0,0,0,0,0,0,0,0,1,0,0,1,0,0,0,0,1,2,1,1,1,0
0.481,67,,3,0,0,0,0,1,0,0,0,0,0,1,0,0,1,0,0,1,0,1,3,1,4,2,0
0.1781,57,,7,0,0,0,0,1,0,0,0,0,0,1,0,0,1,0,0,0,0,1,2,1,1,1,0
0.0,47,,2,0,0,0,0,1,0,0,0,0,0,1,0,0,1,0,0,0,0,1,1,1,1,1,0
0.2179,45,,1,0,0,0,0,1,0,0,0,0,0,1,0,0,1,0,0,1,0,1,2,1,2,1,0
0.0,67,,1,0,0,0,0,1,0,0,0,0,0,1,0,0,1,0,0,1,0,1,2,1,4,2,0
