fold,selection_score,selection_accuracy,selection_variation,selection_reconstruction,type,task,task_label,accuracy,target,domain,variation
1,-0.13659184334937802,"[0.7466988005888378, 0.24113855608584828, 0.7431329800014013]",0.584804660223712,0.12877729535102844,source,,,,,,
1,,,,,source,Sex,0.0,0.8290844298245614,,,
1,,,,,source,Sex,1.0,0.6289093825180433,,,
1,,,,,source,age_bracket,0.0,0.035256410256410256,,,
1,,,,,source,age_bracket,1.0,0.0,,,
1,,,,,source,age_bracket,2.0,0.07060185185185185,,,
1,,,,,source,age_bracket,3.0,0.2623655913978495,,,
1,,,,,source,age_bracket,4.0,0.10014513788098693,,,
1,,,,,source,age_bracket,5.0,0.2808988764044944,,,
1,,,,,source,age_bracket,6.0,0.18983050847457628,,,
1,,,,,source,age_bracket,7.0,0.43773119605425403,,,
1,,,,,source,age_bracket,8.0,0.2727895819054147,,,
1,,,,,source,age_bracket,9.0,0.006211180124223602,,,
1,,,,,source,Test Submitter,0.0,0.8918721015377106,,,
1,,,,,source,Test Submitter,1.0,0.42982885085574574,,,
1,,,,,target,Sex,0.0,0.8263185358870401,0.0,,
1,,,,,target,Sex,1.0,0.6502340125383868,0.0,,
1,,,,,target,age_bracket,0.0,0.020684786445464173,0.0,,
1,,,,,target,age_bracket,1.0,0.0,0.0,,
1,,,,,target,age_bracket,2.0,0.04975322797746647,0.0,,
1,,,,,target,age_bracket,3.0,0.20669539854599278,0.0,,
1,,,,,target,age_bracket,4.0,0.09779852698514911,0.0,,
1,,,,,target,age_bracket,5.0,0.29286106223155667,0.0,,
1,,,,,target,age_bracket,6.0,0.21216038342806887,0.0,,
1,,,,,target,age_bracket,7.0,0.4086016034012913,0.0,,
1,,,,,target,age_bracket,8.0,0.3012221703253931,0.0,,
1,,,,,target,age_bracket,9.0,0.008653846153846154,0.0,,
1,,,,,target,Test Submitter,0.0,0.9087629861676843,0.0,,
1,,,,,target,Test Submitter,1.0,0.3916275040440359,0.0,,
1,,,,,source,Source Machine Prediction,,0.5476229241289482,,,
1,,,,,source,,,,,Analyser ID,0.035328964080848
1,,,,,target,,,,0.0,Analyser ID,0.39166707298147324
1,,,,,source,,,,,vendelay,0.668341550494991
1,,,,,target,,,,0.0,vendelay,0.47825880569011237
1,,,,,source,,,,,Season,0.1578355167715796
1,,,,,target,,,,0.0,Season,0.813281552120308
2,-0.07789295414402309,"[0.7453962627753125, 0.24135009953184547, 0.7396648315572404]",0.5138675173906088,0.1394958347082138,source,,,,,,
2,,,,,source,Sex,0.0,0.8258109040717736,,,
2,,,,,source,Sex,1.0,0.6273070053582059,,,
2,,,,,source,age_bracket,0.0,0.026865671641791045,,,
2,,,,,source,age_bracket,1.0,0.0,,,
2,,,,,source,age_bracket,2.0,0.08323831242873432,,,
2,,,,,source,age_bracket,3.0,0.2621428571428571,,,
2,,,,,source,age_bracket,4.0,0.1043602573266619,,,
2,,,,,source,age_bracket,5.0,0.2813261823500731,,,
2,,,,,source,age_bracket,6.0,0.1907706945765937,,,
2,,,,,source,age_bracket,7.0,0.44899701237729406,,,
2,,,,,source,age_bracket,8.0,0.2679063360881543,,,
2,,,,,source,age_bracket,9.0,0.0125,,,
2,,,,,source,Test Submitter,0.0,0.8984317569223229,,,
2,,,,,source,Test Submitter,1.0,0.4279475982532751,,,
2,,,,,target,Sex,0.0,0.8267940086992643,0.0,,
2,,,,,target,Sex,1.0,0.6481154224193688,0.0,,
2,,,,,target,age_bracket,0.0,0.020861277797387928,0.0,,
2,,,,,target,age_bracket,1.0,0.0,0.0,,
2,,,,,target,age_bracket,2.0,0.04934194127324393,0.0,,
2,,,,,target,age_bracket,3.0,0.20405728962605024,0.0,,
2,,,,,target,age_bracket,4.0,0.09589085201432769,0.0,,
2,,,,,target,age_bracket,5.0,0.286957673459348,0.0,,
2,,,,,target,age_bracket,6.0,0.2087369185274379,0.0,,
2,,,,,target,age_bracket,7.0,0.42003347015389486,0.0,,
2,,,,,target,age_bracket,8.0,0.2800190720846956,0.0,,
2,,,,,target,age_bracket,9.0,0.008451417004048584,0.0,,
2,,,,,target,Test Submitter,0.0,0.9084970339327056,0.0,,
2,,,,,target,Test Submitter,1.0,0.39747698157759564,0.0,,
2,,,,,source,Source Machine Prediction,,0.5497394985346793,,,
2,,,,,source,,,,,Analyser ID,0.03661298282833929
2,,,,,target,,,,0.0,Analyser ID,0.3600999133474965
2,,,,,source,,,,,vendelay,0.6150766840191632
2,,,,,target,,,,0.0,vendelay,0.4336665863313225
2,,,,,source,,,,,Season,0.16505406159599267
2,,,,,target,,,,0.0,Season,0.6030752545109701
3,-0.2614983191562592,"[0.7459334675164369, 0.24200149635112642, 0.7397300006656752]",0.6984804002040819,0.13890624046325684,source,,,,,,
3,,,,,source,Sex,0.0,0.8246530163528927,,,
3,,,,,source,Sex,1.0,0.6318417898521774,,,
3,,,,,source,age_bracket,0.0,0.03536977491961415,,,
3,,,,,source,age_bracket,1.0,0.0,,,
3,,,,,source,age_bracket,2.0,0.07657142857142857,,,
3,,,,,source,age_bracket,3.0,0.2789512017479971,,,
3,,,,,source,age_bracket,4.0,0.09602194787379972,,,
3,,,,,source,age_bracket,5.0,0.3051665861902463,,,
3,,,,,source,age_bracket,6.0,0.18393030009680542,,,
3,,,,,source,age_bracket,7.0,0.44305973356252687,,,
3,,,,,source,age_bracket,8.0,0.28512396694214875,,,
3,,,,,source,age_bracket,9.0,0.0057306590257879654,,,
3,,,,,source,Test Submitter,0.0,0.9055684172048252,,,
3,,,,,source,Test Submitter,1.0,0.42566241413150147,,,
3,,,,,target,Sex,0.0,0.8291851048271648,0.0,,
3,,,,,target,Sex,1.0,0.6434377180339891,0.0,,
3,,,,,target,age_bracket,0.0,0.022273208612777973,0.0,,
3,,,,,target,age_bracket,1.0,0.0,0.0,,
3,,,,,target,age_bracket,2.0,0.04454359639064759,0.0,,
3,,,,,target,age_bracket,3.0,0.20957729310870227,0.0,,
3,,,,,target,age_bracket,4.0,0.08956413249084397,0.0,,
3,,,,,target,age_bracket,5.0,0.29236911316720593,0.0,,
3,,,,,target,age_bracket,6.0,0.20189589125186666,0.0,,
3,,,,,target,age_bracket,7.0,0.4223741194296505,0.0,,
3,,,,,target,age_bracket,8.0,0.28600342519072086,0.0,,
3,,,,,target,age_bracket,9.0,0.008906882591093117,0.0,,
3,,,,,target,Test Submitter,0.0,0.9149134815387157,0.0,,
3,,,,,target,Test Submitter,1.0,0.3717791458076189,0.0,,
3,,,,,source,Source Machine Prediction,,0.5686721484979239,,,
3,,,,,source,,,,,Analyser ID,0.04354076077233726
3,,,,,target,,,,0.0,Analyser ID,0.34987566260001035
3,,,,,source,,,,,vendelay,0.6650894187668871
3,,,,,target,,,,0.0,vendelay,0.42343500051672395
3,,,,,source,,,,,Season,0.18948491316307564
3,,,,,target,,,,0.0,Season,0.6118270694757889
4,-0.23971963667587892,"[0.7465523573243225, 0.24201775648441576, 0.7348127969144479]",0.6757928672585852,0.1383877396583557,source,,,,,,
4,,,,,source,Sex,0.0,0.8234488426242981,,,
4,,,,,source,Sex,1.0,0.6386993175431553,,,
4,,,,,source,age_bracket,0.0,0.01929260450160772,,,
4,,,,,source,age_bracket,1.0,0.0,,,
4,,,,,source,age_bracket,2.0,0.06279069767441861,,,
4,,,,,source,age_bracket,3.0,0.22782984859408795,,,
4,,,,,source,age_bracket,4.0,0.09664153529814942,,,
4,,,,,source,age_bracket,5.0,0.3095487932843652,,,
4,,,,,source,age_bracket,6.0,0.19269581931763574,,,
4,,,,,source,age_bracket,7.0,0.41721581548599673,,,
4,,,,,source,age_bracket,8.0,0.2528276779773786,,,
4,,,,,source,age_bracket,9.0,0.0,,,
4,,,,,source,Test Submitter,0.0,0.889801836636056,,,
4,,,,,source,Test Submitter,1.0,0.41128025954579484,,,
4,,,,,target,Sex,0.0,0.8260404615347644,0.0,,
4,,,,,target,Sex,1.0,0.6465264798301054,0.0,,
4,,,,,target,age_bracket,0.0,0.019872926226614896,0.0,,
4,,,,,target,age_bracket,1.0,0.0,0.0,,
4,,,,,target,age_bracket,2.0,0.04566528740216362,0.0,,
4,,,,,target,age_bracket,3.0,0.21305994514823037,0.0,,
4,,,,,target,age_bracket,4.0,0.08563609288847748,0.0,,
4,,,,,target,age_bracket,5.0,0.3135355370128601,0.0,,
4,,,,,target,age_bracket,6.0,0.1991039966001452,0.0,,
4,,,,,target,age_bracket,7.0,0.41335640060155815,0.0,,
4,,,,,target,age_bracket,8.0,0.28960376770979296,0.0,,
4,,,,,target,age_bracket,9.0,0.010779352226720648,0.0,,
4,,,,,target,Test Submitter,0.0,0.9106106543264829,0.0,,
4,,,,,target,Test Submitter,1.0,0.37511787118883155,0.0,,
4,,,,,source,Source Machine Prediction,,0.5526337214035659,,,
4,,,,,source,,,,,Analyser ID,0.03419973754086289
4,,,,,target,,,,0.0,Analyser ID,0.36343415929173173
4,,,,,source,,,,,vendelay,0.6085376829919901
4,,,,,target,,,,0.0,vendelay,0.4686820288426074
4,,,,,source,,,,,Season,0.15154768948705033
4,,,,,target,,,,0.0,Season,0.66233907399654
5,-0.25508547406523296,"[0.7437355089366047, 0.24071517227774925, 0.7199635108664534]",0.6809944280896509,0.1422291100025177,source,,,,,,
5,,,,,source,Sex,0.0,0.8274618585298197,,,
5,,,,,source,Sex,1.0,0.6278336290163611,,,
5,,,,,source,age_bracket,0.0,0.020895522388059702,,,
5,,,,,source,age_bracket,1.0,0.0,,,
5,,,,,source,age_bracket,2.0,0.07727272727272727,,,
5,,,,,source,age_bracket,3.0,0.27826675693974273,,,
5,,,,,source,age_bracket,4.0,0.10469068660774983,,,
5,,,,,source,age_bracket,5.0,0.28534031413612565,,,
5,,,,,source,age_bracket,6.0,0.19001454192922929,,,
5,,,,,source,age_bracket,7.0,0.44322033898305085,,,
5,,,,,source,age_bracket,8.0,0.2717164697706741,,,
5,,,,,source,age_bracket,9.0,0.0058309037900874635,,,
5,,,,,source,Test Submitter,0.0,0.8997651711778519,,,
5,,,,,source,Test Submitter,1.0,0.3637881679389313,,,
5,,,,,target,Sex,0.0,0.8250242885931154,0.0,,
5,,,,,target,Sex,1.0,0.6475679502131322,0.0,,
5,,,,,target,age_bracket,0.0,0.020084715848923403,0.0,,
5,,,,,target,age_bracket,1.0,0.0,0.0,,
5,,,,,target,age_bracket,2.0,0.04812054439403759,0.0,,
5,,,,,target,age_bracket,3.0,0.2098559052718645,0.0,,
5,,,,,target,age_bracket,4.0,0.09531935444922929,0.0,,
5,,,,,target,age_bracket,5.0,0.3016152327612849,0.0,,
5,,,,,target,age_bracket,6.0,0.1952673549011622,0.0,,
5,,,,,target,age_bracket,7.0,0.41305675226432376,0.0,,
5,,,,,target,age_bracket,8.0,0.29388525611085164,0.0,,
5,,,,,target,age_bracket,9.0,0.00951417004048583,0.0,,
5,,,,,target,Test Submitter,0.0,0.9039534499603871,0.0,,
5,,,,,target,Test Submitter,1.0,0.33977184737693483,0.0,,
5,,,,,source,Source Machine Prediction,,0.5518195880485224,,,
5,,,,,source,,,,,Analyser ID,0.035382193297292044
5,,,,,target,,,,0.0,Analyser ID,0.36753797871436017
5,,,,,source,,,,,vendelay,0.665642502173919
5,,,,,target,,,,0.0,vendelay,0.49806992533750716
5,,,,,source,,,,,Season,0.1772224534934365
5,,,,,target,,,,0.0,Season,0.8581481633355225
