,fold,task,task_label,accuracy,type,target
0,1,Sex,0.0,0.8208504801097394,source,
1,1,Sex,1.0,0.6367641169403284,source,
2,1,age_bracket,0.0,0.02654867256637168,source,
3,1,age_bracket,1.0,0.0,source,
4,1,age_bracket,2.0,0.09080188679245282,source,
5,1,age_bracket,3.0,0.26599568655643424,source,
6,1,age_bracket,4.0,0.11471861471861472,source,
7,1,age_bracket,5.0,0.2656099903938521,source,
8,1,age_bracket,6.0,0.20127952755905512,source,
9,1,age_bracket,7.0,0.4257845631891433,source,
10,1,age_bracket,8.0,0.269873079492318,source,
11,1,age_bracket,9.0,0.023121387283236993,source,
12,1,Test Submitter,0.0,0.9026398643739404,source,
13,1,Test Submitter,1.0,0.5263288623944362,source,
14,1,Sex,0.0,0.8304930841878684,target,0.0
15,1,Sex,1.0,0.6536665359523725,target,0.0
16,1,age_bracket,0.0,0.027497352629721142,target,0.0
17,1,age_bracket,1.0,0.0,target,0.0
18,1,age_bracket,2.0,0.05131113216012762,target,0.0
19,1,age_bracket,3.0,0.21163205781202385,target,0.0
20,1,age_bracket,4.0,0.10356984746649495,target,0.0
21,1,age_bracket,5.0,0.2878091237630319,target,0.0
22,1,age_bracket,6.0,0.21858823390528806,target,0.0
23,1,age_bracket,7.0,0.41523344301593224,target,0.0
24,1,age_bracket,8.0,0.30160166588821424,target,0.0
25,1,age_bracket,9.0,0.010981781376518219,target,0.0
26,1,Test Submitter,0.0,0.9154887782154325,target,0.0
27,1,Test Submitter,1.0,0.4613957482041414,target,0.0
28,1,Source Machine Prediction,,0.7258222077499186,source,
29,2,Sex,0.0,0.8279349460161268,source,
30,2,Sex,1.0,0.635594926514999,source,
31,2,age_bracket,0.0,0.04304635761589404,source,
32,2,age_bracket,1.0,0.0,source,
33,2,age_bracket,2.0,0.08439306358381503,source,
34,2,age_bracket,3.0,0.2972027972027972,source,
35,2,age_bracket,4.0,0.10201249132546843,source,
36,2,age_bracket,5.0,0.2740628166160081,source,
37,2,age_bracket,6.0,0.20329138431752178,source,
38,2,age_bracket,7.0,0.43890063424947146,source,
39,2,age_bracket,8.0,0.25804289544235925,source,
40,2,age_bracket,9.0,0.008695652173913044,source,
41,2,Test Submitter,0.0,0.8983983372050373,source,
42,2,Test Submitter,1.0,0.5325213154689403,source,
43,2,Sex,0.0,0.8312277497605471,target,0.0
44,2,Sex,1.0,0.653725102746528,target,0.0
45,2,age_bracket,0.0,0.023791034239322273,target,0.0
46,2,age_bracket,1.0,0.0,target,0.0
47,2,age_bracket,2.0,0.051934293833192084,target,0.0
48,2,age_bracket,3.0,0.2136258761046537,target,0.0
49,2,age_bracket,4.0,0.09741216243409667,target,0.0
50,2,age_bracket,5.0,0.29673358435349695,target,0.0
51,2,age_bracket,6.0,0.20708421133402982,target,0.0
52,2,age_bracket,7.0,0.4222384296165632,target,0.0
53,2,age_bracket,8.0,0.30053129378794957,target,0.0
54,2,age_bracket,9.0,0.010981781376518219,target,0.0
55,2,Test Submitter,0.0,0.9168339366249821,target,0.0
56,2,Test Submitter,1.0,0.46092043023942225,target,0.0
57,2,Source Machine Prediction,,0.7222403126017584,source,
58,3,Sex,0.0,0.8294873566394915,source,
59,3,Sex,1.0,0.6391200951248514,source,
60,3,age_bracket,0.0,0.047619047619047616,source,
61,3,age_bracket,1.0,0.0,source,
62,3,age_bracket,2.0,0.10514018691588785,source,
63,3,age_bracket,3.0,0.27516292541636495,source,
64,3,age_bracket,4.0,0.10803511141120864,source,
65,3,age_bracket,5.0,0.3027950310559006,source,
66,3,age_bracket,6.0,0.18875119161105816,source,
67,3,age_bracket,7.0,0.44380639868744876,source,
68,3,age_bracket,8.0,0.27643400138217,source,
69,3,age_bracket,9.0,0.006006006006006006,source,
70,3,Test Submitter,0.0,0.8914369358380093,source,
71,3,Test Submitter,1.0,0.5319461444308445,source,
72,3,Sex,0.0,0.8311213262430095,target,0.0
73,3,Sex,1.0,0.652808405098876,target,0.0
74,3,age_bracket,0.0,0.02368513942816802,target,0.0
75,3,age_bracket,1.0,0.0,target,0.0
76,3,age_bracket,2.0,0.05417767585622414,target,0.0
77,3,age_bracket,3.0,0.20842801793565802,target,0.0
78,3,age_bracket,4.0,0.09371755141465771,target,0.0
79,3,age_bracket,5.0,0.31554748254526876,target,0.0
80,3,age_bracket,6.0,0.20476451873756782,target,0.0
81,3,age_bracket,7.0,0.4094779334441467,target,0.0
82,3,age_bracket,8.0,0.3069924490113654,target,0.0
83,3,age_bracket,9.0,0.009008097165991902,target,0.0
84,3,Test Submitter,0.0,0.9151822332709045,target,0.0
85,3,Test Submitter,1.0,0.46288686665797807,target,0.0
86,3,Source Machine Prediction,,0.7239273793047302,source,
87,4,Sex,0.0,0.829004028337269,source,
88,4,Sex,1.0,0.6420141620771046,source,
89,4,age_bracket,0.0,0.026706231454005934,source,
90,4,age_bracket,1.0,0.0,source,
91,4,age_bracket,2.0,0.09350935093509351,source,
92,4,age_bracket,3.0,0.2852112676056338,source,
93,4,age_bracket,4.0,0.11339475549255847,source,
94,4,age_bracket,5.0,0.28443560417702635,source,
95,4,age_bracket,6.0,0.1885796545105566,source,
96,4,age_bracket,7.0,0.4460934089917067,source,
97,4,age_bracket,8.0,0.28215488215488216,source,
98,4,age_bracket,9.0,0.012195121951219513,source,
99,4,Test Submitter,0.0,0.9065270935960591,source,
100,4,Test Submitter,1.0,0.5267835695411962,source,
101,4,Sex,0.0,0.8345680750045488,target,0.0
102,4,Sex,1.0,0.6491416145082681,target,0.0
103,4,age_bracket,0.0,0.023296858453935757,target,0.0
104,4,age_bracket,1.0,0.0,target,0.0
105,4,age_bracket,2.0,0.05194675706665337,target,0.0
106,4,age_bracket,3.0,0.20875016324931436,target,0.0
107,4,age_bracket,4.0,0.09622087173501831,target,0.0
108,4,age_bracket,5.0,0.2943495235031819,target,0.0
109,4,age_bracket,6.0,0.20981708072884386,target,0.0
110,4,age_bracket,7.0,0.43678550832796226,target,0.0
111,4,age_bracket,8.0,0.2873949089210649,target,0.0
112,4,age_bracket,9.0,0.009767206477732793,target,0.0
113,4,Test Submitter,0.0,0.9185514281635019,target,0.0
114,4,Test Submitter,1.0,0.4561289184983019,target,0.0
115,4,Source Machine Prediction,,0.7254742326793129,source,
116,5,Sex,0.0,0.8302223442217952,source,
117,5,Sex,1.0,0.635981588953372,source,
118,5,age_bracket,0.0,0.01929260450160772,source,
119,5,age_bracket,1.0,0.0,source,
120,5,age_bracket,2.0,0.0774487471526196,source,
121,5,age_bracket,3.0,0.2851063829787234,source,
122,5,age_bracket,4.0,0.11687413554633472,source,
123,5,age_bracket,5.0,0.2794561933534743,source,
124,5,age_bracket,6.0,0.18502622794468288,source,
125,5,age_bracket,7.0,0.4116441164411644,source,
126,5,age_bracket,8.0,0.27167630057803466,source,
127,5,age_bracket,9.0,0.015479876160990712,source,
128,5,Test Submitter,0.0,0.898960244648318,source,
129,5,Test Submitter,1.0,0.5284810126582279,source,
130,5,Sex,0.0,0.8343689600362526,target,0.0
131,5,Sex,1.0,0.6517414708923033,target,0.0
132,5,age_bracket,0.0,0.02340275326509001,target,0.0
133,5,age_bracket,1.0,0.0,target,0.0
134,5,age_bracket,2.0,0.05571065357196271,target,0.0
135,5,age_bracket,3.0,0.2091593748639589,target,0.0
136,5,age_bracket,4.0,0.09649454662534712,target,0.0
137,5,age_bracket,5.0,0.3117064956197612,target,0.0
138,5,age_bracket,6.0,0.2003789421493457,target,0.0
139,5,age_bracket,7.0,0.4103429560025781,target,0.0
140,5,age_bracket,8.0,0.3121983496808345,target,0.0
141,5,age_bracket,9.0,0.010880566801619434,target,0.0
142,5,Test Submitter,0.0,0.9162950334119992,target,0.0
143,5,Test Submitter,1.0,0.46259937595351086,target,0.0
144,5,Source Machine Prediction,,0.721159325897582,source,
