(module "TSR-1-24120" (layer F.Cu)
  (descr "TSR-1-24120")
  (tags "Undefined or Miscellaneous")
  (fp_text reference U** (at -0.321 -1.077) (layer F.SilkS)
    (effects (font (size 1.27 1.27) (thickness 0.254)))
  )
  (fp_text user %R (at -0.321 -1.077) (layer F.Fab)
    (effects (font (size 1.27 1.27) (thickness 0.254)))
  )
  (fp_text value "TSR-1-24120" (at -0.321 -1.077) (layer F.SilkS) hide
    (effects (font (size 1.27 1.27) (thickness 0.254)))
  )
  (fp_line (start -5.85 -5.6) (end 5.85 -5.6) (layer F.Fab) (width 0.254))
  (fp_line (start 5.85 -5.6) (end 5.85 2) (layer F.Fab) (width 0.254))
  (fp_line (start 5.85 2) (end -5.85 2) (layer F.Fab) (width 0.254))
  (fp_line (start -5.85 2) (end -5.85 -5.6) (layer F.Fab) (width 0.254))
  (fp_line (start -5.85 2) (end 5.85 2) (layer F.SilkS) (width 0.254))
  (fp_line (start 5.85 2) (end 5.85 -5.6) (layer F.SilkS) (width 0.254))
  (fp_line (start 5.85 -5.6) (end -5.85 -5.6) (layer F.SilkS) (width 0.254))
  (fp_line (start -5.85 -5.6) (end -5.85 2) (layer F.SilkS) (width 0.254))
  (fp_circle (center -2.955 2.633) (end -2.955 2.774) (layer F.SilkS) (width 0.254))
  (pad 1 thru_hole circle (at -2.54 0) (size 1.28 1.28) (drill 0.78) (layers *.Cu *.Mask))
  (pad 2 thru_hole circle (at 0 0) (size 1.28 1.28) (drill 0.78) (layers *.Cu *.Mask))
  (pad 3 thru_hole circle (at 2.54 0) (size 1.28 1.28) (drill 0.78) (layers *.Cu *.Mask))
  (model TSR_1-2450.stp
    (at (xyz 0 0 0))
    (scale (xyz 1 1 1))
    (rotate (xyz 0 0 0))
  )
)
