(module "DIP920W60P254L490H457Q4N" (layer F.Cu)
  (descr "HVM DIP")
  (tags "MOSFET (N-Channel)")
  (fp_text reference Q** (at 0 0) (layer F.SilkS)
    (effects (font (size 1.27 1.27) (thickness 0.254)))
  )
  (fp_text user %R (at 0 0) (layer F.Fab)
    (effects (font (size 1.27 1.27) (thickness 0.254)))
  )
  (fp_text value "DIP920W60P254L490H457Q4N" (at 0 0) (layer F.SilkS) hide
    (effects (font (size 1.27 1.27) (thickness 0.254)))
  )
  (fp_line (start -6.245 -2.75) (end 6.245 -2.75) (layer F.CrtYd) (width 0.05))
  (fp_line (start 6.245 -2.75) (end 6.245 2.75) (layer F.CrtYd) (width 0.05))
  (fp_line (start 6.245 2.75) (end -6.245 2.75) (layer F.CrtYd) (width 0.05))
  (fp_line (start -6.245 2.75) (end -6.245 -2.75) (layer F.CrtYd) (width 0.05))
  (fp_line (start -3.145 -2.5) (end 3.145 -2.5) (layer F.Fab) (width 0.1))
  (fp_line (start 3.145 -2.5) (end 3.145 2.5) (layer F.Fab) (width 0.1))
  (fp_line (start 3.145 2.5) (end -3.145 2.5) (layer F.Fab) (width 0.1))
  (fp_line (start -3.145 2.5) (end -3.145 -2.5) (layer F.Fab) (width 0.1))
  (fp_line (start -3.145 -1.23) (end -1.875 -2.5) (layer F.Fab) (width 0.1))
  (fp_line (start -5.202 -2.5) (end 3.145 -2.5) (layer F.SilkS) (width 0.2))
  (fp_line (start -3.145 2.5) (end 3.145 2.5) (layer F.SilkS) (width 0.2))
  (pad 1 thru_hole circle (at -4.602 -1.27) (size 1.2 1.2) (drill 0.8) (layers *.Cu *.Mask))
  (pad 2 thru_hole circle (at -4.602 1.27) (size 1.2 1.2) (drill 0.8) (layers *.Cu *.Mask))
  (pad 3 thru_hole circle (at 4.602 1.27) (size 1.2 1.2) (drill 0.8) (layers *.Cu *.Mask))
  (pad 4 thru_hole circle (at 4.602 -1.27) (size 1.2 1.2) (drill 0.8) (layers *.Cu *.Mask))
  (model IRLD110.stp
    (at (xyz 0 0 0))
    (scale (xyz 1 1 1))
    (rotate (xyz 0 0 0))
  )
)
