Well_Letter,Well_Number,PEG_Concentration,Protein,Wavelength [nm],345,350,355
G,4,0.0,Control,Sample X41,16865,16273,15692
H,4,0.0,Control,Sample X45,15779,15278,14940
C,4,0.0,HzATNP 1uM,Sample X25,211804,178511,144932
D,4,0.0,HzATNP 1uM,Sample X29,211512,177917,144914
E,4,0.0,HzATNP 1uM,Sample X33,192552,162504,131966
F,4,0.0,HzATNP 1uM,Sample X37,205172,172541,140160
I,4,3.0,Control,Sample X49,15330,14857,14446
J,4,3.0,Control,Sample X53,16491,15753,15195
O,3,3.0,HzATNP 1uM,Sample X72,251396,211770,172054
P,3,3.0,HzATNP 1uM,Sample X76,237431,200940,162714
A,4,3.0,HzATNP 1uM,Sample X17,268687,226963,184321
B,4,3.0,HzATNP 1uM,Sample X21,263285,222330,179704
K,4,4.0,Control,Sample X57,17617,16961,16352
L,4,4.0,Control,Sample X61,16215,15740,15122
K,3,4.0,HzATNP 1uM,Sample X56,268080,226034,183059
L,3,4.0,HzATNP 1uM,Sample X60,258766,219098,177354
M,3,4.0,HzATNP 1uM,Sample X64,261129,219573,176998
N,3,4.0,HzATNP 1uM,Sample X68,256459,216579,175545
M,4,5.0,Control,Sample X65,18056,17393,16655
N,4,5.0,Control,Sample X69,16717,16190,15604
G,3,5.0,HzATNP 1uM,Sample X40,222057,187545,152275
H,3,5.0,HzATNP 1uM,Sample X44,219531,184492,150173
I,3,5.0,HzATNP 1uM,Sample X48,243314,205074,165568
J,3,5.0,HzATNP 1uM,Sample X52,234190,196442,159768
O,4,6.0,Control,Sample X73,17666,16685,15938
P,4,6.0,Control,Sample X77,17882,16984,16050
C,3,6.0,HzATNP 1uM,Sample X24,214531,180595,146777
D,3,6.0,HzATNP 1uM,Sample X28,212526,179245,145797
E,3,6.0,HzATNP 1uM,Sample X32,195228,165413,134295
F,3,6.0,HzATNP 1uM,Sample X36,197004,166510,135932
A,5,6.5,Control,Sample X18,16621,16018,15394
B,5,6.5,Control,Sample X22,17104,16384,15809
O,2,6.5,HzATNP 1uM,Sample X71,219786,186000,150798
P,2,6.5,HzATNP 1uM,Sample X75,201487,170401,137862
A,3,6.5,HzATNP 1uM,Sample X16,207124,174460,141821
B,3,6.5,HzATNP 1uM,Sample X20,198711,167528,136139
C,5,7.0,Control,Sample X26,17410,16720,16074
D,5,7.0,Control,Sample X30,17275,16591,15901
K,2,7.0,HzATNP 1uM,Sample X55,113353,96955,79811
L,2,7.0,HzATNP 1uM,Sample X59,115115,98361,80520
M,2,7.0,HzATNP 1uM,Sample X63,118163,100693,82434
N,2,7.0,HzATNP 1uM,Sample X67,110091,93275,77119
E,5,7.5,Control,Sample X34,16666,16050,15441
F,5,7.5,Control,Sample X38,16746,16134,15491
G,2,7.5,HzATNP 1uM,Sample X39,110919,94368,77695
H,2,7.5,HzATNP 1uM,Sample X43,106668,90987,74831
I,2,7.5,HzATNP 1uM,Sample X47,98735,84188,69922
J,2,7.5,HzATNP 1uM,Sample X51,92160,78496,65370
G,5,8.0,Control,Sample X42,17357,16636,15918
H,5,8.0,Control,Sample X46,17171,16453,15780
C,2,8.0,HzATNP 1uM,Sample X23,105603,89932,73977
D,2,8.0,HzATNP 1uM,Sample X27,112558,95384,78589
E,2,8.0,HzATNP 1uM,Sample X31,117860,100212,82147
F,2,8.0,HzATNP 1uM,Sample X35,126639,107444,88208
I,5,9.0,Control,Sample X50,16533,15878,15252
J,5,9.0,Control,Sample X54,16773,16123,15391
N,1,9.0,HzATNP 1uM,Sample X13,73229,62794,51917
O,1,9.0,HzATNP 1uM,Sample X14,63187,54418,45886
A,2,9.0,HzATNP 1uM,Sample X15,53192,45797,38885
B,2,9.0,HzATNP 1uM,Sample X19,47998,42078,35902
K,5,10.0,Control,Sample X58,22095,21267,20034
L,5,10.0,Control,Sample X62,18755,17977,17166
J,1,10.0,HzATNP 1uM,Sample X9,53876,46330,38955
K,1,10.0,HzATNP 1uM,Sample X10,71017,60612,50523
L,1,10.0,HzATNP 1uM,Sample X11,71853,61883,51081
M,1,10.0,HzATNP 1uM,Sample X12,71121,60922,50728
M,5,12.0,Control,Sample X66,20217,19317,18242
N,5,12.0,Control,Sample X70,18302,17576,16687
F,1,12.0,HzATNP 1uM,Sample X5,25220,22838,20524
G,1,12.0,HzATNP 1uM,Sample X6,19442,18205,17131
H,1,12.0,HzATNP 1uM,Sample X7,22365,20490,18682
I,1,12.0,HzATNP 1uM,Sample X8,19546,18345,17104
O,5,14.0,Control,Sample X74,21682,20539,19343
P,5,14.0,Control,Sample X78,20141,19175,18013
B,1,14.0,HzATNP 1uM,Sample X1,23908,22446,21082
C,1,14.0,HzATNP 1uM,Sample X2,19955,18885,17710
D,1,14.0,HzATNP 1uM,Sample X3,21607,20220,18772
E,1,14.0,HzATNP 1uM,Sample X4,21762,20336,18985
