User: USER,Path: C:\Program Files (x86)\BMG\CLARIOstar\User\Data\,Test run no.: 11318
Test name: MO428_IntrinsicFluor384_SPECTRA,Date: 12/08/2020,Time: 17:04:42

ID1: Intrin_Fluo_20_08_12_HzATNP_pH6,
Fluorescence (FI) spectrum

Well Row,Well Col,Content,Raw Data (Em Spectrum),Raw Data (Em Spectrum),Raw Data (Em Spectrum),
,,Wavelength [nm],345,350,355,
A,2,Sample X15,53192,45797,38885,
A,3,Sample X16,207124,174460,141821,
A,4,Sample X17,268687,226963,184321,
A,5,Sample X18,16621,16018,15394,
B,1,Sample X1,23908,22446,21082,
B,2,Sample X19,47998,42078,35902,
B,3,Sample X20,198711,167528,136139,
B,4,Sample X21,263285,222330,179704,
B,5,Sample X22,17104,16384,15809,
C,1,Sample X2,19955,18885,17710,
C,2,Sample X23,105603,89932,73977,
C,3,Sample X24,214531,180595,146777,
C,4,Sample X25,211804,178511,144932,
C,5,Sample X26,17410,16720,16074,
D,1,Sample X3,21607,20220,18772,
D,2,Sample X27,112558,95384,78589,
D,3,Sample X28,212526,179245,145797,
D,4,Sample X29,211512,177917,144914,
D,5,Sample X30,17275,16591,15901,
E,1,Sample X4,21762,20336,18985,
E,2,Sample X31,117860,100212,82147,
E,3,Sample X32,195228,165413,134295,
E,4,Sample X33,192552,162504,131966,
E,5,Sample X34,16666,16050,15441,
F,1,Sample X5,25220,22838,20524,
F,2,Sample X35,126639,107444,88208,
F,3,Sample X36,197004,166510,135932,
F,4,Sample X37,205172,172541,140160,
F,5,Sample X38,16746,16134,15491,
G,1,Sample X6,19442,18205,17131,
G,2,Sample X39,110919,94368,77695,
G,3,Sample X40,222057,187545,152275,
G,4,Sample X41,16865,16273,15692,
G,5,Sample X42,17357,16636,15918,
H,1,Sample X7,22365,20490,18682,
H,2,Sample X43,106668,90987,74831,
H,3,Sample X44,219531,184492,150173,
H,4,Sample X45,15779,15278,14940,
H,5,Sample X46,17171,16453,15780,
I,1,Sample X8,19546,18345,17104,
I,2,Sample X47,98735,84188,69922,
I,3,Sample X48,243314,205074,165568,
I,4,Sample X49,15330,14857,14446,
I,5,Sample X50,16533,15878,15252,
J,1,Sample X9,53876,46330,38955,
J,2,Sample X51,92160,78496,65370,
J,3,Sample X52,234190,196442,159768,
J,4,Sample X53,16491,15753,15195,
J,5,Sample X54,16773,16123,15391,
K,1,Sample X10,71017,60612,50523,
K,2,Sample X55,113353,96955,79811,
K,3,Sample X56,268080,226034,183059,
K,4,Sample X57,17617,16961,16352,
K,5,Sample X58,22095,21267,20034,
L,1,Sample X11,71853,61883,51081,
L,2,Sample X59,115115,98361,80520,
L,3,Sample X60,258766,219098,177354,
L,4,Sample X61,16215,15740,15122,
L,5,Sample X62,18755,17977,17166,
M,1,Sample X12,71121,60922,50728,
M,2,Sample X63,118163,100693,82434,
M,3,Sample X64,261129,219573,176998,
M,4,Sample X65,18056,17393,16655,
M,5,Sample X66,20217,19317,18242,
N,1,Sample X13,73229,62794,51917,
N,2,Sample X67,110091,93275,77119,
N,3,Sample X68,256459,216579,175545,
N,4,Sample X69,16717,16190,15604,
N,5,Sample X70,18302,17576,16687,
O,1,Sample X14,63187,54418,45886,
O,2,Sample X71,219786,186000,150798,
O,3,Sample X72,251396,211770,172054,
O,4,Sample X73,17666,16685,15938,
O,5,Sample X74,21682,20539,19343,
P,2,Sample X75,201487,170401,137862,
P,3,Sample X76,237431,200940,162714,
P,4,Sample X77,17882,16984,16050,
P,5,Sample X78,20141,19175,18013,
