Assay 	Step Number 	Step Name 	Step Time 	Step Type Name 	Sample Location
1	1	Baseline2	120.0000031	Baseline	p1A1
1	2	Loading	249.9999878	Loading	p1A2
1	3	Baseline	59.99898071	Baseline	p1A3
1	4	Loading2	299.9999878	Loading	p1A4
1	5	Baseline	59.99998779	Baseline	p1A1
1	6	Loading3	20.00102539	Loading	p1A5
1	7	Baseline	59.99998779	Baseline	p1A1
1	8	Baseline3	270.0009644	Baseline	p1A6
1	9	Association	300.0000488	Association	p1A7
1	10	Dissociation	60.00004883	Dissociation	p1A12
1	11	Association2	250.0000488	Association	p1A8
1	12	Dissociation	60.00004883	Dissociation	p1A12
1	13	Association3	200.0000488	Association	p1A9
1	14	Dissociation	60.00102539	Dissociation	p1A12
1	15	Association4	150.0000488	Association	p1A10
1	16	Dissociation	60.00004883	Dissociation	p1A12
1	17	Association5	100.0000488	Association	p1A11
1	18	Dissociation2	600.0000488	Dissociation	p1A12
