Order	Fit Range	RMSE	Covariance	Coefficients
2	positive	1.0702324467	1.156851464890E+02	2.381893949021E+00	-4.011896340607E+00	-2.152114760595E-01
2	negative	1.4011939074	3.946322175842E+02	1.106796394277E+00	6.691111850868E-01	-1.047972997375E-01
4	positive	0.1554172175	2.439605660640E+00	-1.214246028922E+00	1.444890558488E+00	-2.096400330966E+00	2.271996854682E-01	-8.884529689357E-03
4	negative	0.4471969500	4.019700752282E+01	-2.336300659786E+00	-1.436675910663E+00	-3.721109719302E-01	-9.253309533090E-03	-1.498128290973E-05
6	positive	0.0985792654	9.815050292211E-01	-1.392040371071E+00	1.819660007306E+00	-2.160597264421E+00	1.541279486275E-01	1.967921781505E-02	-3.579510342490E-03	1.486891098890E-04
6	negative	0.1390939830	3.888774358115E+00	-5.489632466017E-01	1.745869643869E+00	9.629212486910E-01	2.160623058213E-01	1.792295581004E-02	6.735328283413E-04	9.610275390600E-06
8	positive	0.0237573960	5.700580038821E-02	-1.006958861433E+00	-9.976221299404E-01	2.366257713220E+00	-2.845508280135E+00	1.033878971769E+00	-1.940556183978E-01	2.026347831280E-02	-1.117682686389E-03	2.542300742822E-05
8	negative	0.0619047140	7.702709175230E-01	-1.122518419970E+00	-3.346246565417E-01	-7.867468735839E-01	-3.973089816263E-01	-9.219084039015E-02	-1.032311427341E-02	-6.082962219057E-04	-1.827485273211E-05	-2.212964384488E-07
10	positive	0.0173531422	3.041428603076E-02	-1.004274762400E+00	-9.261066451566E-01	1.941279267646E+00	-2.128076614845E+00	4.764590217841E-01	4.307747194099E-02	-3.944302313345E-02	8.015730770781E-03	-8.079039225975E-04	4.168668857106E-05	-8.796452386304E-07
10	negative	0.0397548936	3.176707640756E-01	-1.109741478809E+00	-1.107799274601E-01	-3.211851627955E-01	-5.004853246270E-02	3.444369578427E-02	1.560314901682E-02	2.574009165610E-03	2.208314566420E-04	1.054549268841E-05	2.666757255847E-07	2.792556086121E-09
12	positive	0.0044942171	2.039996677025E-03	-1.059407644107E+00	2.265487174342E-01	-2.517203801426E+00	4.958585965531E+00	-5.503360238531E+00	3.072473884569E+00	-1.024081349113E+00	2.205254734237E-01	-3.160346069981E-02	3.004014058209E-03	-1.822883407524E-04	6.401154867162E-06	-9.905304012679E-08
12	negative	0.0207997770	8.695877493147E-02	-9.905650959946E-01	8.285724241151E-01	1.291975882211E+00	1.112118590666E+00	4.788272246404E-01	1.167589424677E-01	1.713261891867E-02	1.582318515343E-03	9.334999223838E-05	3.448743448243E-06	7.435084725650E-08	7.788255527096E-10	2.048405320538E-12
14	positive	0.0033026577	1.101662239347E-03	-1.054974619334E+00	3.885782634009E-02	-1.352333320397E+00	2.072841025920E+00	-1.726159863501E+00	8.556213550327E-02	5.148505862109E-01	-3.197269620927E-01	1.009084669819E-01	-1.993226058364E-02	2.606821690374E-03	-2.267079518295E-04	1.264928758316E-05	-4.107051209820E-07	5.908855469020E-09
14	negative	0.0084977622	1.451460544216E-02	-1.074886567866E+00	-2.231142331935E-01	-1.413364933089E+00	-1.814485950914E+00	-1.229302065239E+00	-4.927195028789E-01	-1.256903761166E-01	-2.135679137011E-02	-2.492707751940E-03	-2.030568400920E-04	-1.154665286956E-05	-4.498658665604E-07	-1.145784495106E-08	-1.719968265898E-10	-1.154640616966E-12
16	positive	0.0009923125	9.945274969229E-05	-1.048245909080E+00	-3.328922432689E-01	1.379025484586E+00	-5.942686805190E+00	1.081616787348E+01	-1.192535339080E+01	8.133080519028E+00	-3.680960429519E+00	1.164810540340E+00	-2.659410726458E-01	4.449553073542E-02	-5.469672552166E-03	4.888803835929E-04	-3.093207941125E-05	1.313695167078E-06	-3.360455908812E-08	3.914068246117E-10
16	negative	0.0041750118	3.503582657755E-03	-1.045281692715E+00	3.356795039415E-01	5.916191603221E-01	1.180835974647E+00	1.188865083293E+00	7.094078462850E-01	2.715024761633E-01	7.014021336395E-02	1.265337965152E-02	1.631091312721E-03	1.522062956244E-04	1.030901910426E-05	5.020956594003E-07	1.714348407049E-08	3.896250027262E-10	5.295254873391E-12	3.256675336383E-14
