Order	Fit Range	RMSE	Covariance	Coefficients
2	positive	1.1773515667	1.400018278714E+02	3.499463607950E+00	-6.357404108739E+00	-1.664848047965E-01
2	negative	0.1300553680	3.399794146545E+00	-5.988948405587E-01	4.504694024625E-01	-1.465426649952E-02
4	positive	0.2901113850	8.500626188853E+00	-5.490036239395E-01	2.917246062707E-02	-2.465915651176E+00	2.919190684665E-01	-1.209982648018E-02
4	negative	0.0068640965	9.470280089315E-03	-9.788117814765E-01	1.991244663864E-01	-5.125281060405E-02	-1.729515505517E-03	-2.226582620022E-05
6	positive	0.1091449369	1.203174341609E+00	-1.433761372085E+00	3.063190476770E+00	-4.818094165027E+00	1.006373315108E+00	-1.112578017432E-01	6.195030366696E-03	-1.359829654989E-04
6	negative	0.0007024234	9.917311111209E-05	-9.490755308608E-01	2.533146366617E-01	-2.795835200445E-02	2.307214416894E-03	3.085007353816E-04	1.281811309558E-05	1.893753153777E-07
8	positive	0.0532790854	2.867047549251E-01	-1.044616552644E+00	7.056863161828E-02	2.106451652747E-01	-2.475751645159E+00	1.119009508359E+00	-2.353030715685E-01	2.652894382334E-02	-1.549848125869E-03	3.689520708127E-05
8	negative	0.0001600298	5.147518168559E-06	-9.475403031703E-01	2.572888961271E-01	-2.577706548041E-02	2.701834107306E-03	3.182244661550E-04	8.141345920300E-06	-3.682166436165E-07	-2.461562621965E-08	-3.900022206772E-10
10	positive	0.0202525927	4.142691848131E-02	-8.762190069371E-01	-1.980975510140E+00	5.347757486277E+00	-7.790441344769E+00	3.996490687962E+00	-1.144926823509E+00	2.031636420833E-01	-2.286775453759E-02	1.592613347761E-03	-6.269736641084E-05	1.067871132560E-06
10	negative	0.0000868911	1.517563401013E-06	-9.480503189795E-01	2.546575706275E-01	-2.884750608983E-02	1.201361860928E-03	-6.527034689062E-05	-4.869105548190E-05	-5.478716248161E-06	-3.048370011378E-07	-9.408326849742E-09	-1.525503546266E-10	-9.941275926536E-13
12	positive	0.0120666337	1.470596854520E-02	-9.286846886331E-01	-8.027354290335E-01	5.412670837567E-01	2.455103572686E-01	-3.129971743124E+00	2.648243654895E+00	-1.092102140846E+00	2.708535422440E-01	-4.313784670850E-02	4.460332571365E-03	-2.902001082777E-04	1.081239356504E-05	-1.761101486351E-07
12	negative	0.0000835575	1.403354156663E-06	-9.479371455210E-01	2.556237151533E-01	-2.705310918962E-02	2.609474579624E-03	5.272607110796E-04	1.017417609857E-04	1.909566710501E-05	2.365992746725E-06	1.857748260742E-07	9.326807287547E-09	2.923862613525E-10	5.236668307758E-12	4.102656224534E-14
14	positive	0.0043666612	1.925840569017E-03	-9.582804069430E-01	1.856144662406E-01	-4.788304223277E+00	1.190309507091E+01	-1.671318191987E+01	1.226238065781E+01	-5.543572312595E+00	1.679451265777E+00	-3.552635571786E-01	5.334622704985E-02	-5.675021979421E-03	4.187050391037E-04	-2.039440886068E-05	5.901181136500E-07	-7.684748271022E-09
14	negative	0.0000834112	1.398443528882E-06	-9.479407451705E-01	2.555511252755E-01	-2.730158089791E-02	2.273600916249E-03	2.909757363999E-04	2.556122112920E-06	-7.771091822384E-06	-2.555506984898E-06	-4.403850259336E-07	-4.662590533546E-08	-3.206729768060E-09	-1.446869357322E-10	-4.151128483884E-12	-6.890073629775E-14	-5.047659124844E-16
16	positive	0.0029432501	8.749308869846E-04	-9.518896933090E-01	-2.083897686268E-01	-1.714688462899E+00	2.366137789798E+00	-9.537644457817E-01	-3.667999237248E+00	5.120692088834E+00	-3.286682234793E+00	1.304078124531E+00	-3.518050554009E-01	6.719625793261E-02	-9.220274836143E-03	9.053907552961E-04	-6.218992194899E-05	2.840783565174E-06	-7.757294949553E-08	9.585405255792E-10
16	negative	0.0000815100	1.335420691589E-06	-9.480134634981E-01	2.541899811402E-01	-3.215534966552E-02	-4.936504790982E-03	-5.498484374893E-03	-2.860641812057E-03	-9.490837402425E-04	-2.183525559108E-04	-3.599649687829E-05	-4.332980206255E-06	-3.842231082386E-07	-2.507228718325E-08	-1.189135359678E-09	-3.986380637908E-11	-8.951294870822E-13	-1.207701629433E-14	-7.400427133099E-17
