Order	Fit Range	RMSE	Covariance	Coefficients
2	positive	1.1518928955	1.340125815121E+02	2.538630392394E+00	-3.721280264216E+00	-2.540278683519E-01
2	negative	0.8283232577	1.379100032719E+02	1.018223907093E+00	1.027797263921E+00	-6.789093509467E-02
4	positive	0.1318564682	1.755998948877E+00	-1.223731951837E+00	1.850551890764E+00	-2.119818122496E+00	2.173340801003E-01	-8.113011040797E-03
4	negative	0.1307460315	3.435999474003E+00	-1.309120331668E+00	-4.850714656093E-01	-2.820469768347E-01	-9.593004216968E-03	-1.072500948581E-04
6	positive	0.0899821818	8.177760972935E-01	-1.062059826989E+00	9.519704794137E-01	-1.091563814968E+00	-2.306099347367E-01	8.104579771751E-02	-8.199999087811E-03	2.827180929871E-04
6	negative	0.0175553870	6.194651414237E-02	-7.527589771534E-01	5.184477279655E-01	1.447399047260E-01	6.352689088847E-02	5.811277310578E-03	2.263556170696E-04	3.296860495677E-06
8	positive	0.0222301712	4.991223175594E-02	-7.322608762402E-01	-1.381674336924E+00	2.538455880844E+00	-2.554443519494E+00	8.379648986316E-01	-1.446776060029E-01	1.406316276009E-02	-7.286220761683E-04	1.568037071954E-05
8	negative	0.0078642200	1.243103711581E-02	-8.009143365545E-01	3.233471686225E-01	-3.420746392675E-02	-3.945470006908E-03	-7.084335699527E-03	-1.133818494507E-03	-7.690778988501E-05	-2.476148149047E-06	-3.116188687353E-08
10	positive	0.0127116345	1.632015089755E-02	-7.944624845726E-01	-5.129251585911E-01	1.012647443019E-01	2.627427477563E-01	-8.672465982497E-01	4.592377452005E-01	-1.177511082121E-01	1.723222389283E-02	-1.472646464109E-03	6.860862333204E-05	-1.349167070196E-06
10	negative	0.0026985139	1.463677466600E-03	-8.229942490683E-01	2.163221729260E-01	-1.501742836491E-01	-5.539058965827E-02	-1.857967870471E-02	-2.524935744869E-03	-1.648639235675E-04	-4.479263451945E-06	3.842166060571E-08	4.866824773815E-09	7.774378938998E-11
12	positive	0.0049852275	2.510101847959E-03	-8.279880828474E-01	1.541505897947E-01	-2.375392563378E+00	4.034548885740E+00	-3.906173973825E+00	1.922693152384E+00	-5.674660701040E-01	1.083974168449E-01	-1.378260418607E-02	1.161121010214E-03	-6.231112298405E-05	1.928639995662E-06	-2.618504356328E-08
12	negative	0.0006006997	7.252886639953E-05	-8.115379631146E-01	3.112386824536E-01	2.125293068247E-02	7.529972057168E-02	3.476426764485E-02	1.058701301707E-02	1.904419249114E-03	2.122578050556E-04	1.526057791048E-05	7.131296133604E-07	2.100299169164E-08	3.550823221495E-10	2.632087594288E-12
14	positive	0.0018368419	3.407727014278E-04	-8.149188850028E-01	-3.104424937977E-01	2.383231872172E-01	-1.922318823954E+00	3.329109209262E+00	-3.420904752516E+00	2.017397678522E+00	-7.473658440645E-01	1.849288108774E-01	-3.151046678293E-02	3.722949802182E-03	-3.003019487373E-04	1.580204869316E-05	-4.893961106425E-07	6.770992261964E-09
14	negative	0.0001500473	4.525354947400E-06	-8.141917212819E-01	2.769408790310E-01	-6.964780706849E-02	-2.594036016041E-02	-2.606804815557E-02	-1.176280267495E-02	-3.489885059438E-03	-6.803908741356E-04	-8.846169337828E-05	-7.827177077855E-06	-4.747723035257E-07	-1.948666783792E-08	-5.183813712802E-10	-8.078733834802E-12	-5.606222902889E-14
16	positive	0.0010855059	1.190105250032E-04	-8.128942883414E-01	-4.076820617540E-01	8.889371182552E-01	-3.646989408584E+00	5.729092057490E+00	-5.419694577407E+00	3.085190856224E+00	-1.125292396397E+00	2.733191641401E-01	-4.428638826206E-02	4.510994592201E-03	-2.139118832817E-04	-9.991297930027E-06	2.394667745817E-06	-1.733932010121E-07	6.193411773259E-09	-9.178406038358E-11
16	negative	0.0000588021	6.949979201069E-07	-8.144489179060E-01	2.730773250346E-01	-8.089853628766E-02	-3.917910531081E-02	-3.403383445825E-02	-1.443153017422E-02	-3.962725038226E-03	-6.987983060046E-04	-7.708766976399E-05	-4.766970519619E-06	-5.663427959542E-08	1.717789046797E-08	1.655617863026E-09	7.903911154146E-11	2.211680756676E-12	3.468537277206E-14	2.368858391225E-16
