Order	Fit Range	RMSE	Covariance	Coefficients
2	positive	0.8549553841	7.382581958700E+01	1.796368167403E+00	-3.492629782761E+00	-1.443051302188E-01
2	negative	1.0030386800	2.022234052950E+02	9.918959014882E-01	9.067038128718E-01	-6.975161616500E-02
4	positive	0.1283012338	1.662581867153E+00	-1.112630875244E+00	9.692619769120E-01	-1.701685453514E+00	1.908799067692E-01	-7.598593414275E-03
4	negative	0.2338689650	1.099363325534E+01	-1.843509313196E+00	-9.616869140766E-01	-3.401070591839E-01	-1.262969196275E-02	-1.580847097963E-04
6	positive	0.0752540695	5.719806724265E-01	-1.274704352522E+00	1.328667403015E+00	-1.791110377356E+00	1.406598962303E-01	1.477090099366E-02	-2.898002508370E-03	1.222249650698E-04
6	negative	0.0550214283	6.084988716355E-01	-8.438739741146E-01	8.757868732823E-01	4.567424353913E-01	1.267332045183E-01	1.137204174061E-02	4.513931871023E-04	6.740894880097E-06
8	positive	0.0157082938	2.492179993613E-02	-9.808162762089E-01	-8.096441842762E-01	1.626933814759E+00	-2.112100971486E+00	7.721592188417E-01	-1.442967953958E-01	1.496019990090E-02	-8.189513026795E-04	1.849501637150E-05
8	negative	0.0310175093	1.933792620701E-01	-9.734773715895E-01	3.415066261845E-01	-3.929622965929E-02	-6.205056434918E-02	-2.497812277127E-02	-3.406013809243E-03	-2.218705799985E-04	-7.088195834472E-06	-8.953212977380E-08
10	positive	0.0111825515	1.262999522374E-02	-9.845068481210E-01	-6.891377869999E-01	1.146929812942E+00	-1.414155452167E+00	2.717787911684E-01	5.804499252496E-02	-3.423273119936E-02	6.515328444510E-03	-6.376497361815E-04	3.231697029673E-05	-6.733924520052E-07
10	negative	0.0145800803	4.272832732531E-02	-1.058786518682E+00	-7.672301365671E-02	-4.989725729129E-01	-2.700760972757E-01	-7.289135366571E-02	-9.513452657099E-03	-6.530278162208E-04	-2.176709029308E-05	-1.358649599720E-07	1.094419729687E-08	2.176202931686E-10
12	positive	0.0026126792	6.894353710409E-04	-1.019787863602E+00	4.355577133958E-02	-1.672068964457E+00	3.042615246905E+00	-3.467992494721E+00	1.941561058494E+00	-6.426539278134E-01	1.369706160750E-01	-1.941133723637E-02	1.824894698879E-03	-1.095840827480E-04	3.810649197024E-06	-5.843471767567E-08
12	negative	0.0045471434	4.155979202429E-03	-9.955729757788E-01	4.542975148583E-01	4.727499838659E-01	4.809989870021E-01	2.382249374758E-01	6.818421229289E-02	1.182224014507E-02	1.309689183290E-03	9.532177672329E-05	4.554219060528E-06	1.378538341147E-07	2.401643522525E-09	1.836770362851E-11
14	positive	0.0017851963	3.218794681415E-04	-1.016179543678E+00	-1.005485126247E-01	-8.040566850995E-01	9.428921473224E-01	-7.745051107615E-01	-1.514658655007E-01	4.192864859795E-01	-2.307832859402E-01	6.969759945039E-02	-1.343051057914E-02	1.727178135002E-03	-1.483220452093E-04	8.193040356169E-06	-2.638268208609E-07	3.769327950942E-09
14	negative	0.0018567596	6.929588938998E-04	-1.013773061486E+00	2.148684027080E-01	-1.708690642952E-01	-2.453717646585E-01	-2.037934709800E-01	-9.621058715076E-02	-2.832820423663E-02	-5.411154644922E-03	-6.943773220378E-04	-6.117762283734E-05	-3.718467129081E-06	-1.535297331752E-07	-4.117364682006E-09	-6.475694926604E-11	-4.536774943216E-13
16	positive	0.0005155276	2.684255839312E-05	-1.012606160523E+00	-2.962081498436E-01	6.258096371093E-01	-3.230954352114E+00	5.720489995617E+00	-6.335126993010E+00	4.317296817937E+00	-1.939374940264E+00	6.067343077726E-01	-1.366861481754E-01	2.254688610757E-02	-2.731874396435E-03	2.406975713379E-04	-1.501635308216E-05	6.290597993697E-07	-1.587857492048E-08	1.825736754671E-10
16	negative	0.0010983364	2.424758243230E-04	-1.015269397312E+00	1.974096552809E-01	-2.050889123628E-01	-2.576543401830E-01	-1.840878340659E-01	-7.236295141430E-02	-1.599873876674E-02	-1.585951217003E-03	9.576510121089E-05	5.281923811636E-05	8.036243453998E-06	7.188064685886E-07	4.213464868353E-08	1.645081039464E-09	4.141688648788E-11	6.104198832924E-13	4.010622769851E-15
