Order	Fit Range	RMSE	Covariance	Coefficients
2	positive	0.0097798248	9.660142228056E-03	-1.207183378720E+00	-2.128848621531E-01	-2.265569592451E-02
2	negative	0.2614545529	1.374005513370E+01	-4.297351501413E-01	7.842290844184E-01	-1.863117688583E-02
4	positive	0.0004650906	2.184723243338E-05	-1.222407182990E+00	-2.010526178070E-01	-2.221204067663E-02	-7.112027285216E-04	5.949598882714E-05
4	negative	0.0117570341	2.778379825069E-02	-1.272145644479E+00	1.913687344583E-01	-1.130765001947E-01	-5.160952599386E-03	-8.794989184428E-05
6	positive	0.0001223568	1.512090542372E-06	-1.221247806502E+00	-2.046207822167E-01	-1.983845780232E-02	-1.271553701684E-03	1.053048350646E-04	2.521526437395E-07	-1.271844259987E-07
6	negative	0.0053174315	5.683290533023E-03	-1.238115449485E+00	2.665894573767E-01	-7.489655806761E-02	2.523029932883E-03	6.344366846385E-04	3.181864507992E-05	5.303462710986E-07
8	positive	0.0001215389	1.491941437998E-06	-1.221197491364E+00	-2.050333065812E-01	-1.910845689375E-02	-1.801005976407E-03	3.004630190451E-04	-3.958559164771E-05	4.434251777666E-06	-2.742616490882E-07	6.739282522946E-09
8	negative	0.0007025968	9.922210173013E-05	-1.217876591963E+00	3.298417603004E-01	-2.910077860349E-02	1.621917613072E-02	2.703716373450E-03	2.024788368383E-04	8.241187205319E-06	1.762773453983E-07	1.548821053125E-09
10	positive	0.0001207158	1.471803309183E-06	-1.221232802026E+00	-2.045011456908E-01	-2.068162803229E-02	9.835161123173E-05	-8.932515223202E-04	3.973851443732E-04	-9.378465930149E-05	1.346584771871E-05	-1.159193592149E-06	5.491734955143E-08	-1.101353922329E-09
10	negative	0.0001293565	3.363354586689E-06	-1.221248698636E+00	3.109341296897E-01	-5.311761058605E-02	3.337646084531E-03	-9.507576327541E-04	-4.075517665382E-04	-5.475013957748E-05	-3.895453352710E-06	-1.588592382840E-07	-3.521770128241E-09	-3.303440285876E-11
12	positive	0.0001091068	1.202334034727E-06	-1.221403631099E+00	-2.007087559675E-01	-3.602688756439E-02	2.556498353886E-02	-2.332082675572E-02	1.225586302354E-02	-4.117505825451E-03	9.203642030526E-04	-1.384633215399E-04	1.386074597706E-05	-8.853374942619E-07	3.265309231368E-08	-5.291679686070E-10
12	negative	0.0000702290	9.913539767530E-07	-1.221504774675E+00	3.091060338235E-01	-5.590976941719E-02	1.622380840966E-03	-1.467695270038E-03	-4.852814038256E-04	-5.842929073286E-05	-3.282466486434E-06	-3.748895773001E-08	6.223603279264E-09	3.920915528527E-10	9.874789557138E-12	9.595753470471E-14
14	positive	0.0000768080	5.958466919826E-07	-1.221622395342E+00	-1.929432801638E-01	-7.967309784578E-02	1.249514372771E-01	-1.439345607374E-01	1.012606759889E-01	-4.713654544687E-02	1.515099331280E-02	-3.440214556180E-03	5.562939485248E-04	-6.368099327434E-05	5.042599790069E-06	-2.627040780295E-07	8.100021730094E-09	-1.119819299626E-10
14	negative	0.0000578789	6.733444364232E-07	-1.221339679088E+00	3.111240279555E-01	-5.081042605494E-02	7.039149907213E-03	1.634046200106E-03	5.993552280837E-04	1.903576915936E-04	3.577506727863E-05	4.259739197789E-06	3.405315868869E-07	1.868463843104E-08	6.980901562906E-10	1.703343187701E-11	2.453215505782E-13	1.584161304258E-15
16	positive	0.0000399149	1.609127573318E-07	-1.221769591358E+00	-1.845333267611E-01	-1.426760073657E-01	3.133487492423E-01	-4.444035373332E-01	3.946877838831E-01	-2.370488109990E-01	1.007121665494E-01	-3.111536278800E-02	7.101237459485E-03	-1.204460959448E-03	1.513417293473E-04	-1.389227986025E-05	9.049929863497E-07	-3.961706265723E-08	1.044818832916E-09	-1.254262747134E-11
16	negative	0.0000568144	6.488019445293E-07	-1.221382132235E+00	3.103147182694E-01	-5.373537107868E-02	2.640637086868E-03	-1.938922131169E-03	-1.187279572113E-03	-4.032640047044E-04	-1.017021688936E-04	-1.861422409614E-05	-2.443031919317E-06	-2.310026870552E-07	-1.578108944827E-08	-7.729902767740E-10	-2.650349819982E-11	-6.045254500364E-13	-8.245034582764E-15	-5.089874060764E-17
