Order	Fit Range	RMSE	Covariance	Coefficients
2	positive	0.9980838199	1.006133024590E+02	1.986415251735E+00	-3.782599925180E+00	-1.866820376759E-01
2	negative	0.0956135176	1.837530892847E+00	-9.552591796958E-01	3.721602277403E-01	-1.301663781650E-02
4	positive	0.1490403348	2.243515160030E+00	-1.388440768092E+00	1.366792262958E+00	-1.973290218225E+00	2.174331081156E-01	-8.582417463980E-03
4	negative	0.0053925386	5.844974066252E-03	-1.220921976973E+00	2.019104469431E-01	-3.654885184371E-02	-1.003918734380E-03	-9.591742741662E-06
6	positive	0.0953769513	9.187730476516E-01	-1.513813567579E+00	1.538892199915E+00	-1.858294702586E+00	8.090749660757E-02	3.058416436571E-02	-4.416944997458E-03	1.739075633547E-04
6	negative	0.0002266541	1.032579255509E-05	-1.198901238530E+00	2.405290243963E-01	-2.061696268354E-02	1.634757154703E-03	1.960036737529E-04	7.529771999291E-06	1.043497940937E-07
8	positive	0.0215072780	4.671886371454E-02	-1.144352214722E+00	-1.141973831914E+00	2.415895059613E+00	-2.728511245140E+00	9.724221147135E-01	-1.797152218510E-01	1.850920182124E-02	-1.008435098429E-03	2.268838952895E-05
8	negative	0.0001013695	2.065429380279E-06	-1.198872433085E+00	2.401702186781E-01	-2.125603895726E-02	1.303200583944E-03	1.187240457438E-04	-1.828797405143E-06	-5.071654517694E-07	-2.044638353720E-08	-2.742999831376E-10
10	positive	0.0156802485	2.483288955227E-02	-1.162195410923E+00	-8.168699634702E-01	1.347644509969E+00	-1.336217047329E+00	4.392692728067E-02	1.767731123462E-01	-6.483420696924E-02	1.104260950890E-02	-1.029175839711E-03	5.076687912360E-05	-1.040013024224E-06
10	negative	0.0000923661	1.714830443562E-06	-1.198962978451E+00	2.397741287350E-01	-2.162627217080E-02	1.176156735153E-03	1.032989348331E-04	-8.931824233110E-07	-4.013018469366E-08	3.423588355489E-08	2.867680525794E-09	9.119279112836E-11	1.068860796273E-12
12	positive	0.0042690641	1.840715771795E-03	-1.210624743433E+00	1.841258589232E-01	-2.488981876266E+00	4.705970354317E+00	-5.005650574242E+00	2.709031197809E+00	-8.790629855413E-01	1.847688036353E-01	-2.589797895628E-02	2.411817048945E-03	-1.436063790635E-04	4.954910756935E-06	-7.542893562140E-08
12	negative	0.0000911754	1.670903735852E-06	-1.198901429307E+00	2.402782614185E-01	-2.072584901252E-02	1.854428692300E-03	3.765247095210E-04	6.528950876043E-05	1.023465612535E-05	1.090663070706E-06	7.551423405345E-08	3.390224440080E-09	9.582193886367E-11	1.555220089506E-12	1.107786678300E-14
14	positive	0.0027295488	7.524939833129E-04	-1.203074162336E+00	-1.045101379504E-01	-7.919731480924E-01	6.832273750601E-01	6.324211128013E-02	-1.167109778836E+00	1.059141806184E+00	-4.775730638069E-01	1.326453190749E-01	-2.442734195964E-02	3.054437924947E-03	-2.573867728796E-04	1.402659742468E-05	-4.471324296114E-07	6.338474438741E-09
14	negative	0.0000899599	1.626651028509E-06	-1.198964246218E+00	2.394437826251E-01	-2.298616145215E-02	-7.142928401492E-04	-1.196854504949E-03	-5.235075185777E-04	-1.344162679159E-04	-2.325880669456E-05	-2.800913687829E-06	-2.372638350919E-07	-1.409221981538E-08	-5.748490698213E-10	-1.534599886878E-11	-2.415060207672E-13	-1.699033126988E-15
16	positive	0.0009954770	1.000882928207E-04	-1.197910730715E+00	-3.842433043406E-01	1.239123859196E+00	-5.207332713863E+00	9.167343458791E+00	-9.771994878184E+00	6.441235751218E+00	-2.816892575995E+00	8.612565652639E-01	-1.900026379779E-01	3.072182135334E-02	-3.650247254134E-03	3.154086098488E-04	-1.929612409687E-05	7.925437705336E-07	-1.960957370112E-08	2.209572493669E-10
16	negative	0.0000832397	1.392700011457E-06	-1.199106855892E+00	2.367955619358E-01	-3.237336251146E-02	-1.458136204954E-02	-1.227233622655E-02	-5.972650923957E-03	-1.916890227895E-03	-4.298907532955E-04	-6.947965431488E-05	-8.237926222620E-06	-7.220243896710E-07	-4.668346262722E-08	-2.197621300170E-09	-7.321415112979E-11	-1.635307680618E-12	-2.196235366210E-14	-1.340369325087E-16
