Order	Fit Range	RMSE	Covariance	Coefficients
2	positive	1.2219600356	1.508118191815E+02	2.292039868324E+00	-3.367078106330E+00	-2.672815921546E-01
2	negative	1.4297871892	4.109025726716E+02	1.601503973449E+00	9.551080354069E-01	-9.538741887381E-02
4	positive	0.1557414580	2.449795575760E+00	-1.639234854889E+00	2.399248915940E+00	-2.175312979250E+00	2.188283377893E-01	-7.997635610959E-03
4	negative	0.3971662343	3.170594455076E+01	-2.369652342250E+00	-1.652711208055E+00	-4.706795542997E-01	-1.735378896890E-02	-2.116648603266E-04
6	positive	0.0941906309	8.960593705819E-01	-1.247524004879E+00	6.163233026639E-01	-3.694461662726E-01	-5.029377803631E-01	1.266529090112E-01	-1.177178183463E-02	3.896218261384E-04
6	negative	0.1158707874	2.698633913892E+00	-6.952239488770E-01	1.432152425844E+00	8.702021487643E-01	2.177142233607E-01	1.928462089485E-02	7.652218697156E-04	1.145805691682E-05
8	positive	0.0305024314	9.397023057644E-02	-9.342443317032E-01	-1.537633804281E+00	2.882903170385E+00	-2.515941330766E+00	7.570909656954E-01	-1.202760026795E-01	1.074648862909E-02	-5.108331813681E-04	1.006305489773E-05
8	negative	0.0697989648	9.792509938063E-01	-9.878587317445E-01	2.551320698686E-01	-2.037719213627E-01	-1.855938277980E-01	-5.754625052435E-02	-7.316772553769E-03	-4.640312791564E-04	-1.465143198067E-05	-1.840790460918E-07
10	positive	0.0118340418	1.414449900658E-02	-1.041668362015E+00	-1.102179644544E-01	-9.714493847006E-01	1.788006061886E+00	-1.765623329024E+00	7.465876177629E-01	-1.731418108763E-01	2.387781981202E-02	-1.959723747193E-03	8.861332329096E-05	-1.702477982079E-06
10	negative	0.0390472253	3.064618469590E-01	-1.155626854399E+00	-5.511932411647E-01	-1.067995950009E+00	-5.630051647745E-01	-1.397961535029E-01	-1.682017969192E-02	-9.993865470761E-04	-1.976865132746E-05	8.034845708770E-07	4.842147350755E-08	7.111928248298E-10
12	positive	0.0067241385	4.566617851687E-03	-1.061632539833E+00	2.505607768802E-01	-2.193635344417E+00	3.454972205073E+00	-2.931714944301E+00	1.210067263415E+00	-2.803758376375E-01	3.716052973146E-02	-2.377086865350E-03	-2.451588355555E-05	1.516565194079E-05	-9.673463819620E-07	2.109042922619E-08
12	negative	0.0154598167	4.804019225531E-02	-9.921337753921E-01	8.218646959597E-01	1.443979031532E+00	1.378095545745E+00	6.640503939156E-01	1.838749617678E-01	3.121494176123E-02	3.417292130931E-03	2.471360371664E-04	1.176819903958E-05	3.556139228673E-07	6.190087424344E-09	4.731927811269E-11
14	positive	0.0018437785	3.433513812639E-04	-1.043539827349E+00	-3.723560308971E-01	1.237465466446E+00	-4.209403441849E+00	6.194407808530E+00	-5.397263148391E+00	2.852495549197E+00	-9.793300725911E-01	2.289029926437E-01	-3.727778692493E-02	4.242589489014E-03	-3.314937033530E-04	1.696778865484E-05	-5.128506800085E-07	6.943029132488E-09
14	negative	0.0071685703	1.032906944709E-02	-1.052794374902E+00	2.649800663835E-02	-6.884826781944E-01	-1.022724536481E+00	-7.935746710197E-01	-3.570565349283E-01	-1.006205445479E-01	-1.860634587839E-02	-2.335618015970E-03	-2.028092467970E-04	-1.221038905070E-05	-5.010346565403E-07	-1.338305214655E-08	-2.099495990543E-10	-1.468561502849E-12
16	positive	0.0013013406	1.710416898326E-04	-1.044744018175E+00	-2.831084409494E-01	4.825177811609E-01	-1.706919975100E+00	1.814357792134E+00	-7.372631140319E-01	-4.140780687597E-01	6.067654778951E-01	-3.216738549849E-01	1.019439917934E-01	-2.161954287511E-02	3.193106744006E-03	-3.310745491948E-04	2.370632632629E-05	-1.118760214521E-06	3.135669057401E-08	-3.957622744833E-10
16	negative	0.0048902332	4.806793697603E-03	-1.053254166658E+00	5.392519164527E-02	-4.949132476133E-01	-6.035106936474E-01	-3.559661315879E-01	-9.246755012781E-02	1.700205329626E-03	8.261887879064E-03	2.637451816190E-03	4.607257079286E-04	5.230997955123E-05	4.072969230556E-06	2.203911613393E-07	8.175607546726E-09	1.987683742368E-10	2.857448105143E-12	1.843233200680E-14
