Order	Fit Range	RMSE	Covariance	Coefficients
2	positive	0.4679431247	2.211604756367E+01	3.722917138422E-02	-1.173590998143E+00	-1.624979475578E-01
2	negative	1.1116313450	2.483805737042E+02	2.601778309349E+00	2.188063074860E+00	-4.850461442634E-02
4	positive	0.0680945486	4.683236222714E-01	-1.259595647159E+00	5.527123397229E-01	-6.606990123616E-01	4.607608739143E-02	-1.122724737083E-03
4	negative	0.1632441368	5.356378288044E+00	-1.299434211056E+00	-7.445681076444E-01	-5.558613201535E-01	-3.088081192344E-02	-6.103837043314E-04
6	positive	0.0096962758	9.495794180312E-03	-9.895577426251E-01	-4.762212430838E-01	2.361620146151E-01	-2.668920970850E-01	5.038419872506E-02	-4.004312451817E-03	1.186137062592E-04
6	negative	0.1065843590	2.283405343773E+00	-1.383005800806E+00	-7.242688313051E-01	-4.707380234437E-01	-2.174352847242E-03	2.954277777906E-03	1.881229779643E-04	3.566894809267E-06
8	positive	0.0047082840	2.238961721771E-03	-9.973643741276E-01	-3.793563143406E-01	2.041970254343E-02	-8.300619512619E-02	-2.623974138881E-02	1.323710137385E-02	-2.019364762096E-03	1.374168781692E-04	-3.573986734152E-06
8	negative	0.0246923176	1.225518199117E-01	-9.081801870502E-01	8.557747680111E-01	7.544322709311E-01	3.942970903854E-01	6.867456481672E-02	6.247264683674E-03	3.177203843314E-04	8.566069919964E-06	9.552492715576E-08
10	positive	0.0012482134	1.573616984838E-04	-1.010674441485E+00	-2.247449419427E-01	-3.489353645444E-01	2.790156404990E-01	-2.100165440496E-01	6.692346624569E-02	-1.145595470239E-02	1.136825124173E-03	-6.443720083191E-05	1.866501167125E-06	-1.951478871514E-08
10	negative	0.0174502665	6.120687208910E-02	-9.584862264626E-01	5.240650653979E-01	2.739811951623E-01	1.047882792462E-01	-2.262898346698E-02	-1.055519494258E-02	-1.582050570750E-03	-1.251286354317E-04	-5.610788883055E-06	-1.351614693000E-07	-1.362770250996E-09
12	positive	0.0002339255	5.526836193442E-06	-1.006655661609E+00	-3.086101976092E-01	-2.501761496545E-02	-2.350907634488E-01	2.231354862167E-01	-1.521647709482E-01	5.963512247596E-02	-1.417945270548E-02	2.150977681606E-03	-2.108224913195E-04	1.297807212247E-05	-4.576128600592E-07	7.064473544801E-09
12	negative	0.0055228054	6.130777217852E-03	-1.031416948352E+00	-8.211314772440E-02	-8.241948996738E-01	-7.351557814720E-01	-3.666800080087E-01	-9.544899154898E-02	-1.503645205904E-02	-1.540942245497E-03	-1.055655784601E-04	-4.812981430400E-06	-1.404731603267E-07	-2.378159381847E-09	-1.777877514797E-11
14	positive	0.0001076105	1.169580876136E-06	-1.007136800021E+00	-2.902485087721E-01	-1.328698526445E-01	2.036180683757E-02	-9.851167598084E-02	9.362982724107E-02	-6.319407137354E-02	2.777067368408E-02	-7.885138731939E-03	1.487300518191E-03	-1.892685464753E-04	1.612578002128E-05	-8.839986495059E-07	2.824193907903E-08	-4.002064706450E-10
14	negative	0.0030371367	1.854064096693E-03	-1.011589984657E+00	1.802373912708E-01	-1.157486127840E-01	6.771579034162E-02	1.238116698342E-01	8.765462112000E-02	2.984236493289E-02	5.996931138949E-03	7.830172319303E-04	6.938037863203E-05	4.225298361747E-06	1.746608554236E-07	4.690776434874E-09	7.392244248062E-11	5.192175076815E-13
16	positive	0.0000280179	7.928487474741E-08	-1.007320549657E+00	-2.807152224636E-01	-2.002121781198E-01	2.101723075456E-01	-3.828767872474E-01	3.532708708203E-01	-2.194140935952E-01	9.275227210478E-02	-2.713143025998E-02	5.613366560297E-03	-8.331118555154E-04	8.888129627674E-05	-6.733037223321E-06	3.510060536174E-07	-1.183520150304E-08	2.276414720148E-10	-1.819955127301E-12
16	negative	0.0013875592	3.869887624888E-04	-1.002225524511E+00	3.411834462922E-01	4.200709281946E-01	8.112638952147E-01	6.806683536696E-01	3.438837674186E-01	1.079795824045E-01	2.255269943554E-02	3.293562233107E-03	3.465564405944E-04	2.665988476180E-05	1.502029465092E-06	6.128834080160E-08	1.761819010758E-09	3.380032005254E-11	3.878656509699E-13	2.009551462809E-15
