Order	Fit Range	RMSE	Covariance	Coefficients
2	positive	0.0026081330	6.870381252366E-04	-1.232683105349E+00	-4.832348819883E-02	-5.845921810180E-03
2	negative	0.0267513187	1.438422432424E-01	-1.162054192060E+00	2.115278065234E-01	-5.936713566351E-03
4	positive	0.0000822290	6.829223234031E-07	-1.225802970301E+00	-5.712834143948E-02	-3.466772214592E-03	-1.919181442339E-04	2.907317823217E-06
4	negative	0.0010636202	2.273888877203E-04	-1.229135384659E+00	1.714122697432E-01	-1.080394002531E-02	-1.462865147205E-04	6.971394045735E-07
6	positive	0.0000809472	6.617979405606E-07	-1.225771207279E+00	-5.728998312989E-02	-3.290660975737E-03	-2.661844317872E-04	1.734877926383E-05	-1.305057662067E-06	4.438165608459E-08
6	negative	0.0001540394	4.769356329081E-06	-1.225376066670E+00	1.776251001553E-01	-8.415663549726E-03	2.159956193152E-04	2.590035487469E-05	7.919338767923E-07	8.788861402493E-09
8	positive	0.0000785294	6.228528094164E-07	-1.225831833857E+00	-5.677245410886E-02	-4.234083997922E-03	4.351290569002E-04	-2.466649273293E-04	5.358466367101E-05	-6.342534952114E-06	3.895435035699E-07	-9.694917589383E-09
8	negative	0.0001512989	4.601162601543E-06	-1.225237561264E+00	1.781149002621E-01	-8.012929267245E-03	3.542535149875E-04	5.023740200386E-05	3.177720199646E-06	1.405160054933E-07	3.831639323935E-09	4.567171578324E-11
10	positive	0.0000520460	2.735875485494E-07	-1.226056135332E+00	-5.378680809004E-02	-1.230726839474E-02	9.461802787730E-03	-5.544199095094E-03	1.876153332244E-03	-3.934213686131E-04	5.178579407319E-05	-4.165432660408E-06	1.871547689643E-07	-3.599519980770E-09
10	negative	0.0001497050	4.504730782397E-06	-1.225139955177E+00	1.786409681830E-01	-7.369969864479E-03	6.855091749991E-04	1.402948972414E-04	1.754340732703E-05	1.553488679880E-06	9.050934943545E-08	3.272616839172E-09	6.662559153528E-11	5.843715098782E-13
12	positive	0.0000219522	4.867166998265E-08	-1.226210724114E+00	-5.056170252682E-02	-2.476100800209E-02	2.922334559385E-02	-2.219010222447E-02	1.029360065083E-02	-3.124065883588E-03	6.399326140446E-04	-8.921323447053E-05	8.349611721489E-06	-5.022521069858E-07	1.755026822783E-08	-2.708353210591E-10
12	negative	0.0001469673	4.341477071505E-06	-1.225263334361E+00	1.775123239398E-01	-9.593162095605E-03	-1.159276062527E-03	-6.791172901974E-04	-2.017573611445E-04	-3.616990729288E-05	-4.222659408151E-06	-3.280547620498E-07	-1.683558392251E-08	-5.485347137035E-10	-1.028289193779E-11	-8.447604941461E-14
14	positive	0.0000160426	2.599395362420E-08	-1.226178367588E+00	-5.181680084806E-02	-1.732049475941E-02	1.146141327993E-02	3.317832901179E-04	-7.027089523142E-03	5.582192167307E-03	-2.349588108920E-03	6.295703853548E-04	-1.138335826959E-04	1.411264066059E-05	-1.185644708460E-06	6.462362680583E-08	-2.064091721030E-09	2.934687275843E-11
14	negative	0.0001277330	3.279457877503E-06	-1.225593313997E+00	1.732329276924E-01	-2.096654754714E-02	-1.385956898854E-02	-8.329751660932E-03	-3.019563034858E-03	-7.179160519498E-04	-1.173053968231E-04	-1.349836511853E-05	-1.103727766074E-06	-6.378512610168E-08	-2.546674801435E-09	-6.682981854466E-11	-1.037132697470E-12	-7.212141528763E-15
16	positive	0.0000032515	1.067802003926E-09	-1.226144396191E+00	-5.370461555127E-02	-3.402327101736E-03	-2.952160706835E-02	6.468393001554E-02	-6.887708015057E-02	4.496197572809E-02	-1.979414013393E-02	6.174544010256E-03	-1.401753626577E-03	2.344504207924E-04	-2.890266960139E-05	2.595674420958E-06	-1.652000093132E-07	7.061828503107E-09	-1.818767684777E-10	2.133118089657E-12
16	negative	0.0000863992	1.500436222573E-06	-1.225991141707E+00	1.659275456482E-01	-4.664197339020E-02	-5.148368111036E-02	-3.814492694852E-02	-1.757605953961E-02	-5.443477352807E-03	-1.187282704186E-03	-1.876553653648E-04	-2.184785814455E-05	-1.886044970074E-06	-1.203838925917E-07	-5.604449413373E-09	-1.849099015805E-10	-4.094911651244E-12	-5.457737718313E-14	-3.308184712474E-16
