Order	Fit Range	RMSE	Covariance	Coefficients
2	positive	0.5690476957	3.270534327901E+01	6.650527881816E-01	-2.356701373412E+00	-1.345981289340E-01
2	negative	0.1271530945	3.249749797189E+00	-6.929893443841E-01	4.782199548222E-01	-1.331456566550E-02
4	positive	0.0473850488	2.267796282658E-01	-1.183703967758E+00	3.647490761137E-01	-1.039142425545E+00	1.043521318144E-01	-3.844851210972E-03
4	negative	0.0055045464	6.090306335600E-03	-1.071618057328E+00	2.247497143861E-01	-5.090275453102E-02	-1.834746049661E-03	-2.542251758135E-05
6	positive	0.0283994608	8.145946696485E-02	-1.128547490818E+00	4.212691432503E-02	-6.604162031928E-01	-6.327969163590E-02	2.988764167936E-02	-3.127338112717E-03	1.084855305911E-04
6	negative	0.0008058515	1.305287315619E-04	-1.047422031818E+00	2.697734600029E-01	-3.113703161640E-02	1.665668335798E-03	2.679309574825E-04	1.163753348004E-05	1.761763447149E-07
8	positive	0.0048955168	2.420574521533E-03	-1.026366365697E+00	-6.706218122709E-01	4.322042686182E-01	-7.514380712602E-01	2.499028180556E-01	-4.195147027003E-02	3.930570721579E-03	-1.960673523968E-04	4.067166646466E-06
8	negative	0.0001499348	4.518566634736E-06	-1.045132571811E+00	2.763099763747E-01	-2.692733383149E-02	2.731083862383E-03	3.914227099549E-04	1.770740188369E-05	1.903441071483E-07	-8.590203196149E-09	-2.059536292949E-10
10	positive	0.0020595593	4.284202547237E-04	-1.042723706207E+00	-4.482693552197E-01	-1.790185199412E-01	-5.758499130728E-02	-1.631804002358E-01	1.021209804534E-01	-2.707039271251E-02	3.972195281204E-03	-3.370523902076E-04	1.554160200397E-05	-3.022664274560E-07
10	negative	0.0000926766	1.726380707124E-06	-1.045603951784E+00	2.738449259999E-01	-2.984653099840E-02	1.279454458476E-03	1.248159701833E-05	-3.994888429674E-05	-5.172374254625E-06	-3.161669007880E-07	-1.074765110605E-08	-1.960180118765E-10	-1.498178602256E-12
12	positive	0.0006516707	4.289214859612E-05	-1.047902771415E+00	-3.475084038406E-01	-5.457495420805E-01	4.887202555338E-01	-5.922224034287E-01	3.025757271979E-01	-8.645950060596E-02	1.548043047899E-02	-1.804577658066E-03	1.363545212856E-04	-6.380735124343E-06	1.650681578081E-07	-1.741450078617E-09
12	negative	0.0000904807	1.645539936370E-06	-1.045507223930E+00	2.746804316914E-01	-2.827833201806E-02	2.523029042469E-03	5.413570980603E-04	9.578108304771E-05	1.724593126225E-05	2.147931978224E-06	1.714142475732E-07	8.755875128109E-09	2.789231020761E-10	5.067661845802E-12	4.020914587174E-14
14	positive	0.0001394598	1.964350807203E-06	-1.046104263522E+00	-4.100742875234E-01	-1.987194736157E-01	-2.916896743420E-01	3.432988550827E-01	-3.793810536206E-01	2.391467923371E-01	-9.091832671597E-02	2.258044594758E-02	-3.820718931231E-03	4.460862792502E-04	-3.548815906585E-05	1.840909586004E-06	-5.622135295092E-08	7.675423896100E-10
14	negative	0.0000903371	1.640318035237E-06	-1.045505348792E+00	2.746767472161E-01	-2.834816621022E-02	2.381909519408E-03	4.196452899022E-04	3.781040305022E-05	1.187128550495E-07	-1.195663215183E-06	-2.752576405139E-07	-3.273046416704E-08	-2.398236427019E-09	-1.126621270771E-10	-3.324733505833E-12	-5.635111261110E-14	-4.195702508129E-16
16	positive	0.0000733571	5.435061574589E-07	-1.045988599841E+00	-4.149712846131E-01	-1.692613176179E-01	-3.592748821564E-01	4.185365441785E-01	-4.208322035347E-01	2.450064796431E-01	-8.398265922361E-02	1.719443582814E-02	-1.792436754903E-03	-4.101296015640E-05	4.438205459046E-05	-7.247358671799E-06	6.520023600515E-07	-3.535973996544E-08	1.088097539294E-09	-1.468072480931E-11
16	negative	0.0000885606	1.576439486363E-06	-1.045578275529E+00	2.733097931672E-01	-3.322772445674E-02	-4.873482010445E-03	-5.411529010785E-03	-2.848569686184E-03	-9.496278440524E-04	-2.191069353920E-04	-3.620865722083E-05	-4.367959705631E-06	-3.880525820343E-07	-2.536239050187E-08	-1.204487699638E-09	-4.042291628632E-11	-9.085167598050E-13	-1.226706548880E-14	-7.521772242414E-17
