Order	Fit Range	RMSE	Covariance	Coefficients
2	positive	0.2057891931	4.277268392692E+00	-7.644392034315E-01	-5.222448267753E-01	-1.193883975472E-01
2	negative	1.3250704035	3.529181264246E+02	3.767441357119E+00	3.146993177424E+00	-4.757345224077E-02
4	positive	0.0309516879	9.675870552694E-02	-1.193116602395E+00	-5.852043497322E-02	-2.042986053651E-01	-6.437792533735E-04	5.502874403171E-04
4	negative	0.3037499091	1.854506546746E+01	-9.649308868074E-01	-5.134577374277E-01	-7.015566148263E-01	-4.130368235127E-02	-8.522542173072E-04
6	positive	0.0041221809	1.716229923120E-03	-1.095526134157E+00	-3.882447354598E-01	4.657264144164E-02	-7.489969311350E-02	1.046926035164E-02	-5.820054047441E-04	1.130266005792E-05
6	negative	0.1498190211	4.511593555626E+00	-1.799498565798E+00	-1.824643749332E+00	-1.172370359907E+00	-1.059365946242E-01	-4.675122935318E-03	-8.742017166265E-05	-3.347019518189E-07
8	positive	0.0004367383	1.926477546968E-05	-1.111107038447E+00	-2.777549608264E-01	-1.256708548412E-01	3.562940648748E-02	-2.562868682241E-02	5.946439222536E-03	-6.501771344760E-04	3.511530458849E-05	-7.592558099939E-07
8	negative	0.0586186661	6.906657521361E-01	-1.135119191424E+00	4.814550439062E-01	6.914160528086E-01	5.233398762045E-01	1.043135549069E-01	1.042904461903E-02	5.713908499769E-04	1.637990864713E-05	1.923633260094E-07
10	positive	0.0000969789	9.498958434744E-07	-1.109484996178E+00	-2.993723463619E-01	-6.716000749897E-02	-2.985200621765E-02	1.283458548045E-02	-7.297753553757E-03	2.164954888406E-03	-3.389764448498E-04	2.951214062544E-05	-1.364311891066E-06	2.625893169331E-08
10	negative	0.0332547801	2.222819599633E-01	-9.601346726836E-01	1.373760953217E+00	1.719052620054E+00	1.017572715812E+00	2.281142559359E-01	2.830015690872E-02	2.121867172766E-03	9.710370495686E-05	2.586213575406E-06	3.487622339432E-08	1.572070192569E-10
12	positive	0.0000654929	4.332209028086E-07	-1.109539764560E+00	-2.975604062098E-01	-7.621034199309E-02	-1.221905699512E-02	-4.877805322856E-03	3.174701458368E-03	-1.750287164617E-03	6.222029581789E-04	-1.275352024725E-04	1.554831927350E-05	-1.126550660625E-06	4.506194794474E-08	-7.694155084764E-10
12	negative	0.0139362097	3.903780615188E-02	-1.106220542416E+00	9.841505903744E-02	-6.971824964724E-01	-9.160398016636E-01	-6.017013202704E-01	-1.865951272012E-01	-3.369423308054E-02	-3.875395088060E-03	-2.937614715328E-04	-1.466138927296E-05	-4.644243398810E-07	-8.472840440062E-09	-6.784670426876E-11
14	positive	0.0000500934	2.534437783672E-07	-1.109654312981E+00	-2.936850261778E-01	-9.730068408943E-02	3.433891550184E-02	-5.964971685049E-02	4.233751704106E-02	-2.007996767012E-02	6.489575293091E-03	-1.443814480843E-03	2.244604710830E-04	-2.446983463249E-05	1.840838868523E-06	-9.128815476677E-08	2.690726472604E-09	-3.574694597540E-11
14	negative	0.0085858312	1.481701594109E-02	-1.142662449854E+00	-3.261963912222E-01	-1.722774068109E+00	-1.953077178087E+00	-1.163510443438E+00	-3.709902259315E-01	-7.299146770180E-02	-9.532230653869E-03	-8.544638256076E-04	-5.300857114194E-05	-2.244017366812E-06	-6.211323173144E-08	-1.022020177911E-09	-7.860816146003E-12	-7.175140833232E-15
16	positive	0.0000380762	1.464298879361E-07	-1.109726345594E+00	-2.894331185387E-01	-1.297296387340E-01	1.329448567091E-01	-2.195070998179E-01	2.010001740198E-01	-1.244406534087E-01	5.427021759684E-02	-1.714909636154E-02	3.998753872313E-03	-6.929704717461E-04	8.895926475313E-05	-8.338716994255E-06	5.541908581497E-07	-2.472048496918E-08	6.634219002641E-10	-8.093084037500E-12
16	negative	0.0036084357	2.617216598948E-03	-1.109717234114E+00	2.787302297346E-01	4.031534156838E-01	1.162004685196E+00	1.304877981674E+00	8.340629114664E-01	3.181880611353E-01	7.903453766917E-02	1.356040810954E-02	1.663866924658E-03	1.485651269231E-04	9.689438583384E-06	4.572130560397E-07	1.520660325899E-08	3.382073924908E-10	4.515441100605E-12	2.736853269852E-14
