Order	Fit Range	RMSE	Covariance	Coefficients
2	positive	0.9759864487	9.620750435837E+01	2.274000508196E+00	-4.106384169401E+00	-1.947919720855E-01
2	negative	0.1992351792	7.978625980276E+00	-3.055545403024E-01	6.910392720275E-01	-1.461804469106E-02
4	positive	0.1234723423	1.539787349644E+00	-9.975902944742E-01	8.385794210900E-01	-1.891766109451E+00	2.038218601343E-01	-7.915936948789E-03
4	negative	0.0074634596	1.119634917674E-02	-9.474505465170E-01	2.394038094367E-01	-8.654209510186E-02	-3.928433275818E-03	-6.689679148682E-05
6	positive	0.0702058914	4.978155852652E-01	-1.180743692344E+00	1.295835784227E+00	-2.081682275953E+00	1.941984156818E-01	6.814590619274E-03	-2.225428239113E-03	9.983181445200E-05
6	negative	0.0032907219	2.176599040966E-03	-9.290707690906E-01	2.820708726879E-01	-6.414095866133E-02	6.951327930674E-04	3.763904747109E-04	1.983487082802E-05	3.348951562888E-07
8	positive	0.0159705583	2.576093209025E-02	-9.047920440340E-01	-7.274744496874E-01	1.176102430922E+00	-1.969072660479E+00	7.398431935368E-01	-1.402126473142E-01	1.470700322520E-02	-8.137254844877E-04	1.855909511812E-05
8	negative	0.0003431722	2.367119876516E-05	-9.164217933212E-01	3.216832524614E-01	-3.539273582032E-02	9.318101772166E-03	1.684075836621E-03	1.282203634997E-04	5.265920803035E-06	1.138901657981E-07	1.017680281608E-09
10	positive	0.0104844652	1.110232512231E-02	-8.874431039115E-01	-8.807644438926E-01	1.422929717826E+00	-2.069665415284E+00	7.001477513882E-01	-9.371872345433E-02	-1.932034246122E-03	2.268401443377E-03	-2.993033055266E-04	1.732492915869E-05	-3.895977129931E-07
10	negative	0.0000914695	1.681699705673E-06	-9.180376425392E-01	3.126192904571E-01	-4.691046069446E-02	3.138094423025E-03	-6.988393378759E-05	-1.646820714787E-04	-2.499154250299E-05	-1.842769381576E-06	-7.609950073428E-08	-1.693866531105E-09	-1.589580526456E-11
12	positive	0.0024438522	6.032137735529E-04	-9.214697868358E-01	-1.631106136857E-01	-1.372136354625E+00	2.403529712607E+00	-3.101001870929E+00	1.846036001642E+00	-6.372089007975E-01	1.404680899869E-01	-2.049309561162E-02	1.976790399936E-03	-1.214841669608E-04	4.314091752131E-06	-6.743454017322E-08
12	negative	0.0000766666	1.181430867599E-06	-9.181485858198E-01	3.118408755751E-01	-4.807198867697E-02	2.450827676576E-03	-2.625580829055E-04	-1.883827743376E-04	-2.461347747724E-05	-1.324402795940E-06	-2.134385367979E-09	3.712962173694E-09	2.096441038589E-10	5.103223420007E-12	4.874285874712E-14
14	positive	0.0017707483	3.166904950487E-04	-9.218160794038E-01	-1.714942618004E-01	-1.250070246722E+00	1.966591962012E+00	-2.383210620499E+00	1.180300109836E+00	-2.505036426916E-01	-8.705011133381E-03	1.900109038328E-02	-5.306628584780E-03	8.129364578021E-04	-7.745375941509E-05	4.586146529520E-06	-1.552530946401E-07	2.303753808927E-09
14	negative	0.0000739047	1.097841868412E-06	-9.180613099502E-01	3.129163761277E-01	-4.533444845571E-02	5.380694173413E-03	1.428531357220E-03	4.080140185473E-04	1.134384105327E-04	2.056302277218E-05	2.431789319914E-06	1.952689752099E-07	1.082445164736E-08	4.100303440736E-10	1.016738202167E-11	1.490508972982E-13	9.807281506379E-16
16	positive	0.0004091853	1.691055256133E-05	-9.180324093376E-01	-3.835722403584E-01	3.213915796597E-01	-2.683426420220E+00	4.954978832085E+00	-5.909196571882E+00	4.287738758358E+00	-2.030380528603E+00	6.653928530928E-01	-1.563654090452E-01	2.682242221364E-02	-3.371347915411E-03	3.075068387176E-04	-1.982500151961E-05	8.568733164973E-07	-2.228372424936E-08	2.636297807986E-10
16	negative	0.0000737814	1.094182077671E-06	-9.180739757998E-01	3.126635603713E-01	-4.627779600196E-02	3.921882999935E-03	2.130536220798E-04	-2.141396039339E-04	-9.779867511780E-05	-2.935293482463E-05	-6.031158907181E-06	-8.529131422650E-07	-8.476761516524E-08	-5.998058473226E-09	-3.015895958857E-10	-1.055411774382E-11	-2.447549938574E-13	-3.384718234164E-15	-2.114348524405E-17
