Order	Fit Range	RMSE	Covariance	Coefficients
2	positive	0.5624910298	3.195601201738E+01	3.790791353901E-01	-1.887511142647E+00	-1.280583556244E-01
2	negative	0.0655441642	8.635035292939E-01	-1.023103390165E+00	3.328336272298E-01	-9.142781792758E-03
4	positive	0.0546916804	3.021091705144E-01	-1.413793266329E+00	7.190987414579E-01	-9.809545165205E-01	9.636113093952E-02	-3.447895276093E-03
4	negative	0.0028288438	1.608473756019E-03	-1.204779770006E+00	2.166372387921E-01	-2.514922386188E-02	-6.779306207793E-04	-6.308916214231E-06
6	positive	0.0269647770	7.343701890827E-02	-1.250890351170E+00	-2.577786114612E-03	-2.643637925302E-01	-1.855458976192E-01	4.846344359179E-02	-4.489013408953E-03	1.472003283484E-04
6	negative	0.0001540750	4.771563108722E-06	-1.193386376820E+00	2.364890726745E-01	-1.701887123885E-02	6.573278951168E-04	9.670120163810E-05	3.728096830733E-06	5.092199740364E-08
8	positive	0.0073498439	5.456040742561E-03	-1.167219565449E+00	-5.606969390257E-01	5.507574887604E-01	-6.700491273575E-01	1.926390573403E-01	-2.769237572761E-02	2.166408701100E-03	-8.689358365808E-05	1.367284520039E-06
8	negative	0.0001221675	2.999906478165E-06	-1.193193653288E+00	2.369676701878E-01	-1.677691007863E-02	6.909825176170E-04	9.429200559029E-05	2.706574106022E-06	-4.724007045102E-08	-4.026572634848E-09	-6.146934282463E-11
10	positive	0.0014734445	2.192749005412E-04	-1.194789498998E+00	-2.055061118485E-01	-3.842194001600E-01	3.487232439282E-01	-3.902622509073E-01	1.678635623574E-01	-3.833880484543E-02	5.158854854763E-03	-4.123632626414E-04	1.817544193270E-05	-3.410033418765E-07
10	negative	0.0001209974	2.942713309956E-06	-1.193124106450E+00	2.373932198401E-01	-1.619398461633E-02	1.026452111472E-03	1.960400710037E-04	2.081073896518E-05	1.940328992449E-06	1.322610667076E-07	5.622694710759E-09	1.318801632683E-10	1.305128203607E-12
12	positive	0.0008181197	6.760129736985E-05	-1.195647694703E+00	-1.978193900753E-01	-3.825546436683E-01	2.961360245244E-01	-3.023161869151E-01	1.002540630640E-01	-8.499656107280E-03	-3.067633816124E-03	1.052864602098E-03	-1.505375421699E-04	1.179152960465E-05	-4.955238840481E-07	8.776832687462E-09
12	negative	0.0001204976	2.918451625091E-06	-1.193082801551E+00	2.377236470878E-01	-1.561766869136E-02	1.449214006240E-03	3.612422235028E-04	5.943615452349E-05	7.691162414973E-06	6.945098497026E-07	4.196593046678E-08	1.658284893494E-09	4.089168201838E-11	5.648873970293E-13	3.273243348282E-15
14	positive	0.0001609131	2.615195706791E-06	-1.193556143032E+00	-2.674367788883E-01	-8.036635242564E-03	-5.211024883378E-01	6.475090898014E-01	-5.702096904467E-01	3.010289489996E-01	-1.007039621498E-01	2.261345987659E-02	-3.514751688930E-03	3.808386030339E-04	-2.832361808903E-05	1.381225952138E-06	-3.983408438190E-08	5.154831039097E-10
14	negative	0.0001185169	2.823297260422E-06	-1.193176266129E+00	2.364867154519E-01	-1.895828948119E-02	-2.337111284324E-03	-1.952163716998E-03	-8.042637191026E-04	-2.040234283569E-04	-3.486858953986E-05	-4.150679657807E-06	-3.484424403928E-07	-2.056185251705E-08	-8.349758448320E-10	-2.222058519035E-11	-3.489312940110E-13	-2.451001095924E-15
16	positive	0.0000651978	4.293217082330E-07	-1.193868490323E+00	-2.486128118217E-01	-1.531869726513E-01	-7.534066729925E-02	-8.202864248148E-02	1.605344247872E-01	-1.839094023031E-01	1.232486044636E-01	-5.162129522731E-02	1.447243481813E-02	-2.830664973444E-03	3.934819763241E-04	-3.885680078747E-05	2.670997677450E-06	-1.217067342086E-07	3.308297551194E-09	-4.063991556753E-11
16	negative	0.0001079681	2.343080167662E-06	-1.193380584176E+00	2.326925950439E-01	-3.240736548322E-02	-2.220448406307E-02	-1.782000440548E-02	-8.611240856333E-03	-2.757767309614E-03	-6.174479923641E-04	-9.968084167039E-05	-1.181092200434E-05	-1.034808991030E-06	-6.689423948439E-08	-3.148737135176E-09	-1.048957497686E-10	-2.342895255488E-12	-3.146507066367E-14	-1.920321176590E-16
