Order	Fit Range	RMSE	Covariance	Coefficients
2	positive	0.6844817272	4.732003872630E+01	1.681013568344E+00	-3.922703971213E+00	-1.041967862732E-01
2	negative	1.1088586021	2.471430472836E+02	1.441633758360E+00	9.783080442197E-01	-7.279813311588E-02
4	positive	0.1360869056	1.870484233738E+00	-6.727239827161E-01	-2.501737336291E-01	-1.410800086088E+00	1.636967605260E-01	-6.685179564007E-03
4	negative	0.2549509274	1.306499505265E+01	-1.791035889559E+00	-1.192652801861E+00	-3.962909536127E-01	-1.592121989290E-02	-2.245147024068E-04
6	positive	0.0475447119	2.283104625539E-01	-1.064395373045E+00	1.053121187767E+00	-2.382829579306E+00	4.432485511566E-01	-4.236053931019E-02	1.924562153764E-03	-3.035746204965E-05
6	negative	0.0670686260	9.041383197847E-01	-6.966918518226E-01	8.477034969267E-01	5.011776479116E-01	1.433271320133E-01	1.314778885939E-02	5.315540769759E-04	8.063404127029E-06
8	positive	0.0162424401	2.664550284530E-02	-8.805209342212E-01	-3.322053802715E-01	-9.625540474800E-02	-1.113183317755E+00	4.984543852058E-01	-1.025204404104E-01	1.131924999688E-02	-6.494212772805E-04	1.522393801054E-05
8	negative	0.0411555966	3.404504090714E-01	-7.830858543718E-01	4.339823631163E-01	8.018690346964E-02	-2.754335153128E-02	-2.137319729269E-02	-3.271316205212E-03	-2.241720104046E-04	-7.379703822743E-06	-9.514762384921E-08
10	positive	0.0060782090	3.731407074028E-03	-8.339743133132E-01	-8.814812398476E-01	1.237167737635E+00	-2.445285091150E+00	1.190834909392E+00	-3.109948446416E-01	4.947011003471E-02	-4.924795227600E-03	2.987556056636E-04	-1.004355365917E-05	1.421070328066E-07
10	negative	0.0181502984	6.621609938725E-02	-9.183614927958E-01	-2.576399592520E-01	-7.186935783796E-01	-4.131614476594E-01	-1.184180463296E-01	-1.736711394285E-02	-1.457721886977E-03	-7.243848826390E-05	-2.066281499038E-06	-2.996708093547E-08	-1.531753040105E-10
12	positive	0.0022838647	5.268198111974E-04	-8.530596137896E-01	-4.664795958499E-01	-4.170101486215E-01	2.618517563087E-01	-1.161410785330E+00	9.166039164442E-01	-3.617937549889E-01	8.662132583109E-02	-1.339327595134E-02	1.350327912687E-03	-8.597248021152E-05	3.143725937225E-06	-5.037564630043E-08
12	negative	0.0055849109	6.269437101397E-03	-8.364192099251E-01	4.416571615574E-01	5.797038459598E-01	6.054189407973E-01	3.100660359914E-01	9.138254750865E-02	1.630155509134E-02	1.857046373583E-03	1.388901433095E-04	6.813297948197E-06	2.115618248949E-07	3.777509443953E-09	2.958278372371E-11
14	positive	0.0008781886	7.789273989758E-05	-8.580045008642E-01	-3.072770486690E-01	-1.252637040643E+00	2.039116375588E+00	-3.170191513552E+00	2.291517879246E+00	-9.750642970214E-01	2.727095671512E-01	-5.271289046188E-02	7.182219054738E-03	-6.890629688322E-04	4.555975439021E-05	-1.974254591201E-06	5.037559596621E-08	-5.721541018137E-10
14	negative	0.0030658082	1.889235365335E-03	-8.534390169130E-01	2.085959545037E-01	-6.615727708556E-02	-1.436098502899E-01	-1.573171447526E-01	-8.654975511469E-02	-2.811427112658E-02	-5.731762679678E-03	-7.701744012051E-04	-7.024542879050E-05	-4.387862533851E-06	-1.852632931290E-07	-5.062616153189E-09	-8.091656809241E-11	-5.748952690485E-13
16	positive	0.0003473742	1.218745617570E-05	-8.562008725316E-01	-4.127610479679E-01	-4.521240788115E-01	-3.838244432009E-01	7.403931277192E-01	-1.572977406289E+00	1.555951383482E+00	-8.812123745805E-01	3.249994702509E-01	-8.321712078719E-02	1.525752488042E-02	-2.024266185692E-03	1.931994102344E-04	-1.294975181906E-05	5.790566673438E-07	-1.551852593096E-08	1.885963758823E-10
16	negative	0.0016807464	5.678066275033E-04	-8.595800491648E-01	1.105613224189E-01	-3.707941663037E-01	-5.343340205303E-01	-4.236510217488E-01	-1.956574496349E-01	-5.678760574983E-02	-1.070410147003E-02	-1.333132486012E-03	-1.080609314823E-04	-5.149753899648E-06	-6.950346901794E-08	8.109587861389E-09	6.124600596491E-10	2.051486359394E-11	3.571457847693E-13	2.621596816715E-15
