Order	Fit Range	RMSE	Covariance	Coefficients
2	positive	0.8532236259	7.352704612822E+01	1.756560156686E+00	-3.378074148693E+00	-1.523536407813E-01
2	negative	0.9255181799	1.721733641670E+02	8.800398928331E-01	9.071579667862E-01	-6.535981786914E-02
4	positive	0.1231706596	1.532272149578E+00	-1.137981648643E+00	1.047635039192E+00	-1.691542765932E+00	1.878515292141E-01	-7.440115292763E-03
4	negative	0.2049361556	8.441764403236E+00	-1.742670910457E+00	-8.206913691942E-01	-3.152903609373E-01	-1.166787539301E-02	-1.458067668317E-04
6	positive	0.0748494297	5.658461501413E-01	-1.258364659959E+00	1.250123909900E+00	-1.645873133787E+00	9.110024141427E-02	2.248141067638E-02	-3.476421597891E-03	1.390854872279E-04
6	negative	0.0453338771	4.130872428040E-01	-8.651223657159E-01	7.899184937242E-01	3.821005174458E-01	1.101057314275E-01	9.912313363331E-03	3.930811345890E-04	5.859414564931E-06
8	positive	0.0152755205	2.356749432786E-02	-9.678626804777E-01	-8.541049151219E-01	1.703331109148E+00	-2.106459563210E+00	7.578214183749E-01	-1.400666866330E-01	1.439496846018E-02	-7.822464481058E-04	1.755513288110E-05
8	negative	0.0249487979	1.251109456313E-01	-9.724419724415E-01	3.468847848654E-01	-2.961776678978E-02	-4.670122903084E-02	-2.029809677399E-02	-2.814282556726E-03	-1.843003118664E-04	-5.897902184423E-06	-7.451805322392E-08
10	positive	0.0108734350	1.194139055601E-02	-9.799043992418E-01	-6.292216671001E-01	9.557430540908E-01	-1.124652002056E+00	9.947638407080E-02	1.137520966489E-01	-4.513960402994E-02	7.848929369011E-03	-7.374537732580E-04	3.650633862973E-05	-7.490386120187E-07
10	negative	0.0112511646	2.544432952215E-02	-1.041911043951E+00	6.204318023879E-03	-4.042056175562E-01	-2.163108699820E-01	-5.939422334770E-02	-7.804315754531E-03	-5.374719404386E-04	-1.800861304217E-05	-1.193953604471E-07	8.733860439026E-09	1.753362074235E-10
12	positive	0.0026796108	7.252117374633E-04	-1.013612112066E+00	6.648689125510E-02	-1.707669132346E+00	3.064889407228E+00	-3.397416874351E+00	1.865025527729E+00	-6.074402524097E-01	1.276374034132E-01	-1.785640187629E-02	1.658829103012E-03	-9.851499740334E-05	3.390496918047E-06	-5.149066957834E-08
12	negative	0.0033165277	2.210870565333E-03	-9.930173036697E-01	4.164742697941E-01	3.457691765750E-01	3.627402352613E-01	1.801903907151E-01	5.195629181848E-02	9.045309407951E-03	1.003313026243E-03	7.299359806457E-05	3.482893799326E-06	1.052390295206E-07	1.829794487823E-09	1.396523518885E-11
14	positive	0.0016729260	2.826668015187E-04	-1.008796677137E+00	-1.175891473413E-01	-6.254229852672E-01	4.994594840344E-01	-1.648517825355E-01	-6.068715013355E-01	6.285850749338E-01	-2.947461906861E-01	8.324799681096E-02	-1.545663090632E-02	1.940882216469E-03	-1.639043126172E-04	8.941303233080E-06	-2.851329199914E-07	4.041979624965E-09
14	negative	0.0012895507	3.342511960959E-04	-1.006461311540E+00	2.398090441449E-01	-1.287177482418E-01	-1.723222465021E-01	-1.451636380217E-01	-6.896111602406E-02	-2.046606249216E-02	-3.933347694927E-03	-5.066923571029E-04	-4.473842329330E-05	-2.722103293254E-06	-1.124290797322E-07	-3.014822227724E-09	-4.739919438504E-11	-3.319004642414E-13
16	positive	0.0005446044	2.995595022942E-05	-1.005584260630E+00	-2.916019821075E-01	6.379557785217E-01	-3.164281491286E+00	5.497129927093E+00	-5.957895924079E+00	3.975158669521E+00	-1.749173982287E+00	5.361953384008E-01	-1.183747084297E-01	1.913590576299E-02	-2.272205194296E-03	1.961853469926E-04	-1.199342807784E-05	4.922954363717E-07	-1.217497304057E-08	1.371457336677E-10
16	negative	0.0007306179	1.072947436526E-04	-1.007632532051E+00	2.253725783175E-01	-1.603012124536E-01	-1.918819695286E-01	-1.398867497434E-01	-5.634399569980E-02	-1.313227991607E-02	-1.543383103772E-03	5.485852634316E-07	2.971167477762E-05	5.046461419271E-06	4.691242994027E-07	2.802522250351E-08	1.106117789575E-09	2.803558373248E-11	4.150140759448E-13	2.734792579591E-15
