Order	Fit Range	RMSE	Covariance	Coefficients
2	positive	0.5295708069	2.832496918746E+01	1.081274668387E-01	-1.304080051558E+00	-1.720089917788E-01
2	negative	0.1977972802	7.863876573214E+00	-5.016318622732E-01	7.160279730281E-01	-1.761109621657E-02
4	positive	0.0734121151	5.443232025662E-01	-1.385552173007E+00	7.059291168184E-01	-7.619943964322E-01	5.628578874292E-02	-1.479787177716E-03
4	negative	0.0069695704	9.763557122524E-03	-1.132021583359E+00	2.755852490635E-01	-8.708747218021E-02	-3.742464601571E-03	-6.233584090231E-05
6	positive	0.0119703429	1.447220003032E-02	-1.092689644800E+00	-4.209410374527E-01	2.297421882477E-01	-2.932494308624E-01	5.664439663504E-02	-4.567995468341E-03	1.368564906545E-04
6	negative	0.0031270883	1.965514913734E-03	-1.115222955423E+00	3.147775786587E-01	-6.644262140721E-02	5.287801942299E-04	3.479145499203E-04	1.838278393294E-05	3.107347000398E-07
8	positive	0.0058422475	3.447317413712E-03	-1.091515463080E+00	-3.819062999709E-01	9.501791024409E-02	-1.549414008027E-01	-7.431770996843E-03	1.088151304752E-02	-1.874731774345E-03	1.340822235650E-04	-3.586932667360E-06
8	negative	0.0003062508	1.885169910660E-05	-1.103095733226E+00	3.528542822469E-01	-3.872601119038E-02	8.872933812705E-03	1.619226739938E-03	1.243999873650E-04	5.174671016758E-06	1.137245074869E-07	1.036249526745E-09
10	positive	0.0014184972	2.032255506734E-04	-1.109386823331E+00	-1.697158319183E-01	-4.232592939578E-01	3.665077492831E-01	-2.807850923776E-01	9.405966713011E-02	-1.730161076915E-02	1.893629854260E-03	-1.231399596841E-04	4.388050498789E-06	-6.573393651396E-08
10	negative	0.0000923496	1.714218340542E-06	-1.104526653949E+00	3.448032447335E-01	-4.898565578575E-02	3.352331908462E-03	4.790915919826E-05	-1.387688762744E-04	-2.209212370507E-05	-1.654882846471E-06	-6.888476413028E-08	-1.540646868969E-09	-1.450446722412E-11
12	positive	0.0002473829	6.181030110356E-06	-1.104682443664E+00	-2.696924941853E-01	-3.158012086596E-02	-2.639607115890E-01	2.581075428729E-01	-1.825935674305E-01	7.386286327549E-02	-1.806465346888E-02	2.812303179423E-03	-2.823761058183E-04	1.778025718667E-05	-6.403788565539E-07	1.008486777455E-08
12	negative	0.0000797893	1.279631859745E-06	-1.104632441035E+00	3.440558752451E-01	-5.011137901271E-02	2.675920003171E-03	-1.476201292455E-04	-1.651335270627E-04	-2.247604036035E-05	-1.256033501357E-06	-6.428694990659E-09	3.167685767456E-09	1.849417147188E-10	4.554608821659E-12	4.377097356244E-14
14	positive	0.0001305730	1.721978798044E-06	-1.104854879655E+00	-2.611764679599E-01	-8.812635767116E-02	-1.167835661714E-01	5.777263288018E-02	-1.899964820415E-02	-1.272927032028E-02	1.304162914891E-02	-4.970579901985E-03	1.088344365772E-03	-1.514729122398E-04	1.369906882010E-05	-7.837036334347E-07	2.585412138867E-08	-3.756629299185E-10
14	negative	0.0000776432	1.211721912284E-06	-1.104554744116E+00	3.450100699676E-01	-4.768997313312E-02	5.259353399476E-03	1.338605804124E-03	3.571805041396E-04	9.797553675887E-05	1.776440682978E-05	2.099558884714E-06	1.681426802871E-07	9.280707073133E-09	3.496329056916E-10	8.615313103285E-12	1.254349266554E-13	8.193939360070E-16
16	positive	0.0000394321	1.570436465255E-07	-1.105077579308E+00	-2.495831342759E-01	-1.702032044329E-01	1.151066519272E-01	-2.905592331357E-01	3.000152072289E-01	-2.053515082658E-01	9.349840544144E-02	-2.891877401981E-02	6.253474961996E-03	-9.635201651948E-04	1.063446196238E-04	-8.326591148002E-06	4.494380592215E-07	-1.577489939509E-08	3.196746122043E-10	-2.768405461928E-12
16	negative	0.0000773280	1.201903491453E-06	-1.104579822925E+00	3.445253454558E-01	-4.945913391405E-02	2.575422607384E-03	-8.593744213053E-04	-7.502888080273E-04	-2.726292075484E-04	-6.864539337049E-05	-1.236972483701E-05	-1.603337459634E-06	-1.505385270954E-07	-1.025617124721E-08	-5.024903899198E-10	-1.726590363000E-11	-3.951301104615E-13	-5.410661920015E-15	-3.354665650981E-17
