Order	Fit Range	RMSE	Covariance	Coefficients
2	positive	1.1802971659	1.407032413837E+02	2.603927023720E+00	-4.326204801088E+00	-1.938436617511E-01
2	negative	0.1451560475	4.235125901221E+00	-7.980802192970E-01	3.800625858368E-01	-1.821450612928E-02
4	positive	0.1974918450	3.939305913811E+00	-1.411357731771E+00	1.846217127611E+00	-2.353701099394E+00	2.655026099000E-01	-1.060623631573E-02
4	negative	0.0118464751	2.820813349770E-02	-1.195309026531E+00	1.277093070019E-01	-5.257392577868E-02	-1.418622262670E-03	-1.194243336177E-05
6	positive	0.1310840232	1.735485136133E+00	-1.569115643962E+00	2.051781693002E+00	-2.189890909712E+00	8.357565736529E-02	4.094601126324E-02	-5.783591814391E-03	2.270643367957E-04
6	negative	0.0005583731	6.266788673993E-05	-1.147107191897E+00	2.121004037408E-01	-1.782424625722E-02	4.324247325291E-03	4.343878105855E-04	1.629742581180E-05	2.250363738995E-07
8	positive	0.0334335323	1.128979092183E-01	-1.063292593773E+00	-1.627068474275E+00	3.688409481093E+00	-3.789140413403E+00	1.342421110809E+00	-2.486503586063E-01	2.570058852857E-02	-1.405237676346E-03	3.171810968638E-05
8	negative	0.0001825499	6.698214365923E-06	-1.148617085067E+00	2.058809129551E-01	-2.359541292701E-02	2.128752674786E-03	1.178579870038E-05	-2.853630441473E-05	-2.431473639971E-06	-8.235087884176E-08	-1.040021482173E-09
10	positive	0.0250760318	6.350954453453E-02	-1.092116418018E+00	-1.113488228512E+00	2.019136691836E+00	-1.629251360625E+00	-9.036671368560E-02	2.992320432334E-01	-1.019780991643E-01	1.700832644495E-02	-1.572015421266E-03	7.726091338229E-05	-1.580302313304E-06
10	negative	0.0000731239	1.074768786422E-06	-1.149105638724E+00	2.035280345773E-01	-2.612390509571E-02	1.020295268095E-03	-2.312870751056E-04	-5.695524809540E-05	-4.083246564790E-06	-1.043025068433E-07	1.515648486338E-09	1.330225478861E-10	1.986977450265E-12
12	positive	0.0077664634	6.092113352738E-03	-1.168975147365E+00	4.780068322235E-01	-4.089698520630E+00	8.005716432480E+00	-8.155136605470E+00	4.350296033267E+00	-1.406893421884E+00	2.959628722465E-01	-4.158678032106E-02	3.884772833206E-03	-2.320463475849E-04	8.031081550242E-06	-1.226118586672E-07
12	negative	0.0000625020	7.852059286287E-07	-1.148943253910E+00	2.048671654373E-01	-2.371616127079E-02	2.847083859791E-03	5.104575250426E-04	1.243161943073E-04	2.434170654662E-05	2.851694184366E-06	2.074589453641E-07	9.628056516914E-09	2.795939751168E-10	4.654133981354E-12	3.401512775428E-14
14	positive	0.0051289263	2.656894077792E-03	-1.155560784402E+00	-3.479201423142E-02	-1.074717685124E+00	8.586777938078E-01	8.506150538133E-01	-2.536372793494E+00	2.036699795792E+00	-8.808211043247E-01	2.400988006890E-01	-4.380087354735E-02	5.450005014248E-03	-4.580803655946E-04	2.493303784345E-05	-7.944414505356E-07	1.126190756409E-08
14	negative	0.0000620232	7.732213301151E-07	-1.148975102756E+00	2.044414658985E-01	-2.487469664113E-02	1.524834459198E-03	-3.026593086635E-04	-1.811060447253E-04	-5.095536543017E-05	-9.865297339740E-06	-1.299530680979E-06	-1.168287418335E-07	-7.196926659543E-09	-2.999060278075E-10	-8.101186046877E-12	-1.282479608670E-13	-9.043561968902E-16
16	positive	0.0020875956	4.401632620783E-04	-1.146009601487E+00	-5.528762898962E-01	2.689863228282E+00	-1.006766603774E+01	1.775140629745E+01	-1.852431013083E+01	1.204606394886E+01	-5.235816946956E+00	1.598028820787E+00	-3.527640671926E-01	5.714666935024E-02	-6.807088086973E-03	5.898379730705E-04	-3.619011582797E-05	1.490725519378E-06	-3.698841943239E-08	4.179122357604E-10
16	negative	0.0000593242	7.073920673816E-07	-1.149050429321E+00	2.030395097259E-01	-2.985271244949E-02	-5.840571160583E-03	-6.194373654947E-03	-3.084168810715E-03	-1.001966156317E-03	-2.271275438788E-04	-3.697568979235E-05	-4.403425917755E-06	-3.870039773740E-07	-2.506997073929E-08	-1.181965105815E-09	-3.943084242960E-11	-8.818561718124E-13	-1.185813484465E-14	-7.245794270785E-17
