Order	Fit Range	RMSE	Covariance	Coefficients
2	positive	0.0000000000	4.553069973381E-30	-1.307328942583E+00	-1.901886549384E-17	8.114878785013E-18
2	negative	0.0689748874	9.562645536997E-01	-1.184723841219E+00	1.958311766822E-01	-1.533687634789E-02
4	positive	0.0000000000	3.882617911366E-30	-1.307328942583E+00	-5.571000766974E-16	2.083377087735E-16	-2.667792200575E-17	1.252374934805E-18
4	negative	0.0064626258	8.394871861905E-03	-1.325133353310E+00	1.243777920567E-01	-2.084397214633E-02	1.606927510460E-04	1.504284237430E-05
6	positive	0.0000000000	3.056936867263E-30	-1.307328942583E+00	-2.185579295162E-15	1.519989603916E-15	-5.073042398504E-16	8.322007384551E-17	-6.615546827550E-18	2.051399808149E-19
6	negative	0.0005274979	5.592906519156E-05	-1.304945314384E+00	1.559934649856E-01	-9.543786340755E-03	1.700556948646E-03	1.048697897988E-04	1.982633781937E-06	5.681606825364E-09
8	positive	0.0000000000	8.082070219496E-30	-1.307328942583E+00	-1.331750104674E-14	1.535565780563E-14	-8.375218734867E-15	2.519389803753E-15	-4.455996980317E-16	4.617043739488E-17	-2.589312763652E-18	6.062553023718E-20
8	negative	0.0000850037	1.452352180609E-06	-1.306940529669E+00	1.497615414058E-01	-1.405267913171E-02	3.532407746029E-04	-9.846491456929E-05	-1.476240826863E-05	-7.493432785934E-07	-1.720725167697E-08	-1.504066764511E-10
10	positive	0.0000000000	6.721658246365E-30	-1.307328942583E+00	-1.868424999606E-14	2.996085807855E-14	-2.411989538114E-14	1.144261714388E-14	-3.410029611119E-15	6.540092147971E-16	-8.049300506675E-17	6.138943367253E-18	-2.640651148502E-19	4.897453849008E-21
10	negative	0.0000687949	9.512809046751E-07	-1.306718214655E+00	1.509594557140E-01	-1.258895901823E-02	1.107149768541E-03	1.064361652283E-04	1.791176165112E-05	2.463190520569E-06	1.797787964263E-07	7.179649957418E-09	1.512558031290E-10	1.325789576465E-12
12	positive	0.0000000000	6.650598028855E-30	-1.307328942583E+00	-1.913746806794E-14	3.125147302779E-14	-2.520159160058E-14	1.150366477150E-14	-2.990497938771E-15	3.639979868331E-16	1.700283526963E-17	-1.332537073659E-17	2.150806485901E-18	-1.781701243168E-19	7.776905061985E-21	-1.420093476930E-22
12	negative	0.0000653005	8.570955345986E-07	-1.306816862943E+00	1.500693371084E-01	-1.432297804543E-02	-3.173466038951E-04	-5.204397838092E-04	-1.484115851502E-04	-2.591560589076E-05	-3.040258490689E-06	-2.384008720756E-07	-1.229177119627E-08	-4.003301242897E-10	-7.475739236855E-12	-6.106023267408E-14
14	positive	0.0000000000	6.277506594872E-30	-1.307328942583E+00	-1.307922487574E-14	-3.206628466987E-15	5.379935096465E-14	-8.502306240401E-14	6.871242296798E-14	-3.451807374715E-14	1.162977848089E-14	-2.724657926972E-15	4.503487486523E-16	-5.238157193798E-17	4.197735889110E-18	-2.207078489248E-19	6.854373055991E-21	-9.530787443583E-23
14	negative	0.0000527339	5.589537811614E-07	-1.306992961388E+00	1.477977067023E-01	-2.033429312735E-02	-7.002631641995E-03	-4.531741560327E-03	-1.620119745828E-03	-3.806400302748E-04	-6.166138357696E-05	-7.040968928984E-06	-5.716764089373E-07	-3.283180398799E-08	-1.303803361895E-09	-3.405838545609E-11	-5.265115661297E-13	-3.649315311604E-15
16	positive	0.0000000000	6.019592731301E-30	-1.307328942583E+00	-6.831355743527E-15	-4.968417656126E-14	1.915429678295E-13	-3.027274983152E-13	2.793690310717E-13	-1.695854884971E-13	7.189989478380E-14	-2.202835575901E-14	4.969668661127E-15	-8.319808491114E-16	1.031199655995E-16	-9.336446080046E-18	6.000207868972E-19	-2.592257795711E-20	6.750146057743E-22	-8.004935577818E-24
16	negative	0.0000348170	2.436569844571E-07	-1.307160292460E+00	1.447461655190E-01	-3.100180706258E-02	-2.255444665358E-02	-1.679348544528E-02	-7.576509266267E-03	-2.304593875153E-03	-4.951032629962E-04	-7.723664936218E-05	-8.890746515088E-06	-7.599352173437E-07	-4.808490403273E-08	-2.221359462811E-09	-7.278610751902E-11	-1.601899376857E-12	-2.123053456612E-14	-1.280310344150E-16
