Order	Fit Range	RMSE	Covariance	Coefficients
2	positive	0.7861172385	6.241601157924E+01	1.360391549059E+00	-3.044734784531E+00	-1.556929403440E-01
2	negative	0.1298751876	3.390380436755E+00	-7.432512906791E-01	4.618999625792E-01	-1.817651536844E-02
4	positive	0.0896211260	8.112265694932E-01	-1.258667913448E+00	8.908325459012E-01	-1.496960759790E+00	1.597384958076E-01	-6.137966934352E-03
4	negative	0.0076221334	1.167748040877E-02	-1.109427062871E+00	2.249992402415E-01	-5.144893922334E-02	-1.467223917005E-03	-1.564936289114E-05
6	positive	0.0569836666	3.279609646467E-01	-1.253784103387E+00	6.682113170252E-01	-1.126009880278E+00	-3.405840175564E-02	3.690294878810E-02	-4.262028375135E-03	1.549998846755E-04
6	negative	0.0005335773	5.722564869164E-05	-1.077255556789E+00	2.824891632631E-01	-2.723982176089E-02	2.635982529586E-03	3.125687646616E-04	1.238975277835E-05	1.778532819130E-07
8	positive	0.0108063801	1.179456291620E-02	-1.039025339590E+00	-8.614806333300E-01	1.269185557392E+00	-1.578463631474E+00	5.439924499028E-01	-9.652215829664E-02	9.566740937810E-03	-5.035277701729E-04	1.098535804306E-05
8	negative	0.0001466614	4.323420456800E-06	-1.076532914784E+00	2.838937551518E-01	-2.694445768427E-02	2.457161287728E-03	2.338309798971E-04	2.170802596363E-07	-7.310754279406E-07	-3.308121544607E-08	-4.707312102235E-10
10	positive	0.0066306246	4.440483440417E-03	-1.064034487443E+00	-4.981834512011E-01	2.211705726872E-01	-3.379901630786E-01	-2.226744843490E-01	1.801017769876E-01	-5.183195672384E-02	7.990770378579E-03	-7.027207812006E-04	3.332064038077E-05	-6.629334470110E-07
10	negative	0.0000862571	1.495498898142E-06	-1.076950638038E+00	2.817792769083E-01	-2.935915512569E-02	1.307987324490E-03	-5.011979775803E-05	-4.001896449122E-05	-4.129982384762E-06	-2.028072149012E-07	-5.141723997860E-09	-5.723241510487E-11	-1.012704876117E-13
12	positive	0.0019122800	3.693382976175E-04	-1.083032809644E+00	-1.151915264244E-01	-1.216762779466E+00	1.878407798843E+00	-2.032554782018E+00	1.065062104900E+00	-3.285772400985E-01	6.524522456501E-02	-8.621444159308E-03	7.565919621505E-04	-4.246102702599E-05	1.381510090235E-06	-1.984194943005E-08
12	negative	0.0000840042	1.418398232675E-06	-1.076867391260E+00	2.824646408712E-01	-2.812887130856E-02	2.239795946997E-03	3.275059621361E-04	5.207134527923E-05	1.027629470877E-05	1.291332995885E-06	9.863752401659E-08	4.710797028526E-09	1.387369759293E-10	2.316577783519E-12	1.683504660510E-14
14	positive	0.0007767436	6.093639475270E-05	-1.078178645907E+00	-2.899005931660E-01	-2.261002626856E-01	-3.958824032886E-01	7.492607424049E-01	-1.003528291060E+00	6.787821502506E-01	-2.704552637251E-01	6.983389543440E-02	-1.222487998408E-02	1.470954777562E-03	-1.201995683314E-04	6.386098874308E-06	-1.992474798332E-07	2.772851012925E-09
14	negative	0.0000821372	1.356050429900E-06	-1.076943264801E+00	2.814612996140E-01	-3.083697575214E-02	-8.279141435089E-04	-1.545854867858E-03	-6.469941248202E-04	-1.610018195934E-04	-2.746651737432E-05	-3.290268634329E-06	-2.781593739048E-07	-1.650111920598E-08	-6.722573900814E-10	-1.791916144762E-11	-2.815116033976E-13	-1.976769699476E-15
16	positive	0.0003435369	1.191977605723E-05	-1.076987596508E+00	-3.510874917879E-01	2.032955606619E-01	-1.597679951036E+00	2.535430383429E+00	-2.619416916099E+00	1.640532084818E+00	-6.653521876732E-01	1.849624627696E-01	-3.642598979030E-02	5.153547928564E-03	-5.226864290254E-04	3.727644392983E-05	-1.790174892782E-06	5.306767798847E-08	-7.983742791298E-10	3.093422610833E-12
16	negative	0.0000748059	1.124783133746E-06	-1.077085796931E+00	2.788235528565E-01	-4.016284755799E-02	-1.457091566457E-02	-1.249643047094E-02	-6.022305863594E-03	-1.915363870490E-03	-4.267998083376E-04	-6.862972193956E-05	-8.101340049882E-06	-7.072702845344E-07	-4.556966729124E-08	-2.138526691956E-09	-7.104929804049E-11	-1.583083478636E-12	-2.121496052334E-14	-1.292261103534E-16
