Order	Fit Range	RMSE	Covariance	Coefficients
2	positive	0.8426664449	7.171876047462E+01	1.191188764163E+00	-2.269141184459E+00	-1.917544973543E-01
2	negative	0.3058760955	1.880559734828E+01	-5.646040976422E-02	9.521982929710E-01	-2.136332287600E-02
4	positive	0.1107827777	1.239555207583E+00	-1.462526689895E+00	1.567767728538E+00	-1.438305789516E+00	1.394724917340E-01	-4.920198334876E-03
4	negative	0.0151471830	4.611686789172E-02	-1.061420346203E+00	2.358196520328E-01	-1.374444028560E-01	-6.497123566571E-03	-1.148219163995E-04
6	positive	0.0505140822	2.577189229962E-01	-1.088466176734E+00	-2.206774102510E-02	9.013914710081E-02	-4.457929565193E-01	1.003903022845E-01	-8.925864258472E-03	2.875868706981E-04
6	negative	0.0076539000	1.177501936139E-02	-1.041389022504E+00	2.918623354992E-01	-1.047052451443E-01	7.560686104070E-04	6.167544009636E-04	3.400874066361E-05	5.916000518463E-07
8	positive	0.0194999682	3.840512457938E-02	-9.512979661875E-01	-9.088520814335E-01	1.338532634023E+00	-1.152812847530E+00	2.969978502569E-01	-3.747809958602E-02	2.371061032092E-03	-6.108352116096E-05	7.284001846026E-08
8	negative	0.0008170618	1.341855786421E-04	-1.010253857071E+00	3.911574970449E-01	-3.113317841067E-02	2.338149564202E-02	4.155573852010E-03	3.390932292259E-04	1.521204861313E-05	3.628904707725E-07	3.607852498128E-09
10	positive	0.0042557854	1.829282662807E-03	-1.023461899912E+00	1.243807910522E-02	-1.067819661348E+00	1.449023974691E+00	-1.180013383808E+00	4.540635508569E-01	-9.860112001593E-02	1.290447565186E-02	-1.013553696198E-03	4.412637533079E-05	-8.201511030457E-07
10	negative	0.0002586500	1.344686941159E-05	-1.014035307173E+00	3.692733217258E-01	-5.974213673383E-02	7.600263568511E-03	-4.474065554778E-04	-4.506998073815E-04	-6.860281202485E-05	-5.204392534978E-06	-2.217483499611E-07	-5.083302701886E-09	-4.898485672199E-11
12	positive	0.0027081745	7.407550965672E-04	-1.019492530961E+00	-1.009653291713E-01	-5.360543498286E-01	4.556754719307E-01	-2.125830050565E-01	-1.044202702320E-01	1.062458429122E-01	-3.660503729798E-02	6.971021891403E-03	-8.062924338726E-04	5.659919819990E-05	-2.226040614369E-06	3.773537585183E-08
12	negative	0.0000859895	1.486232456606E-06	-1.014887266598E+00	3.625688641739E-01	-7.123622837036E-02	-6.637234243490E-04	-3.599524222538E-03	-1.165972713875E-03	-1.711240163770E-04	-1.473804401318E-05	-7.968420122185E-07	-2.689726926930E-08	-5.279387999149E-10	-4.917333138585E-12	-8.992316600519E-15
14	positive	0.0008874638	7.954678920912E-05	-1.013206390816E+00	-3.061510666114E-01	5.521246684141E-01	-1.884161196267E+00	2.464166339253E+00	-1.961542101981E+00	9.474733371632E-01	-2.964284888218E-01	6.301412973018E-02	-9.323054038103E-03	9.633268162226E-04	-6.829867222134E-05	3.170102892572E-06	-8.680904355500E-08	1.063454904656E-09
14	negative	0.0000637420	8.166724424788E-07	-1.014632559779E+00	3.657381020611E-01	-6.310057364363E-02	8.119033995668E-03	1.515604666095E-03	6.551017338272E-04	2.546317161103E-04	5.347813392818E-05	6.874106488468E-06	5.840311328371E-07	3.375620462883E-08	1.320687432450E-09	3.359760901448E-11	5.027561308557E-13	3.363562055723E-15
16	positive	0.0002705174	7.391054329343E-06	-1.015101453733E+00	-1.957127922671E-01	-2.843637278790E-01	6.431246184017E-01	-1.607703352819E+00	2.055410127010E+00	-1.678910235860E+00	8.989500337511E-01	-3.276121397976E-01	8.401137236599E-02	-1.547378868215E-02	2.061691585816E-03	-1.973489197935E-04	1.324770162863E-05	-5.925162536929E-07	1.586658950700E-08	-1.925195872451E-10
16	negative	0.0000619614	7.716829778142E-07	-1.014679835965E+00	3.648040377357E-01	-6.656201136397E-02	2.797598135490E-03	-2.895067690693E-03	-1.591908779145E-03	-5.050153490314E-04	-1.253242619798E-04	-2.333133960709E-05	-3.144611077100E-06	-3.052386773270E-07	-2.133892133950E-08	-1.065858727484E-09	-3.714931332319E-11	-8.590762349273E-13	-1.185304358641E-14	-7.389039183381E-17
