Order	Fit Range	RMSE	Covariance	Coefficients
2	positive	0.0124128479	1.556195817774E-02	-1.266450196986E+00	-1.105327676381E-01	-3.591200144374E-02
2	negative	0.2880136870	1.667332865802E+01	-5.056535215276E-01	5.948002988074E-01	-2.614354165469E-02
4	positive	0.0005315973	2.854216459192E-05	-1.224485224475E+00	-1.740298693962E-01	-1.409430754628E-02	-2.624482045156E-03	1.021212498102E-04
4	negative	0.0276189432	1.533240108279E-01	-1.343190359374E+00	4.116313794931E-02	-1.066541806923E-01	-3.795624368952E-03	-4.858698992220E-05
6	positive	0.0001062250	1.139658415978E-06	-1.226300311358E+00	-1.676452141506E-01	-1.919862264886E-02	-1.010906164477E-03	-1.343983290988E-04	1.600201264402E-05	-3.991076642902E-07
6	negative	0.0030811683	1.908213270157E-03	-1.223647092932E+00	2.590337434260E-01	-1.299052125550E-02	1.243707518935E-02	1.281646184992E-03	5.155588731044E-05	7.617785023123E-07
8	positive	0.0000960995	9.327466498118E-07	-1.226141193182E+00	-1.687392383347E-01	-1.754670076058E-02	-2.033350630127E-03	1.858162269395E-04	-3.911041770321E-05	4.861510363416E-06	-2.594744793474E-07	5.111581222946E-09
8	negative	0.0011808409	2.802714528839E-04	-1.222474476308E+00	2.566924048522E-01	-1.976128388354E-02	8.532982927963E-03	3.279970530169E-04	-6.703981800935E-05	-7.121413099258E-06	-2.667506138768E-07	-3.610351110677E-09
10	positive	0.0000925209	8.645719640140E-07	-1.226232997062E+00	-1.674712883668E-01	-2.107449348096E-02	2.014920305107E-03	-2.248462029754E-03	8.178199632401E-04	-1.811387001245E-04	2.495427858077E-05	-2.074232950213E-06	9.542565702189E-08	-1.868689414208E-09
10	negative	0.0001961371	7.732418618230E-06	-1.226974919801E+00	2.333648366580E-01	-4.712205520271E-02	-4.919974148289E-03	-3.136353338293E-03	-5.853580407598E-04	-5.431399094158E-05	-2.898796006853E-06	-9.042591903446E-08	-1.526583690291E-09	-1.067241422416E-11
12	positive	0.0000708092	5.064088411208E-07	-1.226432935162E+00	-1.630765777293E-01	-3.873037960735E-02	3.112377156247E-02	-2.772280414450E-02	1.420573258635E-02	-4.697170460040E-03	1.037015647507E-03	-1.544512827587E-04	1.533422629738E-05	-9.727592293977E-07	3.566962897762E-08	-5.751699518594E-10
12	negative	0.0000630698	7.995382381296E-07	-1.226115534450E+00	2.406193717188E-01	-3.378637465760E-02	5.436035864697E-03	1.174567786496E-03	4.968628432240E-04	1.204118666167E-04	1.585928241111E-05	1.262887012537E-06	6.331799009926E-08	1.967968579382E-09	3.479442941389E-11	2.683419926657E-13
14	positive	0.0000320886	1.039972459294E-07	-1.226611733625E+00	-1.568185798902E-01	-7.358181803949E-02	1.098008203827E-01	-1.223984244370E-01	8.348555194846E-02	-3.790353916070E-02	1.193034400923E-02	-2.660914651318E-03	4.236972414502E-04	-4.785563104968E-05	3.745061638721E-06	-1.930818510265E-07	5.898282917985E-09	-8.086704106137E-11
14	negative	0.0000498302	4.990924858922E-07	-1.226270569675E+00	2.385345425804E-01	-3.948640023845E-02	-1.096364404039E-03	-2.857827171249E-03	-1.023148151383E-03	-2.555648204869E-04	-4.783726181025E-05	-6.307378194427E-06	-5.736833419633E-07	-3.579179457816E-08	-1.507169025256E-09	-4.101596978392E-11	-6.522765556513E-13	-4.609331870117E-15
16	positive	0.0000141494	2.022074708634E-08	-1.226672644927E+00	-1.534677980549E-01	-9.813783213966E-02	1.816808886551E-01	-2.345773912355E-01	1.906151107351E-01	-1.056552549769E-01	4.173078769626E-02	-1.206247886329E-02	2.590060748360E-03	-4.153561404503E-04	4.955981912553E-05	-4.336783957092E-06	2.702473624852E-07	-1.135174449447E-08	2.880657809515E-10	-3.335781075446E-12
16	negative	0.0000382962	2.947870770404E-07	-1.226402280429E+00	2.361687472952E-01	-4.765807789539E-02	-1.287126706147E-02	-1.203358781554E-02	-5.427953984561E-03	-1.661330117577E-03	-3.606850824893E-04	-5.634524437589E-05	-6.428932030103E-06	-5.409642849128E-07	-3.358261811180E-08	-1.520637746697E-09	-4.886411770798E-11	-1.056063202641E-12	-1.376765255811E-14	-8.181417574156E-17
