Order	Fit Range	RMSE	Covariance	Coefficients
2	positive	0.8467432129	7.241438092288E+01	1.338282585442E+00	-2.694754372870E+00	-1.771765800388E-01
2	negative	1.4429967200	4.185301463203E+02	2.052681000615E+00	1.273325229964E+00	-8.498339270314E-02
4	positive	0.1006878332	1.023942015221E+00	-1.435063552674E+00	1.422190526786E+00	-1.559806135029E+00	1.616562046465E-01	-6.064669855729E-03
4	negative	0.3337720274	2.239215702672E+01	-2.360747725265E+00	-1.782327176487E+00	-5.609458554725E-01	-2.515909372123E-02	-4.060950367926E-04
6	positive	0.0629157891	3.997980482533E-01	-1.245928081924E+00	4.863509820126E-01	-5.575087108269E-01	-2.559747621516E-01	7.442354797808E-02	-7.223396539329E-03	2.442926576980E-04
6	negative	0.1183783248	2.816698983377E+00	-9.662451291075E-01	8.907850226750E-01	6.464821838732E-01	1.947365990323E-01	1.853805240825E-02	7.723133373295E-04	1.201170789528E-05
8	positive	0.0170771886	2.945466747020E-02	-1.029724167939E+00	-1.008699827575E+00	1.713667513044E+00	-1.671648050834E+00	5.215511641137E-01	-8.497963433661E-02	7.763547765274E-03	-3.771929003205E-04	7.601839162826E-06
8	negative	0.0770264111	1.192546669009E+00	-9.081005358667E-01	8.914197127481E-01	4.939126468006E-01	9.245096447606E-02	-7.884322827443E-03	-2.611172135565E-03	-2.169835624862E-04	-7.844029387657E-06	-1.071079851294E-07
10	positive	0.0064281903	4.173484730115E-03	-1.089940430016E+00	-2.056352042352E-01	-4.611319311240E-01	7.634735354800E-01	-9.095132257164E-01	4.080140170326E-01	-9.707258153854E-02	1.356017517643E-02	-1.120686164246E-03	5.087223409183E-05	-9.795324915510E-07
10	negative	0.0314218991	1.984544841333E-01	-1.213021041939E+00	-7.385951277456E-01	-1.481669669718E+00	-9.160806674783E-01	-2.792810900606E-01	-4.540784329983E-02	-4.371621929382E-03	-2.589075815692E-04	-9.292559032174E-06	-1.858070495134E-07	-1.590446257391E-09
12	positive	0.0031935294	1.030061600439E-03	-1.102162759973E+00	1.967063913248E-02	-1.240084433199E+00	1.854416183902E+00	-1.701649623298E+00	7.413635534374E-01	-1.822433284552E-01	2.667717805270E-02	-2.216650553449E-03	7.445989452029E-05	2.883249553075E-06	-3.349929887226E-07	8.452112540348E-09
12	negative	0.0128248399	3.305978049074E-02	-1.074902694330E+00	4.766699926944E-01	8.363503449387E-01	9.510088983987E-01	5.270832249638E-01	1.647199688618E-01	3.086562121926E-02	3.673134403867E-03	2.857962318115E-04	1.453469364560E-05	4.664795019793E-07	8.585800130915E-09	6.914391668063E-11
14	positive	0.0007366442	5.480709868065E-05	-1.093477312387E+00	-2.791203819719E-01	4.047895896403E-01	-1.817940648716E+00	2.668747753137E+00	-2.421074804578E+00	1.316384230596E+00	-4.592850988132E-01	1.082873061857E-01	-1.771391578598E-02	2.020187232412E-03	-1.579567782413E-04	8.084525600495E-06	-2.442311442406E-07	3.304025756619E-09
14	negative	0.0090108612	1.632031955919E-02	-1.077200263748E+00	3.976896079974E-01	5.209855783335E-01	4.879554683265E-01	1.836776908458E-01	1.515583487842E-02	-1.076803299632E-02	-4.115616009491E-03	-7.218946336315E-04	-7.674812139135E-05	-5.307160130728E-06	-2.411713059278E-07	-6.971972513206E-09	-1.165482593010E-10	-8.591357628072E-13
16	positive	0.0005012609	2.537742245225E-05	-1.093837678972E+00	-2.497726801950E-01	1.479434478158E-01	-9.449637993595E-01	1.109872373721E+00	-7.348469177578E-01	1.177109322961E-01	1.297587960155E-01	-9.832480882728E-02	3.500965642923E-02	-7.853082529478E-03	1.197299244304E-03	-1.266051645303E-04	9.182838417996E-06	-4.371692361342E-07	1.232819094294E-08	-1.562782866300E-10
16	negative	0.0041780346	3.508650776954E-03	-1.106454981163E+00	-1.109167255176E-01	-1.189070160224E+00	-1.909817253157E+00	-1.632383912961E+00	-8.308711789551E-01	-2.723206901202E-01	-6.038645946184E-02	-9.402635258224E-03	-1.053962149302E-03	-8.618032359324E-05	-5.150494839316E-06	-2.226689717545E-07	-6.781628390537E-09	-1.380139160691E-10	-1.684543371231E-12	-9.324040390559E-15
