Order	Fit Range	RMSE	Covariance	Coefficients
2	positive	1.1253692489	1.279120505873E+02	3.018472531905E+00	-5.327114400727E+00	-1.804433742687E-01
2	negative	0.1156097691	2.686489362955E+00	-7.526858814601E-01	4.510296893787E-01	-1.439461955414E-02
4	positive	0.2537690973	6.504274229099E+00	-8.416926428810E-01	7.156330666915E-01	-2.338022476999E+00	2.713963233529E-01	-1.113392928463E-02
4	negative	0.0059919403	7.216573091039E-03	-1.084626516990E+00	2.338219730699E-01	-4.547483137195E-02	-1.421672372463E-03	-1.685196797566E-05
6	positive	0.1139259048	1.310890289559E+00	-1.537809554153E+00	3.031384354612E+00	-4.064578466689E+00	7.676967611018E-01	-7.441736848335E-02	3.408351237285E-03	-5.351025793850E-05
6	negative	0.0004694190	4.429119130488E-05	-1.059107068694E+00	2.796964009083E-01	-2.603441419385E-02	1.896148867145E-03	2.505735893747E-04	1.018068271406E-05	1.475296140575E-07
8	positive	0.0468043955	2.212557955344E-01	-1.110526307200E+00	-2.107473123504E-01	1.320457028335E+00	-2.920133745562E+00	1.214671508220E+00	-2.470204430047E-01	2.731898551467E-02	-1.575340076222E-03	3.714222424023E-05
8	negative	0.0001288633	3.337757447256E-06	-1.058264935013E+00	2.816856904828E-01	-2.513719594903E-02	1.963419488025E-03	2.218124130201E-04	3.534726234184E-06	-4.228861530460E-07	-2.229886622068E-08	-3.314444241353E-10
10	positive	0.0225019614	5.114016513816E-02	-9.820143859595E-01	-1.733341994888E+00	5.031528824587E+00	-6.644792830467E+00	3.161498335095E+00	-8.372910559961E-01	1.363001642556E-01	-1.393228849162E-02	8.700411249167E-04	-3.022109260689E-05	4.446852048933E-07
10	negative	0.0000846602	1.440638928510E-06	-1.058642164147E+00	2.797280306113E-01	-2.743632892340E-02	8.312121521249E-04	-7.029973238458E-05	-4.027289654166E-05	-4.423707947711E-06	-2.463465552025E-07	-7.764078222812E-09	-1.318419260214E-10	-9.354515887844E-13
12	positive	0.0102667883	1.064610103617E-02	-1.049498491628E+00	-2.552038997393E-01	-8.918335509474E-01	3.097788240917E+00	-5.345176140292E+00	3.623422999864E+00	-1.365131244339E+00	3.218303243574E-01	-4.957756736884E-02	5.004609988121E-03	-3.196911436899E-04	1.173839391160E-05	-1.889156758414E-07
12	negative	0.0000842706	1.427409480779E-06	-1.058605712741E+00	2.800327373514E-01	-2.688131044543E-02	1.258146393280E-03	1.056492599209E-04	3.429712624389E-06	2.552376828309E-06	4.935236839155E-07	4.492068802446E-08	2.357237954552E-09	7.386663312028E-11	1.293826768258E-12	9.800233785588E-15
14	positive	0.0050705408	2.596748720176E-03	-1.070752235250E+00	4.320459398820E-01	-4.510989156994E+00	1.082226826873E+01	-1.411002324280E+01	9.649130246402E+00	-4.066536763535E+00	1.146385770185E+00	-2.250180156647E-01	3.124327321812E-02	-3.060721077611E-03	2.069644431360E-04	-9.187870241751E-06	2.407235852398E-07	-2.816458627032E-09
14	negative	0.0000835272	1.402335198120E-06	-1.058651552835E+00	2.794193519546E-01	-2.855203535550E-02	-6.501135838775E-04	-1.068655231281E-03	-4.379493989656E-04	-1.063293492938E-04	-1.790620569881E-05	-2.136670287477E-06	-1.808018130601E-07	-1.076033917027E-08	-4.402472690700E-10	-1.178951518734E-11	-1.860887808648E-13	-1.312749463429E-15
16	positive	0.0024248492	5.938649646193E-04	-1.060877106364E+00	-1.499671544116E-01	-7.566640331627E-02	-2.653956935501E+00	7.721428466752E+00	-1.200381675602E+01	1.016584840999E+01	-5.365347534172E+00	1.913924898611E+00	-4.824485723943E-01	8.786503597879E-02	-1.163483192886E-02	1.111159951221E-03	-7.462978719022E-05	3.346287507216E-06	-8.995572446504E-08	1.096720154978E-09
16	negative	0.0000781346	1.227110367751E-06	-1.058774637469E+00	2.771303191176E-01	-3.667508670978E-02	-1.266229264154E-02	-1.067233710528E-02	-5.167608583364E-03	-1.654937653905E-03	-3.715189956487E-04	-6.017485925700E-05	-7.150993986814E-06	-6.280592149254E-07	-4.068079615138E-08	-1.917963631438E-09	-6.397978061873E-11	-1.430614421722E-12	-1.923121774561E-14	-1.174622665012E-16
