Order	Fit Range	RMSE	Covariance	Coefficients
2	positive	0.7251018250	5.310303831334E+01	1.641991918796E+00	-3.549230570358E+00	-2.116560031888E-01
2	negative	1.0477829846	2.206676857467E+02	1.505036189046E+00	1.010027545290E+00	-7.270435623739E-02
4	positive	0.0802177021	6.499228532554E-01	-7.023827602291E-01	-1.034751903570E-01	-1.354762923678E+00	1.315451508648E-01	-4.830202749389E-03
4	negative	0.2157861844	9.359299149175E+00	-1.567919647971E+00	-1.054324248326E+00	-3.804576904264E-01	-1.515885785254E-02	-2.141276562822E-04
6	positive	0.0373525368	1.409164124358E-01	-9.036478253304E-01	5.430216871447E-01	-1.813883086654E+00	2.537859531919E-01	-1.837030127909E-02	5.121753591083E-04	1.795560403343E-06
6	negative	0.0525790903	5.556767091165E-01	-6.366316898636E-01	6.825640323468E-01	3.837627097871E-01	1.204876347668E-01	1.117985284689E-02	4.530581014364E-04	6.874858532088E-06
8	positive	0.0111184174	1.248553971110E-02	-7.570915353314E-01	-5.554292033181E-01	-9.210169236003E-03	-9.690591555731E-01	4.046202081680E-01	-8.081080721309E-02	8.799095058641E-03	-5.011126200723E-04	1.169425430933E-05
8	negative	0.0315041736	1.994951040881E-01	-6.803278199649E-01	4.372787720643E-01	1.142937952643E-01	5.881110011856E-03	-1.272094017710E-02	-2.241202851954E-03	-1.605612601468E-04	-5.394171237598E-06	-7.032271406074E-08
10	positive	0.0048687489	2.394176298840E-03	-7.299966674311E-01	-8.628813734150E-01	7.072419810286E-01	-1.649941564498E+00	7.365561970509E-01	-1.725081392434E-01	2.363827598935E-02	-1.873353697162E-03	7.560460612758E-05	-8.156202174474E-07	-2.295558450699E-08
10	negative	0.0123196835	3.050669474259E-02	-7.916581351652E-01	-1.388183776658E-01	-5.601557418654E-01	-3.250079095368E-01	-9.770074250344E-02	-1.491241399344E-02	-1.309202106565E-03	-6.907680550366E-05	-2.153080461085E-06	-3.614682686334E-08	-2.469819732732E-10
12	positive	0.0012422820	1.558697202315E-04	-7.459177474609E-01	-5.228480667653E-01	-6.299722139069E-01	5.104646006014E-01	-1.116901148075E+00	7.825866823287E-01	-2.922950530000E-01	6.756260797883E-02	-1.017763987221E-02	1.004901361401E-03	-6.287125292489E-05	2.264811338026E-06	-3.582195722647E-08
12	negative	0.0034820816	2.437103366101E-03	-7.351347096602E-01	3.458649094173E-01	3.436594742136E-01	3.871004016418E-01	2.031841025307E-01	6.179834896007E-02	1.127630445442E-02	1.304847033505E-03	9.871290945747E-05	4.885701672767E-06	1.528235441371E-07	2.745961072917E-09	2.162491658825E-11
14	positive	0.0006226997	3.916324973052E-05	-7.479157173867E-01	-4.626000957862E-01	-9.299081085076E-01	1.111371939711E+00	-1.749339407153E+00	1.179045517985E+00	-4.503956055873E-01	1.088908685681E-01	-1.724542549537E-02	1.755595252134E-03	-1.026719119355E-04	1.713809449497E-06	1.863984239314E-07	-1.279134891492E-08	2.580949251448E-10
14	negative	0.0020197750	8.199777352772E-04	-7.437928025472E-01	2.236302439785E-01	-2.540346092749E-03	-2.192569593298E-02	-5.625435334695E-02	-3.842577911137E-02	-1.407431190938E-02	-3.078736705154E-03	-4.321720573624E-04	-4.056931937055E-05	-2.585412133728E-06	-1.107613514873E-07	-3.060161697425E-09	-4.933110010313E-11	-3.528909994217E-13
16	positive	0.0001515663	2.320165218645E-06	-7.465618803689E-01	-5.398637285538E-01	-3.514574134850E-01	-6.173240962457E-01	1.006048799881E+00	-1.510138574708E+00	1.289035466891E+00	-6.742881712411E-01	2.359175973340E-01	-5.807700239257E-02	1.031932514988E-02	-1.333968638172E-03	1.245380050118E-04	-8.190135928311E-06	3.601915010882E-07	-9.512671229380E-09	1.141134799605E-10
16	negative	0.0009554298	1.834820257901E-04	-7.489193129983E-01	1.386355809307E-01	-2.764893900513E-01	-3.888048528922E-01	-3.201168731413E-01	-1.542643532713E-01	-4.749228441533E-02	-9.701996747362E-03	-1.357311552020E-03	-1.326172486022E-04	-9.082502499742E-06	-4.284764473775E-07	-1.319192514652E-08	-2.268648944761E-10	-7.774332149940E-13	4.122902329905E-14	5.333970180509E-16
