Order	Fit Range	RMSE	Covariance	Coefficients
2	positive	0.1623849279	2.663255344927E+00	-8.629125354719E-01	-5.453653012769E-01	-8.261543907054E-02
2	negative	0.0459832924	4.250070996655E-01	-1.077101194566E+00	2.617699018673E-01	-8.044863532850E-03
4	positive	0.0193107088	3.766325085551E-02	-1.249288011119E+00	-8.309689396832E-02	-1.922025790402E-01	5.997653396267E-03	1.141829445774E-04
4	negative	0.0021380492	9.188221302276E-04	-1.197029593369E+00	1.880772343932E-01	-1.748479951713E-02	-3.351734477651E-04	-8.961541715422E-07
6	positive	0.0016686984	2.812399968741E-04	-1.183121596710E+00	-3.144585439505E-01	-8.534809397388E-03	-5.154860909135E-02	8.450937966018E-03	-5.549520943437E-04	1.351353309934E-05
6	negative	0.0001284223	3.314949812914E-06	-1.189082317349E+00	2.014406147548E-01	-1.223584474822E-02	4.839145127540E-04	5.835545510508E-05	1.971987749330E-06	2.402630970288E-08
8	positive	0.0001519346	2.331496431667E-06	-1.189879017570E+00	-2.645884859912E-01	-8.932043257929E-02	2.427597564459E-03	-9.955985982026E-03	2.933041887786E-03	-3.582781493711E-04	2.086118492024E-05	-4.793874508880E-07
8	negative	0.0001283403	3.310715796334E-06	-1.189094420622E+00	2.013897674927E-01	-1.228366276157E-02	4.655396258771E-04	5.479058326937E-05	1.591381530682E-06	1.356030823135E-09	-7.058654747957E-10	-8.947886135358E-12
10	positive	0.0000590210	3.518313941717E-07	-1.189759137037E+00	-2.670529930895E-01	-8.078017390086E-02	-9.083908043662E-03	-2.095354273816E-03	-1.387880489640E-04	3.698168168347E-04	-8.558184505675E-05	8.895475688742E-06	-4.558807496241E-07	9.398896997924E-09
10	negative	0.0001261733	3.199862202119E-06	-1.188979003989E+00	2.020415621752E-01	-1.145020897746E-02	9.155438198717E-04	1.833144484715E-04	2.319162512379E-05	2.247201672158E-06	1.454841699518E-07	5.791405808026E-09	1.282717323767E-10	1.212082203860E-12
12	positive	0.0000424962	1.823989157398E-07	-1.189701740911E+00	-2.679547244804E-01	-7.820533322303E-02	-1.172421204331E-02	-1.134566617109E-03	4.496283817602E-05	8.139269696368E-05	2.861948994086E-05	-1.559586901765E-05	2.707546152410E-06	-2.366940715092E-07	1.064417658577E-08	-1.969609511288E-10
12	negative	0.0001258516	3.183562740172E-06	-1.188990253549E+00	2.019066872241E-01	-1.176614352072E-02	6.159980220518E-04	3.504207317285E-05	-2.025766246727E-05	-5.829040293242E-06	-8.421576348935E-07	-7.469277880641E-08	-4.198353281028E-09	-1.460946562973E-10	-2.877413863523E-12	-2.456033278799E-14
14	positive	0.0000378636	1.447985190319E-07	-1.189753714007E+00	-2.662026175119E-01	-8.771681684400E-02	9.220892598389E-03	-2.571166011070E-02	1.757066681707E-02	-8.097992245507E-03	2.638981419699E-03	-5.993306011912E-04	9.503951853556E-05	-1.051620233880E-05	7.983702082813E-07	-3.973837042606E-08	1.170142297746E-09	-1.547078386184E-11
14	negative	0.0001198159	2.885526592004E-06	-1.189161922765E+00	1.996613189120E-01	-1.777451724618E-02	-6.136305638355E-03	-4.057498357042E-03	-1.536521371014E-03	-3.747869899937E-04	-6.238393990769E-05	-7.281172518718E-06	-6.020652981491E-07	-3.510984656834E-08	-1.412298279124E-09	-3.729510354271E-11	-5.818986560219E-13	-4.065326385139E-15
16	positive	0.0000376590	1.432382390788E-07	-1.189762554668E+00	-2.656927681503E-01	-9.155637138443E-02	2.075912710604E-02	-4.420385780489E-02	3.571823998987E-02	-1.990160865707E-02	7.983406883237E-03	-2.336720070696E-03	5.080092023710E-04	-8.286682278576E-05	1.012519933646E-05	-9.132142601476E-07	5.895451871627E-08	-2.574347727573E-09	6.804401418532E-11	-8.213272442584E-13
16	negative	0.0000994706	1.988778225915E-06	-1.189442938720E+00	1.944659174814E-01	-3.612918703938E-02	-3.316524554610E-02	-2.557954805172E-02	-1.209388983279E-02	-3.818139550850E-03	-8.456554779164E-04	-1.353580885284E-04	-1.592708406903E-05	-1.387420535474E-06	-8.925267260135E-08	-4.183644647754E-09	-1.388675842761E-10	-3.091814453753E-12	-4.140620247966E-14	-2.520686680595E-16
