Order	Fit Range	RMSE	Covariance	Coefficients
2	positive	0.9269043301	8.677431535621E+01	1.738869397112E+00	-3.289753011874E+00	-1.868498567485E-01
2	negative	0.1283501594	3.311226446612E+00	-7.486577426612E-01	4.936861944370E-01	-1.551810473135E-02
4	positive	0.1188747778	1.427252492962E+00	-1.353166598200E+00	1.367220591999E+00	-1.778306934227E+00	1.901715657082E-01	-7.338471970588E-03
4	negative	0.0060926369	7.461165043616E-03	-1.124053243338E+00	2.451818778341E-01	-5.173744174918E-02	-1.714553872078E-03	-2.216439080964E-05
6	positive	0.0795341928	6.388944710425E-01	-1.335218103425E+00	1.036791678915E+00	-1.263069585846E+00	-7.227846134040E-02	5.017150613920E-02	-5.647404778655E-03	2.042147598643E-04
6	negative	0.0007060105	1.001886293851E-04	-1.097544565025E+00	2.937289095075E-01	-3.076313102008E-02	1.939411329923E-03	2.789152989610E-04	1.173677965066E-05	1.744886645251E-07
8	positive	0.0175087115	3.096205271896E-02	-1.035587147832E+00	-1.103635004671E+00	2.098049591125E+00	-2.246237234465E+00	7.664113121063E-01	-1.364567049415E-01	1.360548203780E-02	-7.204308501421E-04	1.580409312581E-05
8	negative	0.0001447012	4.208626211117E-06	-1.095733875533E+00	2.987195615739E-01	-2.771455429104E-02	2.642061889746E-03	3.445963855689E-04	1.270915370754E-05	-6.249711119029E-08	-1.504596356493E-08	-2.731288313058E-10
10	positive	0.0111077071	1.246149696576E-02	-1.075326328928E+00	-5.266115386037E-01	4.339874724476E-01	-2.770713716140E-01	-4.503608770560E-01	3.024897156905E-01	-8.380583371558E-02	1.275410859285E-02	-1.116201343183E-03	5.284337956607E-05	-1.051235667303E-06
10	negative	0.0000902674	1.637787784699E-06	-1.096168469187E+00	2.964702060807E-01	-3.034854156425E-02	1.349451118335E-03	1.251097914332E-05	-3.682898124182E-05	-4.555636918885E-06	-2.643436040747E-07	-8.435418252790E-09	-1.419009741564E-10	-9.725179200238E-13
12	positive	0.0036175905	1.321783069274E-03	-1.106883383771E+00	1.103975045485E-01	-1.960321563836E+00	3.417845943402E+00	-3.471523708846E+00	1.781876000570E+00	-5.472024089593E-01	1.088038483906E-01	-1.442930035483E-02	1.271876980053E-03	-7.170838809457E-05	2.343642364645E-06	-3.380604038616E-08
12	negative	0.0000884742	1.573364193721E-06	-1.096085414766E+00	2.971719853423E-01	-2.905734765682E-02	2.353058660225E-03	4.306821850929E-04	6.825428069378E-05	1.242805410164E-05	1.561008783096E-06	1.234111735285E-07	6.183503539899E-09	1.922957239833E-10	3.403458248327E-12	2.628808554727E-14
14	positive	0.0015588162	2.454206593960E-04	-1.097841297525E+00	-2.156103806936E-01	-1.097074139432E-01	-8.349338911495E-01	1.735299367804E+00	-2.093579343314E+00	1.341767185067E+00	-5.212454835978E-01	1.329436097461E-01	-2.313334272513E-02	2.775846897523E-03	-2.265990862856E-04	1.203829634978E-05	-3.757719797101E-07	5.233381108267E-09
14	negative	0.0000874912	1.538596891849E-06	-1.096137433974E+00	2.964704979938E-01	-3.097930450768E-02	1.462925399623E-04	-9.338839678691E-04	-4.469394636604E-04	-1.151950099382E-04	-2.009040236376E-05	-2.453180758584E-06	-2.108890490326E-07	-1.268998668581E-08	-5.232298228641E-10	-1.408816367568E-11	-2.232192638151E-13	-1.578835539616E-15
16	positive	0.0007764438	6.088934941098E-05	-1.095568566837E+00	-3.318005082730E-01	7.030339988711E-01	-3.101604030191E+00	5.090497845086E+00	-5.114521200327E+00	3.129606413614E+00	-1.250283885422E+00	3.436684978048E-01	-6.694500964660E-02	9.345976307697E-03	-9.302719207084E-04	6.444413164571E-05	-2.944900345096E-06	7.902188606532E-08	-8.929571003213E-10	-2.200403736337E-12
16	negative	0.0000810782	1.321309385270E-06	-1.096274825013E+00	2.939187012616E-01	-4.002600635872E-02	-1.321957980570E-02	-1.161045330305E-02	-5.700483454357E-03	-1.833899298296E-03	-4.122223357025E-04	-6.676189786136E-05	-7.928079016142E-06	-6.956177556488E-07	-4.500829052440E-08	-2.119755752179E-09	-7.064186877650E-11	-1.578181135842E-12	-2.119818923930E-14	-1.293866175486E-16
