Order	Fit Range	RMSE	Covariance	Coefficients
2	positive	0.8513782636	7.320933971807E+01	1.841487976151E+00	-3.899717689561E+00	-1.350710300851E-01
2	negative	0.0920088588	1.701591649645E+00	-8.994406809276E-01	3.414998651293E-01	-1.521640485604E-02
4	positive	0.1492451708	2.249686222751E+00	-1.076764498241E+00	6.213261200519E-01	-1.730949564800E+00	1.981621737170E-01	-8.010206988888E-03
4	negative	0.0069048497	9.583066848920E-03	-1.128401033617E+00	2.051161509797E-01	-3.162792568743E-02	-4.792319063278E-04	2.963398597745E-06
6	positive	0.0745503353	5.613330016013E-01	-1.393218753473E+00	1.569865311678E+00	-2.334661322946E+00	3.276888095641E-01	-1.527136069280E-02	-5.904168052360E-04	5.374511879634E-05
6	negative	0.0003225828	2.091599699443E-05	-1.103214951961E+00	2.471206924832E-01	-1.529507628467E-02	2.036295316595E-03	1.817317486052E-04	5.800217628569E-06	6.792626254918E-08
8	positive	0.0191148646	3.690318298026E-02	-1.099605313238E+00	-6.015719318606E-01	1.189728853707E+00	-2.031715638969E+00	7.909465628825E-01	-1.536795433905E-01	1.640664952443E-02	-9.195860827941E-04	2.118029378925E-05
8	negative	0.0000995386	1.991492851063E-06	-1.104651104629E+00	2.422861594940E-01	-1.908787569614E-02	7.936843366504E-04	-2.697413769376E-05	-1.371452091514E-05	-9.593013173387E-07	-2.847043537297E-08	-3.231451460289E-10
10	positive	0.0116637124	1.374026080258E-02	-1.069754658814E+00	-9.061884041563E-01	1.813171709196E+00	-2.519334119786E+00	9.592077314970E-01	-1.723523239277E-01	1.229369249702E-02	6.688791146003E-04	-1.892454875446E-04	1.307119322648E-05	-3.187404687243E-07
10	negative	0.0000985987	1.954063160072E-06	-1.104607584947E+00	2.425671863531E-01	-1.868684308588E-02	1.032500733797E-03	4.761460888024E-05	-9.952831099331E-08	5.694096643456E-07	7.846698358654E-08	4.217258627493E-09	1.070500751592E-10	1.074923694527E-12
12	positive	0.0029222634	8.625019319409E-04	-1.107696565270E+00	-1.016579581810E-01	-1.333307629435E+00	2.536878517027E+00	-3.355234944111E+00	2.038727631851E+00	-7.150221410463E-01	1.596076302800E-01	-2.352213293783E-02	2.288093237964E-03	-1.416193020310E-04	5.060087817268E-06	-7.952127646186E-08
12	negative	0.0000922153	1.709237676778E-06	-1.104761576276E+00	2.411651302536E-01	-2.143818951786E-02	-1.242798718712E-03	-9.598697614729E-04	-2.689541934528E-04	-4.555334786493E-05	-5.181753486618E-06	-3.989043339041E-07	-2.041190255200E-08	-6.641482475133E-10	-1.243244387313E-11	-1.019441328857E-13
14	positive	0.0020355806	4.185023964991E-04	-1.109524450766E+00	-6.185963682663E-02	-1.466064779045E+00	2.646286371499E+00	-3.260479628057E+00	1.803730221619E+00	-5.226574028612E-01	7.018913606120E-02	3.149584578174E-03	-3.058350957639E-03	5.880264225251E-04	-6.191008042158E-05	3.879584896750E-06	-1.362452793846E-07	2.074545123419E-09
14	negative	0.0000675553	9.173077927849E-07	-1.105049541114E+00	2.374659670600E-01	-3.119367359189E-02	-1.205671281734E-02	-7.427811813541E-03	-2.634567498969E-03	-6.139787833335E-04	-9.883304875154E-05	-1.123381549463E-05	-9.087342227647E-07	-5.201509713569E-08	-2.059028002015E-09	-5.362129255702E-11	-8.264866455318E-13	-5.712338575027E-15
16	positive	0.0004932318	2.457075792576E-05	-1.105142452950E+00	-3.092508717570E-01	3.747097589988E-01	-2.822572773574E+00	5.405112084383E+00	-6.603169672546E+00	4.882059107178E+00	-2.348171390034E+00	7.799225886880E-01	-1.854486190742E-01	3.214662506947E-02	-4.078921136508E-03	3.752535466240E-04	-2.438318145629E-05	1.061505192649E-06	-2.778925169734E-08	3.307883904555E-10
16	negative	0.0000413191	3.431620989517E-07	-1.105274572014E+00	2.333791431792E-01	-4.543403817839E-02	-3.275238220524E-02	-2.369448989396E-02	-1.051180389729E-02	-3.150396402088E-03	-6.684476453567E-04	-1.031881460781E-04	-1.177135653692E-05	-9.983395509845E-07	-6.274435207365E-08	-2.881599863294E-09	-9.393769246749E-11	-2.058170175809E-12	-2.717048704251E-14	-1.632834978903E-16
