Order	Fit Range	RMSE	Covariance	Coefficients
2	positive	0.8058168291	6.558341697420E+01	1.310242837346E+00	-2.671894032292E+00	-1.651307599719E-01
2	negative	0.3371302815	2.284502216447E+01	-5.324910776584E-02	8.380359555879E-01	-2.569544365874E-02
4	positive	0.0914898953	8.454104958098E-01	-1.331823893408E+00	1.251349472866E+00	-1.483191488446E+00	1.541790387588E-01	-5.787750089664E-03
4	negative	0.0204553378	8.410258948413E-02	-1.127559450428E+00	8.690909676958E-02	-1.442931936735E-01	-6.397469084470E-03	-1.068018305716E-04
6	positive	0.0571947541	3.303952295654E-01	-1.172852992422E+00	4.457470019267E-01	-6.076812447202E-01	-2.143823397231E-01	6.578885533183E-02	-6.461891280694E-03	2.195794332459E-04
6	negative	0.0080034663	1.287514988997E-02	-1.050270221267E+00	2.446959331486E-01	-6.896880896629E-02	8.025122709731E-03	1.193962077950E-03	5.531327170340E-05	8.944884548484E-07
8	positive	0.0145486091	2.137786479724E-02	-9.741132682640E-01	-9.317893369127E-01	1.490174517612E+00	-1.525766443550E+00	4.813834052599E-01	-7.903133840002E-02	7.272934583530E-03	-3.561084319374E-04	7.237891854523E-06
8	negative	0.0015936844	5.105058358347E-04	-1.022165186875E+00	3.306714633796E-01	-8.293572636740E-03	2.558905301359E-02	3.734889852676E-03	2.524956842848E-04	9.021429932252E-06	1.589794360725E-07	1.004406872217E-09
10	positive	0.0056202430	3.190300261211E-03	-1.024973719088E+00	-2.512717967400E-01	-3.575484427809E-01	5.481372764659E-01	-7.402176220596E-01	3.427386569045E-01	-8.260975818152E-02	1.161808068536E-02	-9.640705145086E-04	4.387964079411E-05	-8.464880261315E-07
10	negative	0.0002001062	8.048540864872E-06	-1.029721557057E+00	2.888656621278E-01	-6.072539678362E-02	-2.171947305010E-03	-4.036814610991E-03	-1.027094287753E-03	-1.212385479524E-04	-8.137345687235E-06	-3.208486124498E-07	-6.954207119331E-09	-6.415346230630E-11
12	positive	0.0026192805	6.929236424527E-04	-1.036444677205E+00	-3.664023742850E-02	-1.110625950010E+00	1.622468950270E+00	-1.539727677397E+00	6.911420811897E-01	-1.765340683704E-01	2.750131483194E-02	-2.594966783603E-03	1.325557838757E-04	-1.853664154085E-06	-1.300563588565E-07	4.736462306716E-09
12	negative	0.0001047158	2.204044605459E-06	-1.029787850295E+00	2.890090012018E-01	-5.926422204843E-02	-8.258828403780E-05	-2.751763881759E-03	-5.948217955495E-04	-3.275498399928E-05	3.486106031643E-06	6.803027184098E-07	4.929782734069E-08	1.921527147505E-09	3.997353572039E-11	3.500113205864E-13
14	positive	0.0005907267	3.524475259189E-05	-1.029290772473E+00	-2.833482948348E-01	2.497859054392E-01	-1.419689721464E+00	2.086571500776E+00	-1.937219634290E+00	1.071123443850E+00	-3.777862353735E-01	8.973010024020E-02	-1.475703209546E-02	1.689938994264E-03	-1.325787231587E-04	6.804826763053E-06	-2.060760149431E-07	2.793908666742E-09
14	negative	0.0000592518	7.056660586014E-07	-1.029462572237E+00	2.928987976846E-01	-4.963090782806E-02	9.933660907121E-03	2.851290846324E-03	1.314598580122E-03	3.928144875876E-04	6.817716388373E-05	7.542683625245E-06	5.613529591188E-07	2.862185181238E-08	9.894471205261E-10	2.220354437893E-11	2.918758004953E-13	1.704500879063E-15
16	positive	0.0003991752	1.609337823070E-05	-1.029436976222E+00	-2.677642997401E-01	1.025017657195E-01	-8.926377976447E-01	1.108458090206E+00	-8.467281145997E-01	2.767406420466E-01	2.056505321868E-02	-5.239638053870E-02	2.204269163191E-02	-5.288582089962E-03	8.359067771710E-04	-9.038188929483E-05	6.654770548973E-06	-3.202430683294E-07	9.103893851493E-09	-1.161271155471E-10
16	negative	0.0000481129	4.652868423227E-07	-1.029607677329E+00	2.902106460901E-01	-5.914248438532E-02	-4.093398446893E-03	-8.333662510259E-03	-4.179625128308E-03	-1.401596276823E-03	-3.405497639497E-04	-5.937853276639E-05	-7.456499069216E-06	-6.797966533750E-07	-4.508462433218E-08	-2.155356521158E-09	-7.242183156895E-11	-1.623878220346E-12	-2.182497747579E-14	-1.330215721473E-16
