Order	Fit Range	RMSE	Covariance	Coefficients
2	positive	0.0001590699	2.555625976409E-06	-1.247654423128E+00	-1.330619369628E-02	-3.384117009043E-04
2	negative	0.0102373431	2.106544184534E-02	-1.226547305875E+00	1.337334140629E-01	-4.536370690977E-03
4	positive	0.0000891768	8.032024465221E-07	-1.247427108162E+00	-1.350790160513E-02	-3.263579413470E-04	6.902513896524E-06	-6.726300145772E-07
4	negative	0.0004253494	3.636533993984E-05	-1.248244943612E+00	1.223297584575E-01	-5.522749391631E-03	1.132987348204E-05	1.931756330342E-06
6	positive	0.0000125628	1.594026889993E-08	-1.247770153731E+00	-1.223094790258E-02	-1.413248171522E-03	3.766690487762E-04	-5.987914087080E-05	4.467488666519E-06	-1.280826606335E-07
6	negative	0.0001535571	4.739536229883E-06	-1.246910283057E+00	1.244820653107E-01	-4.721452873571E-03	1.275542739842E-04	9.488642340829E-06	2.117859809125E-07	1.851634274689E-09
8	positive	0.0000044813	2.028284080996E-09	-1.247729546919E+00	-1.256684287181E-02	-8.148470315173E-04	-5.981254180537E-05	1.018082243811E-04	-2.868233619401E-05	3.682378737379E-06	-2.299092651857E-07	5.667253789199E-09
8	negative	0.0001493476	4.483248509636E-06	-1.246739144241E+00	1.250693689326E-01	-4.251914784926E-03	2.843878305852E-04	3.636050377039E-05	2.776795577820E-06	1.397910361722E-07	3.909034616418E-09	4.540582961812E-11
10	positive	0.0000014572	2.144584810218E-10	-1.247718933519E+00	-1.268439639060E-02	-5.482076990263E-04	-3.043604050012E-04	2.151636411156E-04	-5.764902988233E-05	7.767662007132E-06	-5.056993650572E-07	6.992745535506E-09	8.598783937420E-10	-3.376586956150E-11
10	negative	0.0001481710	4.412883524119E-06	-1.246787227823E+00	1.247446171472E-01	-4.730080900090E-03	-7.422917892518E-06	-5.661279456366E-05	-1.447750361425E-05	-1.824903352938E-06	-1.351901354507E-07	-5.922528557513E-09	-1.420006322568E-10	-1.437448735460E-12
12	positive	0.0000010812	1.180592527637E-10	-1.247722216131E+00	-1.261479333873E-02	-8.204147925934E-04	1.330497641700E-04	-1.580668490466E-04	1.336203683847E-04	-5.514708188613E-05	1.324254419420E-05	-2.011250912599E-06	1.976385601158E-07	-1.225523092449E-08	4.376470237686E-10	-6.877575845103E-12
12	negative	0.0001287576	3.332282304857E-06	-1.247135073723E+00	1.216534397689E-01	-1.067623443525E-02	-4.835251798859E-03	-2.157774280499E-03	-5.661111513894E-04	-9.500378028709E-05	-1.060643666546E-05	-7.971822695761E-07	-3.987949814880E-08	-1.273267635488E-09	-2.347855948905E-11	-1.902617696129E-13
14	positive	0.0000008054	6.552235344565E-11	-1.247724197206E+00	-1.254738265451E-02	-1.188745958718E-03	9.493863701057E-04	-1.122351569072E-03	8.260386817011E-04	-3.806726337993E-04	1.179332654878E-04	-2.561362510141E-05	3.963232172254E-06	-4.353364940219E-07	3.317536253325E-08	-1.667320950804E-09	4.968383926483E-11	-6.647095098497E-13
14	negative	0.0000787969	1.247998461004E-06	-1.247602812492E+00	1.156657957471E-01	-2.642173935063E-02	-2.224118709923E-02	-1.254044481634E-02	-4.353399421347E-03	-1.002635019164E-03	-1.597515496640E-04	-1.800742374804E-05	-1.447239047363E-06	-8.241831121052E-08	-3.249227011441E-09	-8.432976987208E-11	-1.296048566911E-12	-8.935135863282E-15
16	positive	0.0000004368	1.926752866281E-11	-1.247722746051E+00	-1.263448353915E-02	-5.185367404081E-04	-1.104936711596E-03	2.233722437161E-03	-2.529785736834E-03	1.842626310902E-03	-9.071741431022E-04	3.136562861298E-04	-7.811866317452E-05	1.419852013589E-05	-1.886147923753E-06	1.811747540651E-07	-1.225195958066E-08	5.532571453727E-10	-1.497464865876E-11	1.837273922007E-13
16	negative	0.0000412412	3.418689044509E-07	-1.247879179086E+00	1.107092090415E-01	-4.352140765922E-02	-4.685119668265E-02	-3.169474122183E-02	-1.353687979934E-02	-3.929711260435E-03	-8.102970231669E-04	-1.219151612419E-04	-1.358892685541E-05	-1.128430682035E-06	-6.956408410611E-08	-3.138589889343E-09	-1.006536536380E-10	-2.172167283723E-12	-2.827549150803E-14	-1.677205837752E-16
