Order	Fit Range	RMSE	Covariance	Coefficients
2	positive	0.8923338840	8.042223580907E+01	1.794031687143E+00	-3.526677153991E+00	-1.518531862842E-01
2	negative	0.1032889426	2.144389739125E+00	-8.536444972913E-01	4.108719346023E-01	-1.529389272880E-02
4	positive	0.1335163021	1.800486896330E+00	-1.238767731624E+00	1.120521051747E+00	-1.772093767375E+00	1.983231010010E-01	-7.882490159584E-03
4	negative	0.0064783848	8.435863371860E-03	-1.130135113748E+00	2.378976077127E-01	-3.820883334572E-02	-8.875922432324E-04	-5.407835445734E-06
6	positive	0.0811802954	6.656142760143E-01	-1.380930056970E+00	1.389098185379E+00	-1.769376547415E+00	1.112304209772E-01	2.137273177683E-02	-3.500483191823E-03	1.421797447280E-04
6	negative	0.0002040263	8.366974163702E-06	-1.104637897369E+00	2.818275357315E-01	-2.044705850665E-02	1.985387904414E-03	2.121924704397E-04	7.698439683726E-06	1.021689825398E-07
8	positive	0.0172128098	2.992436286252E-02	-1.065203468411E+00	-9.031388722135E-01	1.887158430272E+00	-2.293542240597E+00	8.280319924581E-01	-1.537335333791E-01	1.586641685094E-02	-8.654580985319E-04	1.948693585476E-05
8	negative	0.0001026046	2.116068755197E-06	-1.105207153782E+00	2.795486986528E-01	-2.251929766772E-02	1.209285362056E-03	6.466471916322E-05	-7.792339943194E-06	-8.078169982370E-07	-2.800326800275E-08	-3.514340255668E-10
10	positive	0.0123837863	1.548917435685E-02	-1.075437653283E+00	-6.927236706586E-01	1.157977686603E+00	-1.310648281262E+00	1.568518835925E-01	1.085578261426E-01	-4.630328910148E-02	8.223438279340E-03	-7.810131922808E-04	3.892690099151E-05	-8.025595009220E-07
10	negative	0.0000931717	1.744873961584E-06	-1.105332370756E+00	2.789460627477E-01	-2.316634456441E-02	9.259902774375E-04	2.668673519599E-06	-1.501253251132E-05	-1.223238110066E-06	-3.302687878195E-08	3.309574964912E-10	3.477637357155E-11	5.164513762872E-13
12	positive	0.0030877131	9.629311885912E-04	-1.114059524928E+00	1.066812301036E-01	-1.909462037983E+00	3.525745123273E+00	-3.889928415538E+00	2.140556709629E+00	-7.005811784402E-01	1.480295724297E-01	-2.082626988820E-02	1.945331480313E-03	-1.161332763093E-04	4.016573130922E-06	-6.128218130341E-08
12	negative	0.0000925539	1.721810079623E-06	-1.105364669945E+00	2.786292084139E-01	-2.382410949705E-02	3.551677284222E-04	-2.610621562296E-04	-8.811571215148E-05	-1.420116390155E-05	-1.559857016399E-06	-1.200449949840E-07	-6.253797695196E-09	-2.082987327013E-10	-3.989878767131E-12	-3.339443677069E-14
14	positive	0.0020153325	4.102180071831E-04	-1.108978252143E+00	-9.015723145669E-02	-7.434282682656E-01	7.439489469015E-01	-3.646183369030E-01	-5.692523192560E-01	6.608802311480E-01	-3.192666467158E-01	9.148419251297E-02	-1.713902781405E-02	2.165874379587E-03	-1.837952426482E-04	1.006544305710E-05	-3.220127218778E-07	4.577157973615E-09
14	negative	0.0000862342	1.494702912598E-06	-1.105516423271E+00	2.766552048656E-01	-2.908322455852E-02	-5.530966173024E-03	-3.814677162660E-03	-1.399747619844E-03	-3.322010082100E-04	-5.441427069384E-05	-6.287991457069E-06	-5.162544220506E-07	-2.993681771717E-08	-1.198592495649E-09	-3.152630106559E-11	-4.902231450272E-13	-3.414876841874E-15
16	positive	0.0006473257	4.232202309694E-05	-1.105052741729E+00	-3.037677341065E-01	8.117616754590E-01	-3.778681678586E+00	6.645409993660E+00	-7.215314098423E+00	4.831606587411E+00	-2.138596115294E+00	6.603589386660E-01	-1.469683686632E-01	2.396218820680E-02	-2.870549745025E-03	2.500978995766E-04	-1.543036568046E-05	6.392929286833E-07	-1.595987783047E-08	1.814995490967E-10
16	negative	0.0000688515	9.528486381849E-07	-1.105735332586E+00	2.726161952824E-01	-4.333053409731E-02	-2.648093548344E-02	-2.047268689074E-02	-9.559771514886E-03	-2.990001270086E-03	-6.581765356298E-04	-1.048805816442E-04	-1.229776101509E-05	-1.068203730474E-06	-6.855292400512E-08	-3.206806178188E-09	-1.062556826403E-10	-2.362072125229E-12	-3.159002534189E-14	-1.920749081674E-16
