Order	Fit Range	RMSE	Covariance	Coefficients
2	positive	0.1981761846	3.966653813505E+00	7.053784652563E-01	-2.602772134354E+00	-3.531486583078E-02
2	negative	1.0169442483	2.078692964251E+02	3.761710329138E+00	2.485271893061E+00	-3.680560558149E-02
4	positive	0.0329494482	1.096522799837E-01	3.194126869116E-02	-1.568666878244E+00	-3.967244282926E-01	4.436285989153E-02	-1.769178562183E-03
4	negative	0.2285802926	1.050203898097E+01	1.276639609834E-01	-3.243446947360E-01	-5.385253647344E-01	-3.166953351814E-02	-6.530579229372E-04
6	positive	0.0029401207	8.730753002631E-04	-7.908106369803E-02	-1.183318009591E+00	-6.999345026971E-01	1.382848732027E-01	-1.516755936977E-02	8.724597878536E-04	-2.053276522332E-05
6	negative	0.0995574037	1.992247003694E+00	-5.474382547165E-01	-1.401835629757E+00	-9.340714435109E-01	-8.786054216334E-02	-4.183980195107E-03	-9.258665148588E-05	-6.707048609529E-07
8	positive	0.0012471870	1.571030284967E-04	-6.834525974939E-02	-1.266861698273E+00	-5.581360894685E-01	3.917690127445E-02	2.015918577985E-02	-6.120790119383E-03	7.578750108272E-04	-4.559434660349E-05	1.093480748334E-06
8	negative	0.0386493941	3.002489091933E-01	-1.052241252586E-01	1.361692164393E-01	3.112663218395E-01	3.333778386308E-01	6.890534565018E-02	6.972561744981E-03	3.841086691537E-04	1.104339260943E-05	1.299195888364E-07
10	positive	0.0000863318	7.527716042352E-07	-6.405693956911E-02	-1.319260701310E+00	-4.265609109252E-01	-9.736095268362E-02	9.433570229886E-02	-2.966022752280E-02	5.349245655542E-03	-6.025993075846E-04	4.199094009924E-05	-1.660307921188E-06	2.853172159526E-08
10	negative	0.0185783730	6.937634460553E-02	2.493398942111E-02	8.097336783514E-01	1.099874254638E+00	7.203036071726E-01	1.682860927738E-01	2.179285124058E-02	1.727772397234E-03	8.555422590230E-05	2.567559067603E-06	4.232600859902E-08	2.894472739607E-10
12	positive	0.0000548293	3.036313295004E-07	-6.418385143142E-02	-1.316022259775E+00	-4.408785610237E-01	-7.175402345784E-02	7.024227190136E-02	-1.613899703990E-02	5.057871167919E-04	5.446647960548E-04	-1.398445269356E-04	1.741531386498E-05	-1.242374154893E-06	4.869138552776E-08	-8.167337112808E-10
12	negative	0.0078384714	1.234976851836E-02	-5.646411233856E-02	9.690826730476E-02	-2.542674930684E-01	-3.661767722610E-01	-2.991694128160E-01	-9.956755485917E-02	-1.854941580195E-02	-2.169005347181E-03	-1.660325966418E-04	-8.338993450706E-06	-2.652977669148E-07	-4.855177683989E-09	-3.896969853129E-11
14	positive	0.0000267065	7.203719693381E-08	-6.430834647368E-02	-1.311882769939E+00	-4.631308662445E-01	-2.323422711017E-02	1.389643901538E-02	2.359984694770E-02	-1.782291312854E-02	6.320270568298E-03	-1.413819663770E-03	2.159564650173E-04	-2.299243492703E-05	1.686299666865E-06	-8.144653633282E-08	2.335813094297E-09	-3.016305519406E-11
14	negative	0.0039981491	3.213024492365E-03	-8.088601286156E-02	-1.927578243237E-01	-9.661083034684E-01	-1.100068313482E+00	-7.058065904436E-01	-2.366385508158E-01	-4.871612974543E-02	-6.687194734702E-03	-6.369328926168E-04	-4.273287823823E-05	-2.011861838950E-06	-6.490977095528E-08	-1.361480883540E-09	-1.662335102080E-11	-8.882766585287E-14
16	positive	0.0000255538	6.595260716415E-08	-6.429422384505E-02	-1.312773195475E+00	-4.561074701839E-01	-4.523709314083E-02	5.057708309843E-02	-1.378429932122E-02	7.396436472010E-03	-5.509220892856E-03	2.565885189312E-03	-7.620421279431E-04	1.539921951687E-04	-2.186052450130E-05	2.192645193678E-06	-1.526883905001E-07	7.038893647886E-09	-1.934336551108E-10	2.401099686962E-12
16	negative	0.0017191321	5.940390316075E-04	-6.565715685325E-02	8.802003970034E-02	2.376572463350E-02	3.547287851538E-01	4.503583518687E-01	3.294304613019E-01	1.355664777995E-01	3.515499706766E-02	6.192448341967E-03	7.729635556264E-04	6.983856262294E-05	4.593957261145E-06	2.181681142818E-07	7.292292844772E-09	1.628309295782E-10	2.181023777741E-12	1.325513787891E-14
