Order	Fit Range	RMSE	Covariance	Coefficients
2	positive	0.9558235888	9.227347202114E+01	1.864892535478E+00	-3.550155173449E+00	-1.665762791739E-01
2	negative	0.1178831905	2.793185765034E+00	-8.476335936270E-01	3.815996573726E-01	-1.523740669025E-02
4	positive	0.1368744432	1.892195933645E+00	-1.365347593888E+00	1.372806835993E+00	-1.872318759763E+00	2.072586646125E-01	-8.164896645900E-03
4	negative	0.0080912557	1.315915219879E-02	-1.169637628360E+00	1.774098054878E-01	-4.295004385028E-02	-1.136006850603E-03	-9.274540622868E-06
6	positive	0.0894700990	8.084947610126E-01	-1.417480131963E+00	1.277094923158E+00	-1.533649275930E+00	-3.769164358315E-03	4.264783979604E-02	-5.271813871219E-03	1.976434584436E-04
6	negative	0.0003034496	1.850841475728E-05	-1.137034156215E+00	2.342095134047E-01	-1.969157994436E-02	2.683003224476E-03	2.852780697265E-04	1.065727547438E-05	1.455161658465E-07
8	positive	0.0197798123	3.951533838034E-02	-1.075753326832E+00	-1.181271202050E+00	2.353403454203E+00	-2.536486460448E+00	8.838086141215E-01	-1.602569478046E-01	1.623145789541E-02	-8.713758175952E-04	1.934987234903E-05
8	negative	0.0001099375	2.429335893466E-06	-1.137715098159E+00	2.312833606030E-01	-2.248454336452E-02	1.598033677205E-03	7.301872214677E-05	-1.215582449931E-05	-1.220690271919E-06	-4.273019016044E-08	-5.437291023611E-10
10	positive	0.0136030481	1.868933478817E-02	-1.109575602132E+00	-6.644750473434E-01	8.121749393240E-01	-6.627984560311E-01	-3.004961120737E-01	2.753572443505E-01	-8.208680785565E-02	1.293191738751E-02	-1.155624012212E-03	5.549691334339E-05	-1.115730447882E-06
10	negative	0.0000776176	1.210922784892E-06	-1.137917898886E+00	2.303390988149E-01	-2.345432804486E-02	1.201495815360E-03	-3.851571957986E-06	-1.892132140055E-05	-1.279184773021E-06	-4.185953875852E-09	2.681595280296E-09	1.091925348612E-10	1.393110873541E-12
12	positive	0.0041126085	1.708268383820E-03	-1.149830904163E+00	1.570546651821E-01	-2.304028984114E+00	4.192545864539E+00	-4.312176546214E+00	2.262540303693E+00	-7.125771242575E-01	1.455093842373E-01	-1.983312634765E-02	1.797773327625E-03	-1.042839462685E-04	3.508358561925E-06	-5.211761052301E-08
12	negative	0.0000755257	1.146529119803E-06	-1.137852527431E+00	2.308586833197E-01	-2.255414844882E-02	1.856743556873E-03	2.498558891865E-04	3.973817863511E-05	7.333854296560E-06	8.230331809375E-07	5.490319212551E-08	2.231465700598E-09	5.379923668423E-11	6.896277155941E-13	3.404147050165E-15
14	positive	0.0021329078	4.594788085395E-04	-1.140488986979E+00	-1.860109549901E-01	-3.342895807139E-01	-3.808166022508E-01	1.341880851079E+00	-1.985154072196E+00	1.376453228031E+00	-5.573129440986E-01	1.459394429792E-01	-2.587692501319E-02	3.150075806217E-03	-2.601293357566E-04	1.395182000084E-05	-4.390181040675E-07	6.156583514351E-09
14	negative	0.0000728652	1.067176681604E-06	-1.137940498926E+00	2.297051198991E-01	-2.564719183147E-02	-1.625769872943E-03	-1.864635858197E-03	-7.450062996834E-04	-1.839345117104E-04	-3.113086060080E-05	-3.692589821511E-06	-3.091294580378E-07	-1.818090392053E-08	-7.353865541545E-10	-1.948743228941E-11	-3.047031776141E-13	-2.131439178722E-15
16	positive	0.0009453605	9.026431598702E-05	-1.136921857238E+00	-3.740417721653E-01	1.007716266040E+00	-4.204816692998E+00	7.140606048161E+00	-7.352798396758E+00	4.657226751479E+00	-1.947134613420E+00	5.665156831029E-01	-1.183846504810E-01	1.804290574758E-02	-2.009649102202E-03	1.617563162502E-04	-9.149756248578E-06	3.443692249474E-07	-7.722556600526E-09	7.778683629664E-11
16	negative	0.0000640642	8.249476107992E-07	-1.138086571930E+00	2.270048535162E-01	-3.518601740631E-02	-1.567136794089E-02	-1.304764741427E-02	-6.230243853466E-03	-1.972836035354E-03	-4.380264329196E-04	-7.022107165936E-05	-8.268969335785E-06	-7.205198885611E-07	-4.635292537910E-08	-2.172622874240E-09	-7.210906237163E-11	-1.605318156691E-12	-2.149692678215E-14	-1.308576374183E-16
