Order	Fit Range	RMSE	Covariance	Coefficients
2	positive	0.0022927462	5.309251778390E-04	-1.226301588643E+00	-1.186938876704E-01	-1.171058031078E-02
2	negative	0.5136374641	5.302851234920E+01	1.385310987133E-01	9.986868490021E-01	-3.882599599030E-02
4	positive	0.0001120168	1.267323025000E-06	-1.218826520108E+00	-1.297071326184E-01	-8.046064590671E-03	-4.233545042749E-04	1.562875672979E-05
4	negative	0.0474884393	4.532855250488E-01	-1.436720770141E+00	-7.790819502789E-02	-2.034576195457E-01	-8.456155356687E-03	-1.297082283454E-04
6	positive	0.0001118857	1.264359720025E-06	-1.218809787469E+00	-1.297838323359E-01	-7.967986834996E-03	-4.546829414238E-04	2.149181421000E-05	-5.139182035213E-07	1.704710819165E-08
6	negative	0.0109013831	2.388687104678E-02	-1.229902364767E+00	3.153489389182E-01	-2.716888342148E-02	2.341591292545E-02	2.596788075520E-03	1.103967722375E-04	1.705654308473E-06
8	positive	0.0001033468	1.078735662231E-06	-1.218970413868E+00	-1.284891034763E-01	-1.022915976448E-02	1.166757677145E-03	-5.701988098757E-04	1.191863445186E-04	-1.357790940564E-05	8.114165204104E-07	-1.980509005898E-08
8	negative	0.0037890101	2.885676137813E-03	-1.205155645513E+00	3.814899289096E-01	1.125381179329E-02	3.140288853955E-02	3.125114511914E-03	7.948310587935E-05	-4.399045429752E-06	-3.009192730015E-07	-5.005823322826E-09
10	positive	0.0000691339	4.827288042882E-07	-1.219265936716E+00	-1.246011657917E-01	-2.064339047314E-02	1.270767380439E-02	-7.285132179361E-03	2.410058767118E-03	-4.961314663574E-04	6.437074118031E-05	-5.118577713974E-06	2.278518922251E-07	-4.349030516096E-09
10	negative	0.0005520956	6.126672540004E-05	-1.221718487621E+00	2.924539458513E-01	-9.727741223154E-02	-2.435154794273E-02	-1.198426487468E-02	-2.322115090508E-03	-2.396643000231E-04	-1.466714539925E-05	-5.370475538421E-07	-1.091820670362E-08	-9.508195184385E-11
12	positive	0.0000294639	8.768001525140E-08	-1.219477162202E+00	-1.200982593383E-01	-3.832655625330E-02	4.123759470027E-02	-3.172803341743E-02	1.498815435840E-02	-4.650958637328E-03	9.762150382396E-04	-1.395698793776E-04	1.339631433653E-05	-8.260162847997E-07	2.956410791025E-08	-4.668732571740E-10
12	negative	0.0001938063	7.549741166126E-06	-1.219300922652E+00	3.140750822245E-01	-5.546529700515E-02	9.765802787925E-03	2.934588797648E-03	1.612410432294E-03	4.278294850820E-04	6.065891281119E-05	5.177961778370E-06	2.772111024571E-07	9.161416117414E-09	1.715001494508E-10	1.394658124294E-12
14	positive	0.0000147961	2.211131948886E-08	-1.219545422853E+00	-1.178023771161E-01	-5.076971912323E-02	6.859401676507E-02	-6.377393015517E-02	3.779907374251E-02	-1.527688422404E-02	4.360547208467E-03	-8.947578569593E-04	1.325735626299E-04	-1.406157265081E-05	1.041125015233E-06	-5.109880215907E-08	1.493700653234E-09	-1.968219290269E-11
14	negative	0.0000944644	1.793626659988E-06	-1.218847353590E+00	3.191258654046E-01	-4.382445409479E-02	2.089017193947E-02	8.546205898028E-03	3.289005875052E-03	7.413793355379E-04	9.774381743049E-05	7.797141693999E-06	3.560637552020E-07	5.927584167427E-09	-2.655050081368E-10	-1.802875139641E-11	-4.224880282169E-13	-3.760635937205E-15
16	positive	0.0000130148	1.710798945593E-08	-1.219533797312E+00	-1.185523217029E-01	-4.478948854838E-02	4.968430206219E-02	-3.198482594515E-02	5.150873593668E-03	6.904076656762E-03	-6.112305202946E-03	2.650155064718E-03	-7.435653081368E-04	1.453397882245E-04	-2.027299148130E-05	2.017095367743E-06	-1.401223303548E-07	6.465098239315E-09	-1.781504859819E-10	2.219701383273E-12
16	negative	0.0000598749	7.205861506775E-07	-1.219144622445E+00	3.138172965468E-01	-6.207492167994E-02	-5.285842098481E-03	-1.175549606478E-02	-6.409445526282E-03	-2.338292990517E-03	-5.840678857042E-04	-1.006672216814E-04	-1.226517675987E-05	-1.076678013258E-06	-6.859000548403E-08	-3.150018073627E-09	-1.018077377026E-10	-2.199803754607E-12	-2.855025481060E-14	-1.683988214425E-16
