Order	Fit Range	RMSE	Covariance	Coefficients
2	positive	0.5238224422	2.771338504580E+01	2.077612242642E-01	-1.663114453287E+00	-1.418021905554E-01
2	negative	0.0903433473	1.640546000811E+00	-9.290727731134E-01	3.636941323088E-01	-1.192668857698E-02
4	positive	0.0537241999	2.915152551525E-01	-1.390487665111E+00	5.942120664768E-01	-8.526271086239E-01	7.605336432338E-02	-2.502039841619E-03
4	negative	0.0048016369	4.634199089230E-03	-1.181198114612E+00	2.016799899664E-01	-3.442428038146E-02	-9.691720528617E-04	-9.580413543541E-06
6	positive	0.0177598373	3.185659377847E-02	-1.186821807613E+00	-2.407590716423E-01	-7.372579634591E-02	-2.143416998483E-01	4.851005477499E-02	-4.230433804224E-03	1.336179748575E-04
6	negative	0.0002145792	9.254890738109E-06	-1.161543304664E+00	2.361930524166E-01	-2.016599930959E-02	1.396142873082E-03	1.750635647646E-04	6.777519326090E-06	9.417623256404E-08
8	positive	0.0060196336	3.659834859651E-03	-1.142760433793E+00	-5.147571583585E-01	2.934283692141E-01	-4.078396354474E-01	9.635362403212E-02	-9.747939926636E-03	3.303550441028E-04	1.171936393825E-05	-8.119087846735E-07
8	negative	0.0001046098	2.199585535263E-06	-1.161421163142E+00	2.361977620041E-01	-2.048119696518E-02	1.183917179086E-03	1.201628548207E-04	-2.577773031993E-07	-3.821803329284E-07	-1.632187641180E-08	-2.229165393245E-10
10	positive	0.0008805425	7.831086856110E-05	-1.164586540367E+00	-2.415132276765E-01	-4.081045900349E-01	3.375122746489E-01	-3.191004412340E-01	1.258766502774E-01	-2.696810646426E-02	3.442142857600E-03	-2.629051723822E-04	1.113351825062E-05	-2.015784795164E-07
10	negative	0.0000989473	1.967902647030E-06	-1.161480947289E+00	2.359583822664E-01	-2.067115139376E-02	1.143458862349E-03	1.263886883938E-04	3.795922821793E-06	3.544839598273E-07	5.232809787116E-08	3.329758003551E-09	9.707120281029E-11	1.093836972103E-12
12	positive	0.0004461133	2.010072856260E-05	-1.162741639536E+00	-2.861256006002E-01	-2.170480445489E-01	4.412658963028E-03	-1.235900248441E-02	-4.310127653650E-02	3.258706820823E-02	-1.046372633358E-02	1.913121280274E-03	-2.145432229727E-04	1.467935415719E-05	-5.648002887839E-07	9.393133892760E-09
12	negative	0.0000977134	1.919129312428E-06	-1.161412455262E+00	2.365273457554E-01	-1.964095149003E-02	1.930960945362E-03	4.487600372739E-04	8.328695267881E-05	1.294337490613E-05	1.375992515401E-06	9.669528985728E-08	4.462164517495E-09	1.307593586635E-10	2.213902853454E-12	1.652711237219E-14
14	positive	0.0001341437	1.817446631018E-06	-1.161801378781E+00	-3.158919271346E-01	-6.283083775307E-02	-3.189952566959E-01	3.473797366456E-01	-2.848085902768E-01	1.380748992249E-01	-4.164830854769E-02	8.295810075019E-03	-1.124312665189E-03	1.040687220743E-04	-6.436120786067E-06	2.512381770863E-07	-5.467737253946E-09	4.810879822739E-11
14	negative	0.0000970150	1.891794515291E-06	-1.161459235391E+00	2.358983185590E-01	-2.136064588104E-02	-3.976122794598E-05	-7.676937705486E-04	-3.752355919248E-04	-1.004682430745E-04	-1.783705600827E-05	-2.186674661471E-06	-1.876660779689E-07	-1.125774350828E-08	-4.628350922101E-10	-1.243428337741E-11	-1.967129362289E-13	-1.390043183077E-15
16	positive	0.0000233947	5.527731340252E-08	-1.162095326117E+00	-2.992547788939E-01	-1.868029963636E-01	4.983295118299E-02	-2.378598693325E-01	2.837708305070E-01	-2.279938709269E-01	1.223962291843E-01	-4.447618928605E-02	1.128645313251E-02	-2.046839677081E-03	2.678067151272E-04	-2.514641207092E-05	1.655692659037E-06	-7.266683939983E-08	1.910950615473E-09	-2.279137221214E-11
16	negative	0.0000915339	1.684069933442E-06	-1.161592914480E+00	2.334091483011E-01	-3.020224203322E-02	-1.312599798790E-02	-1.123893247296E-02	-5.536393012663E-03	-1.791715387320E-03	-4.043231137147E-04	-6.566899432822E-05	-7.817407998421E-06	-6.874654971081E-07	-4.457534663345E-08	-2.103499500696E-09	-7.022668664860E-11	-1.571483954389E-12	-2.113968298945E-14	-1.292036074152E-16
