Order	Fit Range	RMSE	Covariance	Coefficients
2	positive	0.8421111697	7.162427342867E+01	1.586313790082E+00	-3.459546994297E+00	-1.561757325581E-01
2	negative	0.0550192423	6.084505226802E-01	-1.018351736154E+00	2.879683134266E-01	-1.150339761480E-02
4	positive	0.1182193362	1.411556957085E+00	-1.265777493280E+00	8.932730453648E-01	-1.666835392542E+00	1.839113158439E-01	-7.262205863692E-03
4	negative	0.0031116018	1.946095207854E-03	-1.162478148712E+00	1.991135513006E-01	-2.295766220186E-02	-4.137368606315E-04	-1.395122425985E-06
6	positive	0.0703758201	5.002283616048E-01	-1.391839504205E+00	1.128345476645E+00	-1.659057404137E+00	1.038348806243E-01	1.931705795023E-02	-3.167448491645E-03	1.283907642854E-04
6	negative	0.0001216023	2.972210530873E-06	-1.150672674225E+00	2.191295565042E-01	-1.501647139921E-02	8.412966649553E-04	9.091928224354E-05	3.143679433324E-06	3.961027480208E-08
8	positive	0.0140012746	1.979960479321E-02	-1.118115689316E+00	-8.556103016814E-01	1.500635220814E+00	-1.970699063737E+00	7.139616011056E-01	-1.322923743976E-01	1.361568291422E-02	-7.406998316864E-04	1.663804113770E-05
8	negative	0.0001147817	2.648140591568E-06	-1.150850522258E+00	2.184744159210E-01	-1.557473208059E-02	6.432647929418E-04	5.498406313138E-05	-4.805272109476E-07	-1.658881323442E-07	-6.128761864681E-09	-7.479294391521E-11
10	positive	0.0099230411	9.945141186738E-03	-1.126588067277E+00	-6.815479408469E-01	8.976147758480E-01	-1.158010357844E+00	1.590773360157E-01	8.453177393212E-02	-3.777354871170E-02	6.771730505231E-03	-6.449859419269E-04	3.217240641128E-05	-6.632807472474E-07
10	negative	0.0001129386	2.563780035365E-06	-1.150752107497E+00	2.190494885050E-01	-1.481657481759E-02	1.064810481932E-03	1.788719206796E-04	2.093116978426E-05	2.122251874443E-06	1.468791121896E-07	6.158846782285E-09	1.414878579261E-10	1.371643163733E-12
12	positive	0.0023270254	5.469197651046E-04	-1.157568236394E+00	-4.106238389051E-02	-1.557709152718E+00	2.709551410228E+00	-3.073778723184E+00	1.706092813761E+00	-5.592953936232E-01	1.180729015489E-01	-1.658197777102E-02	1.545676267761E-03	-9.208163407806E-05	3.178358317650E-06	-4.840277609694E-08
12	negative	0.0001126196	2.549316212488E-06	-1.150738423219E+00	2.191347636036E-01	-1.471134191831E-02	1.105460809733E-03	1.779269067939E-04	1.597586038252E-05	5.180504968901E-07	-1.167227390054E-07	-1.985267018604E-08	-1.461133842672E-09	-5.911237150061E-11	-1.281092637698E-12	-1.167515753206E-14
14	positive	0.0014929242	2.251110557257E-04	-1.153670799809E+00	-1.918635381797E-01	-6.649823440772E-01	5.809700165812E-01	-3.776120968299E-01	-3.654464779377E-01	4.810606638053E-01	-2.388757485205E-01	6.917772443196E-02	-1.302237471693E-02	1.649371443906E-03	-1.401055223398E-04	7.675400768523E-06	-2.455445118853E-07	3.489431463383E-09
14	negative	0.0001086528	2.372891831395E-06	-1.150869263156E+00	2.174175630661E-01	-1.931885933934E-02	-4.085558605833E-03	-2.975846462716E-03	-1.155156399715E-03	-2.850857436775E-04	-4.785630588614E-05	-5.621570232391E-06	-4.671138043105E-07	-2.734303710889E-08	-1.103160368113E-09	-2.920194790469E-11	-4.565357012799E-13	-3.194881566714E-15
16	positive	0.0004553148	2.093842940086E-05	-1.150754639140E+00	-3.503866723097E-01	4.884233058837E-01	-2.771131378738E+00	4.814672562345E+00	-5.284665201005E+00	3.565763307602E+00	-1.583361531283E+00	4.892020595148E-01	-1.087878635550E-01	1.770983504552E-02	-2.117514094836E-03	1.841081653017E-04	-1.133489268456E-05	4.686211476944E-07	-1.167478478023E-08	1.324999464956E-10
16	negative	0.0000931520	1.744138310786E-06	-1.151104114230E+00	2.130690751859E-01	-3.469919803293E-02	-2.675909085528E-02	-2.104887056396E-02	-1.002979158602E-02	-3.182538423175E-03	-7.076080261806E-04	-1.136072565316E-04	-1.340066111730E-05	-1.169718440847E-06	-7.537716965383E-08	-3.538446954309E-09	-1.176018697953E-10	-2.621286156652E-12	-3.513972136942E-14	-2.141100952369E-16
