Order	Fit Range	RMSE	Covariance	Coefficients
2	positive	0.8593452110	7.458589335030E+01	1.606603466477E+00	-3.379840935499E+00	-1.631103232408E-01
2	negative	0.0539021663	5.839941505829E-01	-1.013826389632E+00	2.819936554631E-01	-1.251259677065E-02
4	positive	0.1167183149	1.375939668172E+00	-1.293732333747E+00	1.031909024035E+00	-1.688355615504E+00	1.848397222434E-01	-7.258368003418E-03
4	negative	0.0031680215	2.017308357494E-03	-1.149948599030E+00	2.001362698816E-01	-2.255918077558E-02	-3.137974343157E-04	9.214883276420E-07
6	positive	0.0724718305	5.304687880476E-01	-1.377357799340E+00	1.100923188270E+00	-1.532052815021E+00	5.155857876704E-02	2.831536612995E-02	-3.886285587856E-03	1.502984061310E-04
6	negative	0.0001275375	3.269430874042E-06	-1.138202888021E+00	2.198572118062E-01	-1.482722498249E-02	8.899260798560E-04	8.772388534444E-05	2.876165790240E-06	3.480860396662E-08
8	positive	0.0144759448	2.116485083551E-02	-1.097833693082E+00	-9.155021297836E-01	1.664745511763E+00	-2.037301862557E+00	7.241809440653E-01	-1.325258424983E-01	1.350680105890E-02	-7.287644566462E-04	1.625417158943E-05
8	negative	0.0001148547	2.651512748187E-06	-1.138469186065E+00	2.189405556393E-01	-1.556222213869E-02	6.437045784109E-04	4.541145493412E-05	-1.174784905250E-06	-1.837008301934E-07	-6.211298582268E-09	-7.237247230071E-11
10	positive	0.0101268381	1.035783793319E-02	-1.115474634506E+00	-6.239322203845E-01	7.537761684747E-01	-8.905358289044E-01	-2.099951302675E-02	1.478503887139E-01	-5.098464533933E-02	8.472406174695E-03	-7.779069307057E-04	3.796548036831E-05	-7.714050575198E-07
10	negative	0.0001126838	2.552225499830E-06	-1.138360367643E+00	2.195683613999E-01	-1.474375117330E-02	1.094009924564E-03	1.764237222863E-04	2.124999503240E-05	2.190459631986E-06	1.511276996692E-07	6.282324330435E-09	1.430310445825E-10	1.375405473066E-12
12	positive	0.0026036870	6.846977996325E-04	-1.146357197997E+00	1.008532053753E-02	-1.662974953144E+00	2.894155179394E+00	-3.165117517531E+00	1.714503029450E+00	-5.512646806047E-01	1.144178307550E-01	-1.582087899651E-02	1.453482930772E-03	-8.541178997878E-05	2.910087284139E-06	-4.377272818704E-08
12	negative	0.0001123582	2.537498713864E-06	-1.138359668983E+00	2.195381548395E-01	-1.486079227005E-02	9.540878292404E-04	9.684748784671E-05	-4.359747759208E-06	-2.904332011333E-06	-5.049303678829E-07	-4.939911265094E-08	-2.950309537575E-09	-1.068413204405E-10	-2.162637203720E-12	-1.882184194435E-14
14	positive	0.0014852914	2.228151062700E-04	-1.141004052893E+00	-1.901850274419E-01	-5.001936179700E-01	1.675824593050E-01	2.367701967743E-01	-8.633072473406E-01	7.268673481778E-01	-3.189212638439E-01	8.714213719683E-02	-1.585608595012E-02	1.963690762320E-03	-1.641491352788E-04	8.884282503461E-06	-2.815268314505E-07	3.970104396609E-09
14	negative	0.0001071371	2.307149874224E-06	-1.138510212435E+00	2.175672258608E-01	-2.013878410732E-02	-4.981567771653E-03	-3.503132790712E-03	-1.338989152783E-03	-3.278654895206E-04	-5.474047491997E-05	-6.403993544555E-06	-5.304374126926E-07	-3.097141757489E-08	-1.246994556879E-09	-3.295373879085E-11	-5.144610033328E-13	-3.595907458778E-15
16	positive	0.0005284121	2.820113082113E-05	-1.138267118665E+00	-3.369683327006E-01	5.589292932080E-01	-2.884616687230E+00	4.922221958753E+00	-5.259506409618E+00	3.454684080837E+00	-1.494227225642E+00	4.496903113516E-01	-9.736766940034E-02	1.542264626030E-02	-1.792676546847E-03	1.513707048105E-04	-9.040486036405E-06	3.621333703653E-07	-8.729492801717E-09	9.572441931604E-11
16	negative	0.0000888052	1.585161696322E-06	-1.138762273099E+00	2.129057570322E-01	-3.661088365616E-02	-2.924343443185E-02	-2.282588473756E-02	-1.081944880335E-02	-3.420596463279E-03	-7.583936984290E-04	-1.214844908682E-04	-1.430301827258E-05	-1.246522473750E-06	-8.021884376967E-08	-3.761370678648E-09	-1.248843569722E-10	-2.781124933565E-12	-3.725286226503E-14	-2.268244509767E-16
