Order	Fit Range	RMSE	Covariance	Coefficients
2	positive	0.6449157668	4.200755097247E+01	1.175424559594E+00	-3.089751225805E+00	-1.360995752706E-01
2	negative	0.1499170245	4.517497960062E+00	-5.084887404408E-01	5.562913715332E-01	-1.498541397211E-02
4	positive	0.0744341180	5.595842296679E-01	-9.856969324806E-01	1.725081604759E-01	-1.253905738168E+00	1.340087057899E-01	-5.192461006407E-03
4	negative	0.0056416461	6.397462367500E-03	-9.682376214547E-01	2.427993796873E-01	-6.276497528545E-02	-2.441119628713E-03	-3.707449990874E-05
6	positive	0.0395320549	1.578411196166E-01	-1.081716032197E+00	3.806570844069E-01	-1.298577184856E+00	9.985020553409E-02	9.046342984440E-03	-1.815016314358E-03	7.599095715677E-05
6	negative	0.0014430883	4.185832541839E-04	-9.441681370045E-01	2.898426574300E-01	-4.113513813910E-02	1.564264528182E-03	3.134627971516E-04	1.450518346823E-05	2.288104759107E-07
8	positive	0.0062935919	4.000539223303E-03	-9.277010007730E-01	-7.319457216645E-01	4.677307334222E-01	-1.055959417940E+00	3.946789413284E-01	-7.322337248299E-02	7.503728155021E-03	-4.060811623682E-04	9.076867230965E-06
8	negative	0.0002051590	8.460133021718E-06	-9.393438477788E-01	3.043315586311E-01	-3.114216152636E-02	4.368768153064E-03	7.015401531241E-04	4.259785356127E-05	1.250762136475E-06	1.488538227952E-08	6.700832695839E-12
10	positive	0.0041671684	1.753894524390E-03	-9.293603350636E-01	-6.793732653388E-01	2.597393103400E-01	-7.545371698724E-01	1.790146700756E-01	1.386752316012E-02	-1.364886019343E-02	2.745261945072E-03	-2.726868787640E-04	1.387115497354E-05	-2.889235109807E-07
10	negative	0.0000884162	1.571300686124E-06	-9.401659612854E-01	2.999053642918E-01	-3.654596036288E-02	1.588000568108E-03	-5.347034744227E-05	-7.766339023737E-05	-1.055843476903E-05	-7.081942608688E-07	-2.685579220739E-08	-5.532590568748E-10	-4.838709392370E-12
12	positive	0.0007419491	5.559933357005E-05	-9.424939293956E-01	-4.081568623500E-01	-7.790242019121E-01	8.801645403008E-01	-1.186067935702E+00	6.978561384140E-01	-2.333832478363E-01	4.958317040193E-02	-6.970508425707E-03	6.490436767718E-04	-3.859496926694E-05	1.329534161694E-06	-2.020957688349E-08
12	negative	0.0000866068	1.507648804855E-06	-9.400868433273E-01	3.006242862819E-01	-3.513743013910E-02	2.751136687130E-03	4.608684262034E-04	5.942077574948E-05	1.293132161456E-05	1.967840474360E-06	1.780132861843E-07	9.864481912415E-09	3.325938710099E-10	6.300844687890E-12	5.162341965219E-14
14	positive	0.0004700103	2.231187760880E-05	-9.413590179889E-01	-4.530476794959E-01	-5.100218322614E-01	2.322135905767E-01	-3.579595365077E-01	5.646654827924E-02	9.108352661332E-02	-6.248297666719E-02	2.011838910297E-02	-3.978368135451E-03	5.174262295511E-04	-4.463839599994E-05	2.468761163290E-06	-7.945438779933E-08	1.133502959493E-09
14	negative	0.0000862337	1.494685998836E-06	-9.400609961649E-01	3.009235537505E-01	-3.441911678792E-02	3.472228757264E-03	8.481535787987E-04	1.851953102614E-04	3.938110694337E-05	5.710050779542E-06	5.403767933968E-07	3.383444608061E-08	1.389120900987E-09	3.539533827763E-11	4.747655524047E-13	1.359141278462E-15	-2.610766197310E-17
16	positive	0.0001079059	1.176008332905E-06	-9.404160998000E-01	-5.043979720661E-01	-1.359868763512E-01	-8.560371913073E-01	1.329672584292E+00	-1.544408003188E+00	1.096293894813E+00	-5.012448713213E-01	1.574053149559E-01	-3.533332189939E-02	5.785678977101E-03	-6.946117225774E-04	6.059342386361E-05	-3.741938150209E-06	1.551824824003E-07	-3.878755197009E-09	4.417696091892E-11
16	negative	0.0000852954	1.462338230049E-06	-9.401121030131E-01	2.999608860170E-01	-3.786801163963E-02	-1.673086033961E-03	-3.300304055695E-03	-1.874523966933E-03	-6.403514756347E-04	-1.506919966579E-04	-2.532109104914E-05	-3.094558717725E-06	-2.776250549289E-07	-1.827803717618E-08	-8.728340616324E-10	-2.941642517409E-11	-6.633314496218E-13	-8.980218052256E-15	-5.518291545955E-17
