Order	Fit Range	RMSE	Covariance	Coefficients
2	positive	1.1923523251	1.435921107875E+02	2.906758471593E+00	-4.921928963615E+00	-1.795643103989E-01
2	negative	0.1632730680	5.358277040606E+00	-7.602631405412E-01	4.134834506382E-01	-1.881986486757E-02
4	positive	0.2392674313	5.782139270706E+00	-1.187010905411E+00	1.458539424167E+00	-2.446847301969E+00	2.836682096772E-01	-1.156671605230E-02
4	negative	0.0130199066	3.407311160124E-02	-1.216359349041E+00	1.198805674690E-01	-5.971202820953E-02	-1.772578143705E-03	-1.789370817097E-05
6	positive	0.1348782205	1.837405569752E+00	-1.666876132404E+00	2.891132804144E+00	-3.352300427608E+00	4.747742096088E-01	-2.138984487312E-02	-1.013449981475E-03	8.580880643745E-05
6	negative	0.0007559665	1.148685651453E-04	-1.162155250577E+00	2.159449645816E-01	-1.961906361793E-02	4.955666299237E-03	5.143407824866E-04	1.983930437267E-05	2.807180826568E-07
8	positive	0.0418378280	1.767907890640E-01	-1.142032691157E+00	-1.012114248263E+00	3.015439335027E+00	-3.810026541809E+00	1.450402409040E+00	-2.819804712072E-01	3.026311075528E-02	-1.706532156323E-03	3.953269698904E-05
8	negative	0.0002590857	1.349220057120E-05	-1.162999933628E+00	2.114445291987E-01	-2.444976166573E-02	2.928827937918E-03	9.541925070745E-05	-2.708462178403E-05	-2.621529124478E-06	-9.315421914540E-08	-1.210844732311E-09
10	positive	0.0282071079	8.035973452198E-02	-1.080789712047E+00	-1.638386168720E+00	4.300878783826E+00	-4.820504902950E+00	1.803179161437E+00	-3.234455336976E-01	2.260871954052E-02	1.433654996833E-03	-3.814268145653E-04	2.628223698642E-05	-6.426996475834E-07
10	negative	0.0000781847	1.228681870092E-06	-1.163825516448E+00	2.073213953657E-01	-2.908458849384E-02	7.672156873643E-04	-4.243584858189E-04	-9.793456404134E-05	-8.258098668271E-06	-3.464572929534E-07	-6.711855979170E-09	-2.008269532806E-11	7.793922669065E-13
12	positive	0.0088759428	7.957018292903E-03	-1.171233051587E+00	2.901265309349E-01	-3.273822437702E+00	7.402549853354E+00	-8.670659306167E+00	5.067225975925E+00	-1.758363014030E+00	3.923665617072E-01	-5.803490783183E-02	5.674041290820E-03	-3.531103777021E-04	1.268446194688E-05	-2.003512294999E-07
12	negative	0.0000612187	7.532946127570E-07	-1.163608817229E+00	2.091283592643E-01	-2.580094231715E-02	3.286877304285E-03	6.113256824449E-04	1.585844897765E-04	3.256392598049E-05	3.968664196684E-06	2.994453977629E-07	1.438673093570E-08	4.318380320567E-10	7.419722188671E-12	5.589809860568E-14
14	positive	0.0066417426	4.455387044481E-03	-1.176632717235E+00	4.116315477463E-01	-3.702408890266E+00	7.838952877848E+00	-8.563857737208E+00	4.526693953713E+00	-1.276747667592E+00	1.609285597966E-01	1.223540085821E-02	-8.568561657210E-03	1.605356633039E-03	-1.680612590375E-04	1.052948156877E-05	-3.704571351223E-07	5.655677444396E-09
14	negative	0.0000609964	7.478339518262E-07	-1.163624997609E+00	2.089005747983E-01	-2.644480710233E-02	2.527429864871E-03	1.303141905086E-04	-2.700008359525E-05	-1.432463795191E-05	-4.130998135116E-06	-6.805859243484E-07	-6.945494768830E-08	-4.614998385493E-09	-2.016399298363E-10	-5.616559088839E-12	-9.074719431389E-14	-6.488073890248E-16
16	positive	0.0020612782	4.291319297748E-04	-1.162532166533E+00	-3.892628889149E-01	2.277483937611E+00	-9.986003183361E+00	1.977460374717E+01	-2.305907845934E+01	1.651937522070E+01	-7.830282900177E+00	2.588339745318E+00	-6.157096927645E-01	1.070604018184E-01	-1.364400954533E-02	1.261426125423E-03	-8.238098064473E-05	3.604302176601E-06	-9.480928553912E-08	1.133671959853E-09
16	negative	0.0000594198	7.096728965126E-07	-1.163682060010E+00	2.078360574759E-01	-3.023130821579E-02	-3.084210570066E-03	-4.365605518495E-03	-2.245689733196E-03	-7.422242986794E-04	-1.706641282680E-04	-2.806542795729E-05	-3.364389954100E-06	-2.969535777202E-07	-1.929254942068E-08	-9.115191673007E-10	-3.046024365039E-11	-6.822178706616E-13	-9.185536676718E-15	-5.619452721144E-17
