Order	Fit Range	RMSE	Covariance	Coefficients
2	positive	0.9206162280	8.560095817163E+01	1.882999164346E+00	-3.740605376807E+00	-1.519801748995E-01
2	negative	0.0912896972	1.675095570203E+00	-9.853125875358E-01	2.947176031916E-01	-1.808486687809E-02
4	positive	0.1474303640	2.195306936431E+00	-1.257413770972E+00	1.093167491652E+00	-1.845885568005E+00	2.085786550304E-01	-8.348992914463E-03
4	negative	0.0083735023	1.409322382484E-02	-1.187897824874E+00	1.838223543733E-01	-2.894855384911E-02	-5.921339499693E-05	1.323588382065E-05
6	positive	0.0862789932	7.518505321990E-01	-1.466901155459E+00	1.605160859061E+00	-2.043968053965E+00	1.874203429424E-01	1.077158063761E-02	-2.771459267328E-03	1.224332426128E-04
6	negative	0.0006324227	8.039166066841E-05	-1.159974466093E+00	2.287400263400E-01	-1.228199614696E-02	2.346354261806E-03	1.684163240765E-04	4.285168495517E-06	3.607385265436E-08
8	positive	0.0194920256	3.837384519932E-02	-1.129076877208E+00	-8.638786611017E-01	1.919536958069E+00	-2.436342768864E+00	8.969749425024E-01	-1.690289755058E-01	1.765967819745E-02	-9.732872621279E-04	2.211030830061E-05
8	negative	0.0001114294	2.495720299735E-06	-1.162558965525E+00	2.204574993948E-01	-1.845211377976E-02	4.368498444980E-04	-1.325110905490E-04	-2.189813319055E-05	-1.233216651144E-06	-3.197387835512E-08	-3.242086021851E-10
10	positive	0.0139299979	1.959852892788E-02	-1.126173137726E+00	-8.123148211938E-01	1.585281233395E+00	-1.858814810463E+00	4.433149385618E-01	2.520454437518E-02	-3.145214174344E-02	6.561942255384E-03	-6.669357581531E-04	3.452882060091E-05	-7.296114582735E-07
10	negative	0.0001012767	2.061649744905E-06	-1.162339256443E+00	2.216669893278E-01	-1.694250873190E-02	1.232154066785E-03	8.897144182827E-05	1.436764476201E-05	2.437101996893E-06	2.003503917977E-07	8.629784810163E-09	1.921209895848E-10	1.759196209705E-12
12	positive	0.0033727028	1.148887521191E-03	-1.170521718469E+00	1.136871968769E-01	-1.992868816293E+00	3.822794710236E+00	-4.345856760491E+00	2.448745279728E+00	-8.182598742990E-01	1.761680070504E-01	-2.521354289155E-02	2.392533607838E-03	-1.449219401563E-04	5.080138449890E-06	-7.848289889124E-08
12	negative	0.0000932364	1.747298440748E-06	-1.162519271991E+00	2.200421159387E-01	-2.010878762849E-02	-1.369621594756E-03	-1.056266836435E-03	-2.895577564335E-04	-4.943117402293E-05	-5.686159180663E-06	-4.404003297367E-07	-2.256346556604E-08	-7.329115668467E-10	-1.367621038819E-11	-1.117222845662E-13
14	positive	0.0024445881	6.035770345461E-04	-1.167149046864E+00	-2.917533266686E-02	-1.106016540913E+00	1.625400578798E+00	-1.469231466111E+00	1.737030617445E-01	3.540245085165E-01	-2.354088659886E-01	7.574546995851E-02	-1.508358315868E-02	1.980358809668E-03	-1.725577792449E-04	9.636754943310E-06	-3.130049041021E-07	4.503434074257E-09
14	negative	0.0000677321	9.221160832637E-07	-1.162813245112E+00	2.162663566206E-01	-3.006500034709E-02	-1.240469460500E-02	-7.655697537140E-03	-2.702977593594E-03	-6.292762248338E-04	-1.012078598841E-04	-1.149044043721E-05	-9.284206320481E-07	-5.309158857827E-08	-2.100201425835E-09	-5.466919131517E-11	-8.424252690813E-13	-5.821863066339E-15
16	positive	0.0006903137	4.812965261001E-05	-1.162151252895E+00	-3.050134122859E-01	9.194177200303E-01	-4.314940643196E+00	7.820182260225E+00	-8.716349441496E+00	5.988912300780E+00	-2.719777024152E+00	8.614989480442E-01	-1.966276702309E-01	3.286570954680E-02	-4.034729819765E-03	3.601012010627E-04	-2.275033893739E-05	9.648122875277E-07	-2.464571561203E-08	2.866805875800E-10
16	negative	0.0000361942	2.633143119019E-07	-1.163054833609E+00	2.118683505917E-01	-4.541835997732E-02	-3.475825777056E-02	-2.525711648001E-02	-1.124198912020E-02	-3.383793814750E-03	-7.209407073990E-04	-1.117215600411E-04	-1.279105065277E-05	-1.088499818964E-06	-6.862600570582E-08	-3.160854994337E-09	-1.033151615600E-10	-2.269142810269E-12	-3.002240788834E-14	-1.807912894825E-16
