Order	Fit Range	RMSE	Covariance	Coefficients
2	positive	0.6683001343	4.510913202589E+01	1.115598650945E+00	-2.988257500911E+00	-1.424642986150E-01
2	negative	0.1269162787	3.237656099984E+00	-6.830443126396E-01	4.397072070067E-01	-1.564738937644E-02
4	positive	0.0725581033	5.317325133907E-01	-1.112985145123E+00	3.613349752357E-01	-1.284343682725E+00	1.360387389994E-01	-5.229570560849E-03
4	negative	0.0070778164	1.006919245125E-02	-1.047975421734E+00	2.006601217199E-01	-4.991075101816E-02	-1.572363141096E-03	-1.880018063820E-05
6	positive	0.0422497014	1.802887639184E-01	-1.158492674032E+00	3.712638956908E-01	-1.151248714608E+00	3.803194131142E-02	1.983150062700E-02	-2.682206885992E-03	1.024894025230E-04
6	negative	0.0005925779	7.058086004863E-05	-1.017682384628E+00	2.553080203147E-01	-2.666605083776E-02	2.410712886633E-03	3.036575902106E-04	1.233484037313E-05	1.796941226106E-07
8	positive	0.0067311498	4.576146131629E-03	-9.966073182599E-01	-7.879669428176E-01	6.734242959491E-01	-1.145176111856E+00	4.107464098632E-01	-7.429722834296E-02	7.464648823084E-03	-3.973074394947E-04	8.753793847563E-06
8	negative	0.0001500518	4.525621924164E-06	-1.016630974820E+00	2.577678433846E-01	-2.558324158088E-02	2.476070938600E-03	2.634916290891E-04	3.527779087762E-06	-5.655087382127E-07	-2.893866984948E-08	-4.284844365128E-10
10	positive	0.0043950885	1.950997077162E-03	-1.006957430935E+00	-6.241932913327E-01	1.744210748926E-01	-5.284934249840E-01	1.576124021559E-02	7.259237562988E-02	-2.599765985697E-02	4.338148766975E-03	-3.971344469315E-04	1.928743346862E-05	-3.898397385726E-07
10	negative	0.0000872104	1.528737296007E-06	-1.017073065171E+00	2.555141642306E-01	-2.817781829754E-02	1.228768834776E-03	-4.877329132074E-05	-4.151559394224E-05	-4.469356863753E-06	-2.318685124737E-07	-6.430332492416E-09	-8.696347982361E-11	-3.850708886694E-13
12	positive	0.0009350402	8.830431894633E-05	-1.020257782745E+00	-3.529898820386E-01	-8.535788592122E-01	1.072058887192E+00	-1.305637911065E+00	7.265837252275E-01	-2.332986835204E-01	4.788305163303E-02	-6.524568197325E-03	5.901175052111E-04	-3.414117948675E-05	1.145813405231E-06	-1.698823226261E-08
12	negative	0.0000838623	1.413610671605E-06	-1.016961375700E+00	2.564601029125E-01	-2.643364767723E-02	2.587449421561E-03	5.186439390255E-04	1.014146180504E-04	1.868953390514E-05	2.263795388294E-06	1.743395462962E-07	8.611314118987E-09	2.662208527690E-10	4.710617526846E-12	3.651374535887E-14
14	positive	0.0004610168	2.146618519285E-05	-1.018125992058E+00	-4.316483470939E-01	-4.006508530727E-01	1.773787882244E-02	9.538633606767E-04	-2.572436115414E-01	2.515967214194E-01	-1.155889838893E-01	3.210908912881E-02	-5.871703088950E-03	7.271004560043E-04	-6.062990085653E-05	3.269893042558E-06	-1.032076545014E-07	1.449567825356E-09
14	negative	0.0000836303	1.405800912821E-06	-1.016977757162E+00	2.562228308673E-01	-2.711747867520E-02	1.767861418344E-03	-7.612899310386E-06	-1.040632118529E-04	-3.377405790449E-05	-6.884102822358E-06	-9.418423446304E-07	-8.760241035890E-08	-5.565155799839E-09	-2.383593854633E-10	-6.596493443476E-12	-1.066713883713E-13	-7.663504782163E-16
16	positive	0.0001474967	2.197280378431E-06	-1.017293919781E+00	-4.757888127293E-01	-8.433066997868E-02	-8.874250830599E-01	1.379909090610E+00	-1.540270433118E+00	1.040347467570E+00	-4.519238606295E-01	1.346556034990E-01	-2.862429902268E-02	4.427540606914E-03	-5.006244368623E-04	4.098850667857E-05	-2.366434144595E-06	9.133920893454E-08	-2.113951581044E-09	2.216204452628E-11
16	negative	0.0000808056	1.312439470852E-06	-1.017066810757E+00	2.545599297492E-01	-3.303664753709E-02	-7.010216632474E-03	-7.044868325746E-03	-3.579006203519E-03	-1.174500469981E-03	-2.680176673674E-04	-4.390716319044E-05	-5.260030827924E-06	-4.647292532584E-07	-3.023945698834E-08	-1.430942709069E-09	-4.788051345661E-11	-1.073461067316E-12	-1.446371449973E-14	-8.852661439783E-17
