Order	Fit Range	RMSE	Covariance	Coefficients
2	positive	1.2940386691	1.691281437945E+02	3.460220556045E+00	-5.147907041867E+00	-1.932989438112E-01
2	negative	0.2995099912	1.803095319523E+01	-2.012762038410E-02	8.711848010510E-01	-1.997970719304E-02
4	positive	0.2661046740	7.151981450923E+00	-9.818986839666E-01	1.781190316305E+00	-2.657762277013E+00	3.086522478511E-01	-1.260006042807E-02
4	negative	0.0154580656	4.802931050555E-02	-9.933699208977E-01	1.823434259418E-01	-1.305540092732E-01	-6.108216342958E-03	-1.058490657332E-04
6	positive	0.1551774731	2.432084862785E+00	-1.497792805128E+00	3.307863900824E+00	-3.607758073365E+00	5.016750251533E-01	-2.037821634021E-02	-1.366382240748E-03	1.023517813339E-04
6	negative	0.0071735841	1.034352213078E-02	-9.488578616188E-01	2.806846160756E-01	-8.065655730861E-02	3.931244761180E-03	8.377748216204E-04	4.155598848883E-05	6.925436191081E-07
8	positive	0.0497770957	2.502536847538E-01	-8.960109092714E-01	-1.169581913780E+00	3.699715631681E+00	-4.417469798600E+00	1.670002785350E+00	-3.241976198061E-01	3.479090342535E-02	-1.962499282010E-03	4.548253579367E-05
8	negative	0.0010943413	2.407141370785E-04	-9.216758120801E-01	3.655967490215E-01	-1.921219553681E-02	2.229500471560E-02	3.609857795242E-03	2.699148728238E-04	1.099367968637E-05	2.349226177047E-07	2.055730744217E-09
10	positive	0.0345873947	1.208250749891E-01	-8.276540875408E-01	-1.858625118108E+00	5.085954446688E+00	-5.468545449424E+00	2.006013584193E+00	-3.463941090521E-01	2.026307897262E-02	2.449177298723E-03	-5.065104251284E-04	3.342083687081E-05	-8.031790324266E-07
10	negative	0.0002028916	8.274162344402E-06	-9.269361932901E-01	3.360535738610E-01	-5.679548724452E-02	2.106369705115E-03	-2.126474382947E-03	-6.891396624653E-04	-8.819646645259E-05	-6.187187224261E-06	-2.513703937066E-07	-5.573513135550E-09	-5.237141343655E-11
12	positive	0.0113749559	1.306835172395E-02	-9.380154167268E-01	4.952676580877E-01	-4.161544723890E+00	9.457005908286E+00	-1.078628471850E+01	6.238954602105E+00	-2.155880919756E+00	4.802305576908E-01	-7.098405169945E-02	6.939022459550E-03	-4.318722143659E-04	1.551686028178E-05	-2.451490742457E-07
12	negative	0.0000713799	1.024114146989E-06	-9.274963097414E-01	3.318135248159E-01	-6.375799834654E-02	-2.637462042151E-03	-3.812773207571E-03	-1.036305409935E-03	-1.312649329637E-04	-9.335728055060E-06	-3.656202964505E-07	-5.296472652262E-09	1.430588307404E-10	6.947508669206E-12	8.255961290240E-14
14	positive	0.0087260928	7.690613873046E-03	-9.438716520557E-01	6.153559945816E-01	-4.518287650693E+00	9.594303631101E+00	-1.015664880965E+01	5.196637867884E+00	-1.376389663301E+00	1.321415020921E-01	3.051380803135E-02	-1.311152616810E-02	2.276734261494E-03	-2.312288031355E-04	1.425781329607E-05	-4.968136545638E-07	7.536702287627E-09
14	negative	0.0000575528	6.657764829160E-07	-9.273423972712E-01	3.336414484616E-01	-5.926037932468E-02	2.005828788758E-03	-1.236005202214E-03	-1.661611933219E-04	6.063851442012E-05	1.947791281502E-05	2.646449299842E-06	2.155147630982E-07	1.140852077959E-08	3.966623273974E-10	8.735724648315E-12	1.100572402176E-13	5.989761632118E-16
16	positive	0.0028584901	8.252616590776E-04	-9.254584909944E-01	-4.305200807300E-01	3.290894589724E+00	-1.368379527801E+01	2.685191277922E+01	-3.082953075867E+01	2.186517934196E+01	-1.030447999499E+01	3.394995574683E+00	-8.060727805620E-01	1.400095509285E-01	-1.783222854367E-02	1.648090378395E-03	-1.076151990248E-04	4.708015886536E-06	-1.238404554384E-07	1.480839555777E-09
16	negative	0.0000484672	4.721632021118E-07	-9.274722696037E-01	3.312312659183E-01	-6.779975729070E-02	-1.060322051618E-02	-1.130240950602E-02	-5.116771270039E-03	-1.558098471107E-03	-3.496532130512E-04	-5.785918954268E-05	-7.041645898556E-06	-6.304919312453E-07	-4.139562476798E-08	-1.968526928414E-09	-6.598337316905E-11	-1.478482712174E-12	-1.987794270496E-14	-1.212740473713E-16
