Order	Fit Range	RMSE	Covariance	Coefficients
2	positive	0.1228665282	1.524714557883E+00	-9.292675110691E-01	-5.395183712419E-01	-6.600494895882E-02
2	negative	0.0805639049	1.304599096339E+00	-9.934949726061E-01	3.016764749341E-01	-1.116070175134E-02
4	positive	0.0119369996	1.439168798662E-02	-1.227716159474E+00	-1.777094482023E-01	-1.541887157073E-01	5.336257265885E-03	4.736635298364E-05
4	negative	0.0049284203	4.882154722616E-03	-1.208024063404E+00	1.679398130629E-01	-2.876305947801E-02	-6.709927253626E-04	-3.681263483695E-06
6	positive	0.0007818880	6.174623002892E-05	-1.186747300533E+00	-3.209675159525E-01	-4.045891048512E-02	-3.029866662406E-02	5.210090061243E-03	-3.436922755446E-04	8.370126351226E-06
6	negative	0.0001526399	4.683084677565E-06	-1.188990585452E+00	2.004568548796E-01	-1.574511457098E-02	1.409545694660E-03	1.515607279085E-04	5.387982905574E-06	6.970597223657E-08
8	positive	0.0000904126	8.256188832319E-07	-1.189914664882E+00	-2.975201818935E-01	-7.854975457380E-02	-4.775658845487E-03	-3.519288394206E-03	1.315464684289E-03	-1.690334632588E-04	9.986133087993E-06	-2.302439927302E-07
8	negative	0.0000978990	1.926426233611E-06	-1.189495687858E+00	1.985796660696E-01	-1.735656844366E-02	8.341845177848E-04	4.654584907053E-05	-5.258832725441E-06	-5.368624538929E-07	-1.816879493180E-08	-2.226061562017E-10
10	positive	0.0000632892	4.045581352874E-07	-1.189893600618E+00	-2.982185565361E-01	-7.575866306511E-02	-8.840630502417E-03	-6.021132651449E-04	1.350503365327E-04	1.180830509657E-04	-3.283607398615E-05	3.601825963241E-06	-1.887829166785E-07	3.934423274214E-09
10	negative	0.0000954973	1.833065430833E-06	-1.189464635908E+00	1.988222303109E-01	-1.696695023324E-02	1.087033208215E-03	1.309244646796E-04	1.097944375909E-05	1.367095185989E-06	1.199254677457E-07	5.823538154072E-09	1.463665613750E-10	1.503859634547E-12
12	positive	0.0000601331	3.652146187443E-07	-1.189849515711E+00	-2.990358093938E-01	-7.291721472979E-02	-1.284853599650E-02	2.336144418702E-03	-1.118720571870E-03	4.455182033481E-04	-8.531467211202E-05	8.425929463162E-06	-3.700893179024E-07	-3.298816323482E-09	9.416956124574E-10	-2.586393576441E-11
12	negative	0.0000945445	1.796670223672E-06	-1.189407517509E+00	1.992923213299E-01	-1.612337851023E-02	1.725720382077E-03	3.896576675585E-04	7.404820488185E-05	1.122849847754E-05	1.142127803473E-06	7.677812574806E-08	3.403918326649E-09	9.627835071371E-11	1.579764784020E-12	1.146664644314E-14
14	positive	0.0000594245	3.566582088700E-07	-1.189875455905E+00	-2.981130073658E-01	-7.811112502419E-02	-1.006122772033E-03	-1.205377464696E-02	9.513249321072E-03	-4.699562424177E-03	1.618728232469E-03	-3.874144246379E-04	6.473815488374E-05	-7.549498072822E-06	6.036897803307E-07	-3.160448537497E-08	9.767487556773E-10	-1.351869257153E-11
14	negative	0.0000938310	1.769656257258E-06	-1.189455071426E+00	1.986559256887E-01	-1.785693858128E-02	-2.544728396333E-04	-8.290065685469E-04	-3.840369210080E-04	-1.017819335342E-04	-1.795650878047E-05	-2.187814482006E-06	-1.867343550902E-07	-1.115135999567E-08	-4.568336283787E-10	-1.223931436394E-11	-1.932177115863E-13	-1.363099076231E-15
16	positive	0.0000574753	3.336446286595E-07	-1.189908677412E+00	-2.961449115697E-01	-9.315070498683E-02	4.480537604701E-02	-8.644866667632E-02	8.347454703741E-02	-5.342662038221E-02	2.396343071393E-02	-7.743462216136E-03	1.835247614725E-03	-3.216121489150E-04	4.159245715117E-05	-3.917603092074E-06	2.612011847736E-07	-1.167728537467E-08	3.139045931686E-10	-3.834506269088E-12
16	negative	0.0000885000	1.574282405487E-06	-1.189584727798E+00	1.962417704749E-01	-2.643178523917E-02	-1.294549401995E-02	-1.098369235248E-02	-5.389019344344E-03	-1.741804695879E-03	-3.927260393313E-04	-6.374392189260E-05	-7.584769438593E-06	-6.668059557237E-07	-4.322744035405E-08	-2.039642364385E-09	-6.808943722489E-11	-1.523580161883E-12	-2.049457705154E-14	-1.252578242747E-16
