Order	Fit Range	RMSE	Covariance	Coefficients
2	positive	1.1663787205	1.374043712864E+02	2.213823763463E+00	-3.494611705335E+00	-2.563470975034E-01
2	negative	1.4188875782	4.046616338923E+02	1.448542084033E+00	8.646479872472E-01	-9.836628802327E-02
4	positive	0.1392182108	1.957552732311E+00	-1.566318967240E+00	2.074844577300E+00	-2.109535855983E+00	2.140989377166E-01	-7.903958727203E-03
4	negative	0.4062228508	3.316841790215E+01	-2.371012132309E+00	-1.598149295045E+00	-4.423248947677E-01	-1.499491485221E-02	-1.542300422918E-04
6	positive	0.0907778943	8.323032362507E-01	-1.293771759313E+00	7.549303309029E-01	-7.150170960599E-01	-3.612976398888E-01	1.021682620695E-01	-9.820766202736E-03	3.305672713331E-04
6	negative	0.1174326347	2.771875162947E+00	-6.773526884013E-01	1.488441590985E+00	8.845513012813E-01	2.149520825629E-01	1.868838332554E-02	7.302414745663E-04	1.078922232546E-05
8	positive	0.0256858880	6.663624912357E-02	-9.746698887402E-01	-1.473851003569E+00	2.706286290052E+00	-2.519438503486E+00	7.933944299033E-01	-1.320528171540E-01	1.239433476428E-02	-6.207735707942E-04	1.292722494883E-05
8	negative	0.0643929308	8.334363568017E-01	-1.055839045377E+00	3.695527648531E-02	-3.933422624965E-01	-2.512678887661E-01	-6.802033513922E-02	-8.207345567947E-03	-5.059451490863E-04	-1.568301029619E-05	-1.944407565624E-07
10	positive	0.0121698271	1.495857379265E-02	-1.058470252349E+00	-3.378000211571E-01	-4.100732013545E-01	1.011506737524E+00	-1.305021995836E+00	5.985992555926E-01	-1.445767266911E-01	2.045334571862E-02	-1.709270790874E-03	7.835810992776E-05	-1.522008849675E-06
10	negative	0.0383437116	2.955182838943E-01	-1.164862710291E+00	-4.348565370866E-01	-8.265533396505E-01	-3.942159571400E-01	-8.280573704602E-02	-6.287759415145E-03	1.552545241919E-04	5.767025458904E-05	3.929907362933E-06	1.183105894672E-07	1.376567676071E-09
12	positive	0.0058177683	3.418489220167E-03	-1.085816183662E+00	1.889659375121E-01	-2.309990253285E+00	3.812482650787E+00	-3.477537005562E+00	1.598145074110E+00	-4.349868532364E-01	7.530082528442E-02	-8.460380363980E-03	6.060583297410E-04	-2.594441568111E-05	5.662613120663E-07	-3.901624889719E-09
12	negative	0.0164538522	5.441657941391E-02	-1.015244873868E+00	8.021047797707E-01	1.402923810299E+00	1.301746937116E+00	6.077902330692E-01	1.630174538317E-01	2.679724811352E-02	2.839185026076E-03	1.985809781254E-04	9.138285484246E-06	2.666338775291E-07	4.477261372851E-09	3.298366198327E-11
14	positive	0.0017316927	3.028746720503E-04	-1.070091680620E+00	-3.604089631636E-01	7.459061881391E-01	-3.078427150330E+00	4.805358897324E+00	-4.456181527693E+00	2.463644581010E+00	-8.745189647630E-01	2.098362121581E-01	-3.491882161068E-02	4.047825307342E-03	-3.213747664252E-04	1.668415919350E-05	-5.107015634857E-07	6.993420114408E-09
14	negative	0.0066566433	8.906492124648E-03	-1.084226320522E+00	-8.506427802966E-02	-9.389837684984E-01	-1.296635666150E+00	-9.477342028987E-01	-4.064111015397E-01	-1.101487049135E-01	-1.974298822583E-02	-2.416287920907E-03	-2.054294111425E-04	-1.214726383479E-05	-4.906929058592E-07	-1.292665606913E-08	-2.002970702415E-10	-1.385499510849E-12
16	positive	0.0012111227	1.481483478479E-04	-1.069590648089E+00	-3.690916906510E-01	7.267266110861E-01	-2.782139147226E+00	3.953476716537E+00	-3.251082516120E+00	1.439324635635E+00	-3.014428167644E-01	-1.215046486509E-02	2.637214046397E-02	-8.191717260839E-03	1.451079806224E-03	-1.676394861892E-04	1.290257324327E-05	-6.412956610956E-07	1.869116946538E-08	-2.432416885120E-10
16	negative	0.0043871923	3.868740551711E-03	-1.074526234652E+00	1.230698023822E-01	-1.261806038394E-01	7.837962004978E-03	1.741753839358E-01	1.839476178205E-01	9.524480045471E-02	2.985870761208E-02	6.159036685990E-03	8.755452948361E-04	8.802461989457E-05	6.323086957523E-06	3.230274508959E-07	1.147623919755E-08	2.697561447842E-10	3.774082722537E-12	2.380677987751E-14
