Order	Fit Range	RMSE	Covariance	Coefficients
2	positive	0.8000664543	6.465073946414E+01	1.516962927630E+00	-3.508094681415E+00	-1.431174432824E-01
2	negative	0.0600041620	7.237003907966E-01	-9.983295470228E-01	2.908419500190E-01	-1.069255342473E-02
4	positive	0.1158757708	1.356146619628E+00	-1.202306912799E+00	6.562630293907E-01	-1.594056338846E+00	1.774619787753E-01	-7.046789561048E-03
4	negative	0.0033641166	2.274773376400E-03	-1.153681780083E+00	1.958229588154E-01	-2.275599098823E-02	-4.177347780065E-04	-6.825373624039E-07
6	positive	0.0642578026	4.170355849521E-01	-1.371923828911E+00	1.072009498843E+00	-1.756521518959E+00	1.614351051211E-01	8.187466784106E-03	-2.219387996639E-03	9.823389043608E-05
6	negative	0.0001160221	2.705688959408E-06	-1.141114544641E+00	2.169886071341E-01	-1.442620375443E-02	8.853504025111E-04	9.389332213862E-05	3.162232111491E-06	3.879582488746E-08
8	positive	0.0128555858	1.669187461501E-02	-1.120045331540E+00	-7.629036801611E-01	1.179983696741E+00	-1.776306276886E+00	6.604999752307E-01	-1.241669908118E-01	1.291360631153E-02	-7.084135059347E-04	1.602520920840E-05
8	negative	0.0001022478	2.101375977152E-06	-1.141378273484E+00	2.160622318478E-01	-1.518323658376E-02	6.269855942085E-04	4.867115851546E-05	-1.246735503767E-06	-2.033505592241E-07	-7.007376074123E-09	-8.310997222096E-11
10	positive	0.0088668067	7.940646324637E-03	-1.117990513681E+00	-7.286532503262E-01	9.543362266299E-01	-1.384850859636E+00	3.524277746659E-01	7.876557035688E-03	-2.049721132642E-02	4.420377860862E-03	-4.531430472131E-04	2.351728872945E-05	-4.970462979002E-07
10	negative	0.0001010249	2.051410813910E-06	-1.141301576401E+00	2.165070876570E-01	-1.460053781790E-02	9.490110296173E-04	1.427652969673E-04	1.492597019682E-05	1.515787549893E-06	1.073672386914E-07	4.553815887805E-09	1.047513911953E-10	1.010901477910E-12
12	positive	0.0018881665	3.600824512131E-04	-1.146269901381E+00	-1.397149023900E-01	-1.316657930575E+00	2.213670244506E+00	-2.674301795290E+00	1.536068801368E+00	-5.154425853345E-01	1.108423067846E-01	-1.581402066255E-02	1.494917895949E-03	-9.020056307434E-05	3.150176611879E-06	-4.849845563319E-08
12	negative	0.0001002757	2.021100320068E-06	-1.141341908417E+00	2.161175519858E-01	-1.540021019992E-02	2.613718550838E-04	-1.724714108289E-04	-7.186742038808E-05	-1.380199075418E-05	-1.685384254669E-06	-1.361339063858E-07	-7.214465339988E-09	-2.411188157430E-10	-4.610751731103E-12	-3.847193377738E-14
14	positive	0.0013281374	1.781588366109E-04	-1.144288662642E+00	-2.233111545026E-01	-7.987073851196E-01	9.322270544222E-01	-9.988214263241E-01	2.123683264580E-01	1.660152139299E-01	-1.282204352504E-01	4.278646840620E-02	-8.642556302365E-03	1.141933548554E-03	-9.978365880451E-05	5.578506431391E-06	-1.812150070182E-07	2.606282499815E-09
14	negative	0.0000924482	1.717880524484E-06	-1.141517754455E+00	2.138335415446E-01	-2.147799382866E-02	-6.533433474410E-03	-4.270265944335E-03	-1.582779278599E-03	-3.797454185605E-04	-6.244844366364E-05	-7.220173698726E-06	-5.924130334160E-07	-3.432175003432E-08	-1.372871536831E-09	-3.607791894535E-11	-5.605155971047E-13	-3.901267321266E-15
16	positive	0.0003336269	1.124195306331E-05	-1.141564850111E+00	-3.732654000040E-01	3.007283230833E-01	-2.287491045135E+00	4.028375017209E+00	-4.590929274811E+00	3.205351771559E+00	-1.465812513380E+00	4.650263773779E-01	-1.059993275707E-01	1.766869750487E-02	-2.161608959757E-03	1.922059972587E-04	-1.209726715070E-05	5.111286075124E-07	-1.300995384023E-08	1.508176141070E-10
16	negative	0.0000755219	1.146418169483E-06	-1.141743024580E+00	2.096884336942E-01	-3.606919187257E-02	-2.794686699696E-02	-2.126408759042E-02	-9.891551347962E-03	-3.080932110300E-03	-6.749299416908E-04	-1.070529427415E-04	-1.250039302232E-05	-1.081838482805E-06	-6.920543149655E-08	-3.228213072234E-09	-1.066996218650E-10	-2.366741293141E-12	-3.159096500917E-14	-1.917486965143E-16
