{
    "AutoloadClasses": {
        "COsMeetings": "includes/COsMeetings.php"
    },
    "ExtensionMessagesFiles": {
        "COsMeetingsMagic": "i18n/COsMeetings.i18n.php"
    },
    "Hooks": {
        "ParserFirstCallInit": "COsMeetings::onParserFirstCallInit"
    },
    "author": "support@ch.cam.ac.uk",
    "description": "Extension function for performing calculations we need for COsMeetings",
    "license-name": "GPL-2.0-or-later",
    "manifest_version": 1,
    "name": "COsMeetings",
    "type": "parserhook",
    "url": "https://gitlab.developers.cam.ac.uk/ch/co/mediawiki/cosmeetings",
    "version": "1.0"
}
