nw_pcp_id,Metered MPAN ,Eastings,Northings,Exchange
{AAAAA}{BAAAA},30000,562362,322593,Exchange 01
{AAAAA}{BAAAB},30001,563513,321750,Exchange 01
{AAAAA}{BAAAC},30002,562771,320337,Exchange 01
{AAAAA}{BAAAD},30003,562393,321002,Exchange 01
{AAAAA}{BAAAE},30004,562443,321400,Exchange 01
{AAAAA}{BAAAF},30005,561716,322848,Exchange 01
{AAAAA}{BAAAG},30006,563138,321524,Exchange 01
{AAAAA}{BAAAH},30007,562075,319856,Exchange 01
{AAAAA}{BAAAI},30008,561440,321123,Exchange 01
{AAAAA}{BAAAJ},30009,560759,321487,Exchange 01
