{
  "CPDs": [
    {
      "variable": "Flood depth",
      "variable_card": 3,
      "values": [[0.98],[0.01], [0.01]],
      "state_names": {
        "Flood depth": ["Low","Medium", "High"]
      }
      },
     {
      "variable": "Failure",
      "variable_card": 2,
       "evidence": ["Flood depth"],
       "evidence_card": [3],
      "values": [[0.95,0.6, 0.05], [0.05,0.4, 0.95]],
      "state_names": {
        "Flood depth": ["Low","Medium", "High"],
        "Failure": ["Active","Failed"]
      }
      }

  ],
  "connections": [
    ["Flood depth", "Failure"]
  ],
  "binning": { "Flood depth": [0.1, 0.6] }
}
