Source,Type,Target,Relation,Domain,Range,Quantifier,Comment,Defined By,Label
OntoUKPN,TBox,http://theworldavatar.com/ontology/ontocredo/ontoukpn.owl,https://www.w3.org/2007/05/powder-s#hasIRI,,,,,,
OntoUKPN,TBox,1,http://www.w3.org/2002/07/owl#versionInfo,,,,,,
OntoUKPN,TBox,OntoUKPN is an ontology developed for representing assets for UK Power Network,http://www.w3.org/2000/01/rdf-schema#comment,,,,,,
OntoUKPN,TBox,http://theworldavatar.com/ontology/ontocredo/ontocredo.owl,http://www.w3.org/2002/07/owl#imports,,,,,,
PowerLineComponent,Class,http://theworldavatar.com/ontology/ontocredo/ontocredo.owl#Asset,IS-A,,,,Generic class for all power line transmission components.,http://theworldavatar.com/ontology/ontocredo/ontoukpn.owl,Power line component
SubStation,Class,http://theworldavatar.com/ontology/ontocredo/ontocredo.owl#Site,IS-A,,,,Generic power network substation.,http://theworldavatar.com/ontology/ontocredo/ontoukpn.owl,Sub-station
SubStation,Class,PowerLineComponent,IS-A,,,,Generic power network substation.,http://theworldavatar.com/ontology/ontocredo/ontoukpn.owl,Sub-station
PrimarySubStation,Class,SubStation,IS-A,,,,Primary substations are the interconnection between high voltage and medium voltage.,http://theworldavatar.com/ontology/ontocredo/ontoukpn.owl,Primary sub-station
SecondarySubStation,Class,SubStation,IS-A,,,,Secondary substations are the interconnection between medium and low voltage.,http://theworldavatar.com/ontology/ontocredo/ontoukpn.owl,Secondary sub-station
Switch,Class,PowerLineComponent,IS-A,,,,Switch device.,http://theworldavatar.com/ontology/ontocredo/ontoukpn.owl,Switch
Cable,Class,PowerLineComponent,IS-A,,,,"Power lines are used to transmit electrical power. Power lines can operate at low voltage (LV), medium voltage (MV), high voltage (HV) or extra high voltage (EHV).",http://theworldavatar.com/ontology/ontocredo/ontoukpn.owl,Power line
Joint,Class,PowerLineComponent,IS-A,,,,Joints are required to connect power lines.,http://theworldavatar.com/ontology/ontocredo/ontoukpn.owl,Joint between power lines
Duct,Class,PowerLineComponent,IS-A,,,,Ducts are  used to house some underground power lines.,http://theworldavatar.com/ontology/ontocredo/ontoukpn.owl,Duct
LinkBox,Class,PowerLineComponent,IS-A,,,,"Link boxes provide sealed, weatherproof enclosures to protect the connecting links used for earthing or cross-bonding of the metallic sheaths of cables.",http://theworldavatar.com/ontology/ontocredo/ontoukpn.owl,Link box
Transformer,Class,PowerLineComponent,IS-A,,,,"Transformers are used to change the voltage between the high, medium and low voltage parts of the electrical transmission system.",http://theworldavatar.com/ontology/ontocredo/ontoukpn.owl,Transformer
DualTransformer,Class,Transformer,IS-A,,,,"Transformers are used to change the voltage between the high, medium and low voltage parts of the electrical transmission system. Dual transformers are capable of producing two output voltages.",http://theworldavatar.com/ontology/ontocredo/ontoukpn.owl,Dual transformer
SingleTransformer,Class,Transformer,IS-A,,,,"Transformers are used to change the voltage between the high, medium and low voltage parts of the electrical transmission system. Single transformers are capable of producing only one output voltage.",http://theworldavatar.com/ontology/ontocredo/ontoukpn.owl,Single transformer
ElectricalEndpoint,Class,http://theworldavatar.com/ontology/ontocredo/ontocredo.owl#AssetProperty,IS-A,,,,An electrical endpoint.,http://theworldavatar.com/ontology/ontocredo/ontoukpn.owl,Endpoint
VoltageLevel,Class,,,,,,Supported voltage level(s) of a power transmission line component.,http://theworldavatar.com/ontology/ontocredo/ontoukpn.owl,
HeightAboveSeaLevel,Class,http://theworldavatar.com/ontology/ontocredo/ontocredo.owl#Elevation,IS-A,,,,Height above the sea level measured as the vertical distance between the two geographical points.,http://theworldavatar.com/ontology/ontocredo/ontoukpn.owl,
http://www.ontology-of-units-of-measure.org/page/om-2/Height,Class,,,,,,Vertical distance between the two points.,http://www.ontology-of-units-of-measure.org/page/om-2,
http://www.ontology-of-units-of-measure.org/page/om-2/Measure,Class,,,,,,"A measure combines a number to a unit of measure. For example, ""3 m"" is a measure.",http://www.ontology-of-units-of-measure.org/page/om-2,
http://www.ontology-of-units-of-measure.org/page/om-2/Unit,Class,,,,,,"A unit of measure is a definite magnitude of a quantity, defined and adopted by convention or by law. It is used as a standard for measurement of the same quantity, where any other value of the quantity can be expressed as a simple multiple of the unit. For example, length is a quantity; the metre is a unit of length that represents a definite predetermined length. When we say 10 metre (or 10 m), we actually mean 10 times the definite predetermined length called ""metre"".",http://www.ontology-of-units-of-measure.org/page/om-2,
http://theworldavatar.com/ontology/ontocredo/ontobt.owl#PhoneEndpoint,Class,,,,,,A phone end point.,http://theworldavatar.com/ontology/ontocredo/ontobt.owl,
PowerState,Class,http://theworldavatar.com/ontology/ontocredo/ontocredo.owl#State,IS-A,,,,Indicates whether power is available.,http://theworldavatar.com/ontology/ontocredo/ontoukpn.owl,Power state
http://theworldavatar.com/ontology/ontocredo/ontobt.owl#TelephoneState,Class,http://theworldavatar.com/ontology/ontocredo/ontocredo.owl#State,IS-A,,,,Indicates whether the telephone service is available.,http://theworldavatar.com/ontology/ontocredo/ontobt.owl,
http://theworldavatar.com/ontology/ontocredo/ontobt.owl#hasTelephoneState,Object Property,http://theworldavatar.com/ontology/ontocredo/ontocredo.owl#hasState,IS-A,http://theworldavatar.com/ontology/ontocredo/ontocredo.owl#Asset,http://theworldavatar.com/ontology/ontocredo/ontobt.owl#TelephoneState,,Defines a state of the asset's telephone connection.,http://theworldavatar.com/ontology/ontocredo/ontobt.owl,
hasPowerState,Object Property,http://theworldavatar.com/ontology/ontocredo/ontocredo.owl#hasState,IS-A,http://theworldavatar.com/ontology/ontocredo/ontocredo.owl#Asset,PowerState,,Defines a state of the asset's power connection.,http://theworldavatar.com/ontology/ontocredo/ontoukpn.owl,Power state
suppliesPowerTo,Object Property,http://theworldavatar.com/ontology/ontocredo/ontocredo.owl#supplies,IS-A,Substation,http://theworldavatar.com/ontology/ontocredo/ontocredo.owl#Asset,,Functional relation that alows to link the UKPN sites into a power supply chain.,http://theworldavatar.com/ontology/ontocredo/ontoukpn.owl,Supplies power to
suppliesPowerTo,Object Property,powerSuppliedBy,INVERSE-OF,,,,,,
powerSuppliedBy,Object Property,suppliesPowerTo,INVERSE-OF,Substation,http://theworldavatar.com/ontology/ontocredo/ontocredo.owl#Asset,,Functional relation that alows to link the UKPN sites into a power supply chain.,http://theworldavatar.com/ontology/ontocredo/ontoukpn.owl,Power supplied by
hasElectricalEndpoint,Object Property,http://theworldavatar.com/ontology/ontocredo/ontocredo.owl#hasProperty,IS-A,http://theworldavatar.com/ontology/ontocredo/ontocredo.owl#Asset,ElectricalEndpoint,only,Specifies a sub-station electrical endpoint.,http://theworldavatar.com/ontology/ontocredo/ontoukpn.owl,
hasOperationalVoltageLevel,Object Property,,,PowerLineComponent,VoltageLevel,only,Specifies a voltage level that a given power line component operates at.,http://theworldavatar.com/ontology/ontocredo/ontoukpn.owl,
hasIncomingVoltageLevel,Object Property,,,PowerLineComponent,VoltageLevel,only,Specifies an incoming voltage level.,http://theworldavatar.com/ontology/ontocredo/ontoukpn.owl,
hasOutgoingVoltageLevel,Object Property,,,PowerLineComponent,VoltageLevel,only,Specifies an outgoing voltage level.,http://theworldavatar.com/ontology/ontocredo/ontoukpn.owl,
http://theworldavatar.com/ontology/ontocredo/ontobt.owl#hasPhoneEndpoint,Object Property,,,SubStation,http://theworldavatar.com/ontology/ontocredo/ontobt.owl#PhoneEndpoint,only,Specifies a sub-station BT endpoint.,http://theworldavatar.com/ontology/ontocredo/ontobt.owl,
hasHeightAboveSeaLevel,Object Property,,,SubStation,HeightAboveSeaLevel,only,Specifies a sub-station height above sea level.,http://theworldavatar.com/ontology/ontocredo/ontoukpn.owl,
http://www.ontology-of-units-of-measure.org/page/om-2/hasPhenomenon,Object Property,,,http://www.ontology-of-units-of-measure.org/page/om-2/Height,HeightAboveSeaLevel,only,Specifies a relation between the height measure and height above sea level concepts.,http://www.ontology-of-units-of-measure.org/page/om-2,
http://www.ontology-of-units-of-measure.org/page/om-2/hasHeight,Object Property,,,HeightAboveSeaLevel,http://www.ontology-of-units-of-measure.org/page/om-2/Height,only,Specifies a relation between the height above sea level and height measure concepts.,http://www.ontology-of-units-of-measure.org/page/om-2,
http://www.ontology-of-units-of-measure.org/page/om-2/hasUnit,Object Property,,,http://www.ontology-of-units-of-measure.org/page/om-2/Measure,http://www.ontology-of-units-of-measure.org/page/om-2/Unit,only,Specifies a relation between the measure and unit concepts.,http://www.ontology-of-units-of-measure.org/page/om-2,
hasMPAN,Data Property,http://theworldavatar.com/ontology/ontocredo/ontocredo.owl#hasValue,IS-A,ElectricalEndpoint,String,,Electrical endpoint MPAN.,http://theworldavatar.com/ontology/ontocredo/ontoukpn.owl,MPAN
http://www.ontology-of-units-of-measure.org/page/om-2/hasNumericalValue,Data Property,,,http://www.ontology-of-units-of-measure.org/page/om-2/Measure,Float,,Numerical value of measure.,http://www.ontology-of-units-of-measure.org/page/om-2,
http://theworldavatar.com/ontology/ontocredo/ontobt.owl#hasPhoneNumber,Data Property,,,http://theworldavatar.com/ontology/ontocredo/ontobt.owl#PhoneEndpoint,String,,Value of the BT phone number.,http://theworldavatar.com/ontology/ontocredo/ontobt.owl,